robotpkg/wip/py-hla bulk build results

py27-hla-1.1.1r1 (category architecture or summary)

Platform Status Date Time Log files
Start Total brokenbrokenbybulk
CentOS-7-x86_64OK2019/03/2122:39:4000:00:25
Debian-8-x86_64OK2019/03/2122:04:0400:00:13
Debian-9-x86_64?---
Fedora-27-x86_64OK2019/03/2123:57:0800:00:20
Fedora-28-x86_64Broken2019/04/1301:48:0100:00:07
Required robotpkg package certi>=3.4.0: BROKEN
View
NetBSD-8.0-x86_64Broken2019/04/1301:55:2300:00:02
Required robotpkg package certi>=3.4.0: BROKEN
View
Ubuntu-14.04-x86_64Broken2019/04/1301:22:0600:00:01
make: *** [depends] Error 2
View
Ubuntu-16.04-x86_64Broken2019/04/1301:22:3200:00:06
Required robotpkg package certi>=3.4.0: BROKEN
View
Ubuntu-18.04-x86_64Broken2019/04/1301:24:3600:00:02
Required robotpkg package certi>=3.4.0: BROKEN
View
Ubuntu-19.04-x86_64?---

py34-hla-1.1.1r1 (category architecture or summary)

Platform Status Date Time Log files
Start Total brokenbulkcbbh
CentOS-7-x86_64OK2019/03/2122:39:0800:00:31
Debian-8-x86_64OK2019/03/2122:04:1800:00:19
Debian-9-x86_64?---
Fedora-27-x86_64N/A2019/03/2123:57:2900:00:00ViewView
Fedora-28-x86_64N/A2019/03/2203:47:2100:00:01ViewView
NetBSD-8.0-x86_64N/A2019/03/2200:53:4400:00:00ViewView
Ubuntu-14.04-x86_64Broken2019/04/1301:22:0800:00:02
make: *** [depends] Error 2
View
Ubuntu-16.04-x86_64N/A2019/03/2201:23:5400:00:00ViewView
Ubuntu-18.04-x86_64N/A2019/03/2123:38:0100:00:02ViewView
Ubuntu-19.04-x86_64?---

py35-hla-1.1.1r1 (category architecture or summary)

Platform Status Date Time Log files
Start Total brokenbrokenbybulkcbbh
CentOS-7-x86_64N/A2019/03/2122:40:0600:00:01ViewView
Debian-8-x86_64N/A2019/03/2122:04:3800:00:00ViewView
Debian-9-x86_64?---
Fedora-27-x86_64N/A2019/03/2123:57:2900:00:01ViewView
Fedora-28-x86_64N/A2019/03/2203:47:2200:00:00ViewView
NetBSD-8.0-x86_64N/A2019/03/2200:53:4400:00:01ViewView
Ubuntu-14.04-x86_64N/A2019/03/2200:08:4200:00:01ViewView
Ubuntu-16.04-x86_64Broken2019/04/1301:22:3900:00:03
Required robotpkg package certi>=3.4.0: BROKEN
View
Ubuntu-18.04-x86_64N/A2019/03/2123:38:0300:00:00ViewView
Ubuntu-19.04-x86_64?---

py36-hla-1.1.1r1 (category architecture or summary)

Platform Status Date Time Log files
Start Total brokenbrokenbybuildbulkcbbhcmakeconfigureextractinstall
CentOS-7-x86_64N/A2019/03/2122:40:0800:00:01ViewView
Debian-8-x86_64N/A2019/03/2122:04:3900:00:00ViewView
Debian-9-x86_64?---
Fedora-27-x86_64Broken2019/04/1301:36:3100:00:34
make: *** [package] Error 2
ViewViewViewViewViewView
Fedora-28-x86_64Broken2019/04/1301:47:5000:00:10
Required robotpkg package certi>=3.4.0: BROKEN
View
NetBSD-8.0-x86_64Broken2019/04/1301:55:1900:00:04
Required robotpkg package certi>=3.4.0: BROKEN
View
Ubuntu-14.04-x86_64N/A2019/03/2200:08:4300:00:00ViewView
Ubuntu-16.04-x86_64N/A2019/03/2201:23:5700:00:00ViewView
Ubuntu-18.04-x86_64Broken2019/04/1301:24:3900:00:02
Required robotpkg package certi>=3.4.0: BROKEN
View
Ubuntu-19.04-x86_64?---

py37-hla-1.1.1r1 (category architecture or summary)

Platform Status Date Time Log files
Start Total bulkcbbh
CentOS-7-x86_64N/A2019/03/2122:40:0900:00:01ViewView
Debian-8-x86_64N/A2019/03/2122:04:4000:00:00ViewView
Debian-9-x86_64?---
Fedora-27-x86_64N/A2019/03/2123:57:3000:00:00ViewView
Fedora-28-x86_64N/A2019/03/2203:47:2200:00:00ViewView
NetBSD-8.0-x86_64N/A2019/03/2200:53:4500:00:01ViewView
Ubuntu-14.04-x86_64N/A2019/03/2200:08:4300:00:01ViewView
Ubuntu-16.04-x86_64N/A2019/03/2201:23:5800:00:00ViewView
Ubuntu-18.04-x86_64N/A2019/03/2123:38:0700:00:00ViewView
Ubuntu-19.04-x86_64?---