robotpkg/wip/py-gurobi bulk build results

py27-gurobi-9.5.2 (category optimization or summary)

Platform Status Date Time Log files
Start Total brokenbuildbulkcbbhconfigureextractinstall
Debian-11-x86_64N/A2026/09/1802:35:4600:00:00ViewView
Debian-12-x86_64N/A2026/09/1806:46:0600:00:00ViewView
Debian-13-x86_64N/A2026/09/1804:37:0200:00:00ViewView
Fedora-42-x86_64N/A2026/09/1808:56:1000:00:00ViewView
Fedora-44-x86_64N/A2026/09/1807:39:1600:00:01ViewView
NetBSD-11-x86_64N/A2026/09/1812:09:5600:00:01ViewView
Rocky-10-x86_64N/A2026/09/1804:32:3300:00:00ViewView
Rocky-8-x86_64N/A2026/09/1800:51:1500:00:00ViewView
Ubuntu-20.04-x86_64Broken2026/09/3020:55:2400:00:11
make: *** [package] Error 2
ViewViewViewViewView
Ubuntu-22.04-x86_64Broken2026/09/3021:13:2200:00:09
make: *** [package] Error 2
ViewViewViewViewView
Ubuntu-24.04-x86_64N/A2026/09/1806:08:4700:00:00ViewView
Ubuntu-26.04-x86_64N/A2026/09/1804:59:2800:00:00ViewView

py310-gurobi-9.5.2 (category optimization or summary)

Platform Status Date Time Log files
Start Total brokenbuildbulkcbbhconfigureextractinstall
Debian-11-x86_64N/A2026/09/1802:35:4600:00:00ViewView
Debian-12-x86_64N/A2026/09/1806:46:0700:00:00ViewView
Debian-13-x86_64N/A2026/09/1804:37:0200:00:01ViewView
Fedora-42-x86_64N/A2026/09/1808:56:1100:00:00ViewView
Fedora-44-x86_64N/A2026/09/1807:39:1700:00:00ViewView
NetBSD-11-x86_64N/A2026/09/1812:09:5700:00:01ViewView
Rocky-10-x86_64N/A2026/09/1804:32:3400:00:00ViewView
Rocky-8-x86_64N/A2026/09/1800:51:1600:00:00ViewView
Ubuntu-20.04-x86_64N/A2026/09/2117:15:0000:00:00ViewView
Ubuntu-22.04-x86_64Broken2026/09/3021:13:3100:00:08
make: *** [package] Error 2
ViewViewViewViewView
Ubuntu-24.04-x86_64N/A2026/09/1806:08:4700:00:00ViewView
Ubuntu-26.04-x86_64N/A2026/09/1804:59:2800:00:01ViewView

py311-gurobi-9.5.2 (category optimization or summary)

Platform Status Date Time Log files
Start Total brokenbuildbulkcbbhconfigureextract
Debian-11-x86_64N/A2026/09/1802:35:4600:00:01ViewView
Debian-12-x86_64Broken2026/09/3021:03:3600:00:05
make: *** [package] Error 2
ViewViewViewView
Debian-13-x86_64N/A2026/09/1804:37:0300:00:00ViewView
Fedora-42-x86_64N/A2026/09/1808:56:1100:00:01ViewView
Fedora-44-x86_64N/A2026/09/1807:39:1800:00:00ViewView
NetBSD-11-x86_64N/A2026/09/1812:09:5800:00:01ViewView
Rocky-10-x86_64N/A2026/09/1804:32:3400:00:00ViewView
Rocky-8-x86_64N/A2026/09/1800:51:1600:00:00ViewView
Ubuntu-20.04-x86_64N/A2026/09/2117:15:0000:00:00ViewView
Ubuntu-22.04-x86_64N/A2026/09/1807:33:1600:00:00ViewView
Ubuntu-24.04-x86_64N/A2026/09/1806:08:4700:00:01ViewView
Ubuntu-26.04-x86_64N/A2026/09/1804:59:2900:00:00ViewView

py312-gurobi-9.5.2 (category optimization or summary)

Platform Status Date Time Log files
Start Total brokenbuildbulkcbbhconfigureextract
Debian-11-x86_64N/A2026/09/1802:35:4700:00:00ViewView
Debian-12-x86_64N/A2026/09/1806:46:1200:00:01ViewView
Debian-13-x86_64N/A2026/09/1804:37:0300:00:00ViewView
Fedora-42-x86_64N/A2026/09/1808:56:1200:00:01ViewView
Fedora-44-x86_64N/A2026/09/1807:39:1900:00:00ViewView
NetBSD-11-x86_64N/A2026/09/1812:09:5900:00:01ViewView
Rocky-10-x86_64Broken2026/09/3020:50:1200:00:07
make: *** [package] Error 2
ViewViewViewView
Rocky-8-x86_64N/A2026/09/1800:51:1600:00:00ViewView
Ubuntu-20.04-x86_64N/A2026/09/2117:15:0100:00:00ViewView
Ubuntu-22.04-x86_64N/A2026/09/1807:33:1700:00:00ViewView
Ubuntu-24.04-x86_64Broken2026/09/3021:08:3600:00:06
make: *** [package] Error 2
ViewViewViewView
Ubuntu-26.04-x86_64N/A2026/09/1804:59:2900:00:01ViewView

py313-gurobi-9.5.2 (category optimization or summary)

Platform Status Date Time Log files
Start Total brokenbuildbulkcbbhconfigureextract
Debian-11-x86_64N/A2026/09/1802:35:4700:00:00ViewView
Debian-12-x86_64N/A2026/09/1806:46:1300:00:00ViewView
Debian-13-x86_64Broken2026/09/3021:31:2600:00:06
make: *** [package] Error 2
ViewViewViewView
Fedora-42-x86_64Broken2026/09/3021:17:5000:00:09
make: *** [package] Error 2
ViewViewViewView
Fedora-44-x86_64N/A2026/09/1807:39:1900:00:01ViewView
NetBSD-11-x86_64Broken2026/09/3021:38:2100:00:07
/usr/pkg/bin/gmake: *** [package] Error 2
ViewViewViewView
Rocky-10-x86_64N/A2026/09/1804:32:4300:00:00ViewView
Rocky-8-x86_64N/A2026/09/1800:51:1700:00:00ViewView
Ubuntu-20.04-x86_64N/A2026/09/2117:15:0100:00:00ViewView
Ubuntu-22.04-x86_64N/A2026/09/1807:33:1700:00:01ViewView
Ubuntu-24.04-x86_64N/A2026/09/1806:08:5300:00:01ViewView
Ubuntu-26.04-x86_64N/A2026/09/1804:59:3000:00:00ViewView

py314-gurobi-9.5.2 (category optimization or summary)

Platform Status Date Time Log files
Start Total brokenbuildbulkcbbhconfigureextract
Debian-11-x86_64N/A2026/09/1802:35:4700:00:01ViewView
Debian-12-x86_64N/A2026/09/1806:46:1300:00:00ViewView
Debian-13-x86_64N/A2026/09/1804:37:0900:00:01ViewView
Fedora-42-x86_64N/A2026/09/1808:56:2100:00:01ViewView
Fedora-44-x86_64Broken2026/09/3021:05:4400:00:06
make: *** [package] Error 2
ViewViewViewView
NetBSD-11-x86_64N/A2026/09/1812:10:0900:00:00ViewView
Rocky-10-x86_64N/A2026/09/1804:32:4300:00:01ViewView
Rocky-8-x86_64N/A2026/09/1800:51:1700:00:00ViewView
Ubuntu-20.04-x86_64N/A2026/09/2117:15:0200:00:00ViewView
Ubuntu-22.04-x86_64N/A2026/09/1807:33:1800:00:01ViewView
Ubuntu-24.04-x86_64N/A2026/09/1806:08:5400:00:00ViewView
Ubuntu-26.04-x86_64Broken2026/09/3021:08:0900:00:05
make: *** [package] Error 2
ViewViewViewView

py36-gurobi-9.5.2 (category optimization or summary)

Platform Status Date Time Log files
Start Total brokenbuildbulkcbbhconfigureextract
Debian-11-x86_64N/A2026/09/1802:35:4800:00:00ViewView
Debian-12-x86_64N/A2026/09/1806:46:1400:00:00ViewView
Debian-13-x86_64N/A2026/09/1804:37:1000:00:00ViewView
Fedora-42-x86_64N/A2026/09/1808:56:2200:00:01ViewView
Fedora-44-x86_64N/A2026/09/1807:39:2800:00:00ViewView
NetBSD-11-x86_64N/A2026/09/1812:10:0900:00:01ViewView
Rocky-10-x86_64N/A2026/09/1804:32:4400:00:00ViewView
Rocky-8-x86_64Broken2026/09/3021:30:4900:00:08
make: *** [package] Error 2
ViewViewViewView
Ubuntu-20.04-x86_64N/A2026/09/2117:15:0200:00:00ViewView
Ubuntu-22.04-x86_64N/A2026/09/1807:33:1900:00:00ViewView
Ubuntu-24.04-x86_64N/A2026/09/1806:08:5400:00:00ViewView
Ubuntu-26.04-x86_64N/A2026/09/1804:59:3600:00:00ViewView

py38-gurobi-9.5.2 (category optimization or summary)

Platform Status Date Time Log files
Start Total brokenbuildbulkcbbhconfigureextractinstall
Debian-11-x86_64N/A2026/09/1802:35:4800:00:00ViewView
Debian-12-x86_64N/A2026/09/1806:46:1400:00:00ViewView
Debian-13-x86_64N/A2026/09/1804:37:1000:00:00ViewView
Fedora-42-x86_64N/A2026/09/1808:56:2300:00:00ViewView
Fedora-44-x86_64N/A2026/09/1807:39:2900:00:00ViewView
NetBSD-11-x86_64N/A2026/09/1812:10:1000:00:01ViewView
Rocky-10-x86_64N/A2026/09/1804:32:4500:00:00ViewView
Rocky-8-x86_64N/A2026/09/1800:51:2400:00:00ViewView
Ubuntu-20.04-x86_64Broken2026/09/3020:55:3600:00:11
make: *** [package] Error 2
ViewViewViewViewView
Ubuntu-22.04-x86_64N/A2026/09/1807:33:2000:00:00ViewView
Ubuntu-24.04-x86_64N/A2026/09/1806:08:5500:00:00ViewView
Ubuntu-26.04-x86_64N/A2026/09/1804:59:3700:00:00ViewView

py39-gurobi-9.5.2 (category optimization or summary)

Platform Status Date Time Log files
Start Total brokenbuildbulkcbbhconfigureextractinstall
Debian-11-x86_64Broken2026/09/3020:39:4100:00:12
make: *** [package] Error 2
ViewViewViewViewView
Debian-12-x86_64N/A2026/09/1806:46:1400:00:01ViewView
Debian-13-x86_64N/A2026/09/1804:37:1100:00:00ViewView
Fedora-42-x86_64N/A2026/09/1808:56:2400:00:00ViewView
Fedora-44-x86_64N/A2026/09/1807:39:3000:00:00ViewView
NetBSD-11-x86_64N/A2026/09/1812:10:1100:00:01ViewView
Rocky-10-x86_64N/A2026/09/1804:32:4500:00:00ViewView
Rocky-8-x86_64N/A2026/09/1800:51:2400:00:00ViewView
Ubuntu-20.04-x86_64N/A2026/09/2117:15:0900:00:01ViewView
Ubuntu-22.04-x86_64N/A2026/09/1807:33:2000:00:01ViewView
Ubuntu-24.04-x86_64N/A2026/09/1806:08:5500:00:00ViewView
Ubuntu-26.04-x86_64N/A2026/09/1804:59:3700:00:00ViewView