robotpkg/wip/py-example-adder bulk build results

py27-example-adder-4.0.1 (category wip or summary)

Platform Status Date Time Log files
Start Total bulkcbbhcbbhbysysdep
Debian-11-x86_64N/A2026/09/1802:47:5000:00:00ViewView
Debian-12-x86_64N/A2026/09/1806:57:1800:00:00ViewView
Debian-13-x86_64N/A2026/09/1804:17:1200:00:00ViewView
Fedora-42-x86_64N/A2026/09/1808:05:2700:00:01ViewView
Fedora-44-x86_64N/A2026/09/1807:52:4700:00:00ViewView
NetBSD-11-x86_64N/A2026/09/1811:50:2200:00:01ViewView
Rocky-10-x86_64N/A2026/09/1804:40:2600:00:00ViewView
Rocky-8-x86_64N/A2026/09/1800:49:2400:00:00ViewView
Ubuntu-20.04-x86_64Sysdep2026/09/3021:02:1400:00:09ViewView
boost-libs>=1.34.1
cmake>=3.22
View
Ubuntu-22.04-x86_64Sysdep2026/09/3021:27:2300:00:08ViewView
boost-libs>=1.34.1
View
Ubuntu-24.04-x86_64N/A2026/09/1806:41:5400:00:00ViewView
Ubuntu-26.04-x86_64N/A2026/09/1805:22:2800:00:01ViewView

py310-example-adder-4.0.1 (category wip or summary)

Platform Status Date Time Log files
Start Total brokenbuildbulkcbbhcmakeconfigureextractinstallplist
Debian-11-x86_64N/A2026/09/1802:47:5000:00:00ViewView
Debian-12-x86_64N/A2026/09/1806:57:1800:00:01ViewView
Debian-13-x86_64N/A2026/09/1804:17:1300:00:00ViewView
Fedora-42-x86_64N/A2026/09/1808:05:2800:00:01ViewView
Fedora-44-x86_64N/A2026/09/1807:52:4800:00:00ViewView
NetBSD-11-x86_64N/A2026/09/1811:50:2300:00:01ViewView
Rocky-10-x86_64N/A2026/09/1804:40:2700:00:00ViewView
Rocky-8-x86_64N/A2026/09/1800:49:2400:00:01ViewView
Ubuntu-20.04-x86_64N/A2026/09/2118:05:5600:00:00ViewView
Ubuntu-22.04-x86_64Broken2026/09/3021:27:3100:00:30
make: *** [package] Error 2
ViewViewViewViewViewViewView
Ubuntu-24.04-x86_64N/A2026/09/1806:41:5400:00:00ViewView
Ubuntu-26.04-x86_64N/A2026/09/1805:22:2900:00:01ViewView

py311-example-adder-4.0.1 (category wip or summary)

Platform Status Date Time Log files
Start Total brokenbuildbulkcbbhcmakeconfigureextractinstallplist
Debian-11-x86_64N/A2026/09/1802:47:5000:00:01ViewView
Debian-12-x86_64Broken2026/09/3021:12:3100:00:25
make: *** [package] Error 2
ViewViewViewViewViewViewView
Debian-13-x86_64N/A2026/09/1804:17:1300:00:00ViewView
Fedora-42-x86_64N/A2026/09/1808:05:2900:00:00ViewView
Fedora-44-x86_64N/A2026/09/1807:52:4800:00:01ViewView
NetBSD-11-x86_64N/A2026/09/1811:50:2400:00:01ViewView
Rocky-10-x86_64N/A2026/09/1804:40:2700:00:01ViewView
Rocky-8-x86_64N/A2026/09/1800:49:2500:00:00ViewView
Ubuntu-20.04-x86_64N/A2026/09/2118:05:5700:00:00ViewView
Ubuntu-22.04-x86_64N/A2026/09/1807:11:4500:00:00ViewView
Ubuntu-24.04-x86_64N/A2026/09/1806:41:5500:00:00ViewView
Ubuntu-26.04-x86_64N/A2026/09/1805:22:3000:00:00ViewView

py312-example-adder-4.0.1 (category wip or summary)

Platform Status Date Time Log files
Start Total brokenbuildbulkcbbhcmakeconfigureextractinstallplist
Debian-11-x86_64N/A2026/09/1802:47:5100:00:00ViewView
Debian-12-x86_64N/A2026/09/1806:57:3700:00:00ViewView
Debian-13-x86_64N/A2026/09/1804:17:1300:00:01ViewView
Fedora-42-x86_64N/A2026/09/1808:05:3000:00:00ViewView
Fedora-44-x86_64N/A2026/09/1807:52:4900:00:01ViewView
NetBSD-11-x86_64N/A2026/09/1811:50:2500:00:01ViewView
Rocky-10-x86_64Broken2026/09/3021:08:2200:00:23
make: *** [package] Error 2
ViewViewViewViewViewViewView
Rocky-8-x86_64N/A2026/09/1800:49:2500:00:01ViewView
Ubuntu-20.04-x86_64N/A2026/09/2118:05:5800:00:00ViewView
Ubuntu-22.04-x86_64N/A2026/09/1807:11:4500:00:00ViewView
Ubuntu-24.04-x86_64Broken2026/09/3021:09:1600:01:03
make: *** [package] Error 2
ViewViewViewViewViewViewView
Ubuntu-26.04-x86_64N/A2026/09/1805:22:3100:00:00ViewView

py313-example-adder-4.0.1 (category wip or summary)

Platform Status Date Time Log files
Start Total brokenbuildbulkcbbhcmakeconfigureextractinstallplist
Debian-11-x86_64N/A2026/09/1802:47:5100:00:00ViewView
Debian-12-x86_64N/A2026/09/1806:57:3700:00:01ViewView
Debian-13-x86_64Broken2026/09/3021:42:5000:00:16
make: *** [package] Error 2
ViewViewViewViewViewViewView
Fedora-42-x86_64Broken2026/09/3021:22:2600:00:25
make: *** [package] Error 2
ViewViewViewViewViewViewView
Fedora-44-x86_64N/A2026/09/1807:52:5000:00:00ViewView
NetBSD-11-x86_64Broken2026/09/3021:39:1400:00:12
/usr/pkg/bin/gmake: *** [package] Error 2
ViewViewViewView
Rocky-10-x86_64N/A2026/09/1804:40:4600:00:00ViewView
Rocky-8-x86_64N/A2026/09/1800:49:2600:00:00ViewView
Ubuntu-20.04-x86_64N/A2026/09/2118:05:5800:00:01ViewView
Ubuntu-22.04-x86_64N/A2026/09/1807:11:4600:00:00ViewView
Ubuntu-24.04-x86_64N/A2026/09/1806:42:1100:00:00ViewView
Ubuntu-26.04-x86_64N/A2026/09/1805:22:3100:00:01ViewView

py314-example-adder-4.0.1 (category wip or summary)

Platform Status Date Time Log files
Start Total brokenbulkcbbhcmakeconfigureextract
Debian-11-x86_64N/A2026/09/1802:47:5200:00:00ViewView
Debian-12-x86_64N/A2026/09/1806:57:3800:00:00ViewView
Debian-13-x86_64N/A2026/09/1804:17:3500:00:00ViewView
Fedora-42-x86_64N/A2026/09/1808:05:5300:00:01ViewView
Fedora-44-x86_64Broken2026/09/3020:56:5900:00:09
make: *** [package] Error 2
ViewViewViewView
NetBSD-11-x86_64N/A2026/09/1811:50:3900:00:00ViewView
Rocky-10-x86_64N/A2026/09/1804:40:4700:00:00ViewView
Rocky-8-x86_64N/A2026/09/1800:49:2700:00:00ViewView
Ubuntu-20.04-x86_64N/A2026/09/2118:05:5900:00:01ViewView
Ubuntu-22.04-x86_64N/A2026/09/1807:11:4600:00:01ViewView
Ubuntu-24.04-x86_64N/A2026/09/1806:42:1200:00:00ViewView
Ubuntu-26.04-x86_64Broken2026/09/3020:59:4000:00:06
make: *** [package] Error 2
ViewViewViewView

py36-example-adder-4.0.1 (category wip or summary)

Platform Status Date Time Log files
Start Total bulkcbbhcbbhby
Debian-11-x86_64N/A2026/09/1802:47:5200:00:00ViewView
Debian-12-x86_64N/A2026/09/1806:57:3900:00:00ViewView
Debian-13-x86_64N/A2026/09/1804:17:3500:00:00ViewView
Fedora-42-x86_64N/A2026/09/1808:05:5400:00:01ViewView
Fedora-44-x86_64N/A2026/09/1807:53:0000:00:01ViewView
NetBSD-11-x86_64N/A2026/09/1811:50:4000:00:00ViewView
Rocky-10-x86_64N/A2026/09/1804:40:4700:00:01ViewView
Rocky-8-x86_64N/A2026/09/3021:34:3200:00:04ViewView
pinocchio>=3
py36-pinocchio>=3.0.0
Ubuntu-20.04-x86_64N/A2026/09/2118:06:0000:00:00ViewView
Ubuntu-22.04-x86_64N/A2026/09/1807:11:4700:00:00ViewView
Ubuntu-24.04-x86_64N/A2026/09/1806:42:1200:00:00ViewView
Ubuntu-26.04-x86_64N/A2026/09/1805:22:3900:00:01ViewView

py38-example-adder-4.0.1 (category wip or summary)

Platform Status Date Time Log files
Start Total bulkcbbhcbbhby
Debian-11-x86_64N/A2026/09/1802:47:5200:00:01ViewView
Debian-12-x86_64N/A2026/09/1806:57:3900:00:00ViewView
Debian-13-x86_64N/A2026/09/1804:17:3600:00:00ViewView
Fedora-42-x86_64N/A2026/09/1808:05:5600:00:00ViewView
Fedora-44-x86_64N/A2026/09/1807:53:0100:00:01ViewView
NetBSD-11-x86_64N/A2026/09/1811:50:4100:00:00ViewView
Rocky-10-x86_64N/A2026/09/1804:40:4800:00:00ViewView
Rocky-8-x86_64N/A2026/09/1800:49:3200:00:00ViewView
Ubuntu-20.04-x86_64N/A2026/09/3021:02:2400:00:07ViewView
cmake>=3.22
Ubuntu-22.04-x86_64N/A2026/09/1807:11:4700:00:01ViewView
Ubuntu-24.04-x86_64N/A2026/09/1806:42:1300:00:00ViewView
Ubuntu-26.04-x86_64N/A2026/09/1805:22:4000:00:00ViewView

py39-example-adder-4.0.1 (category wip or summary)

Platform Status Date Time Log files
Start Total bulkcbbhcbbhby
Debian-11-x86_64N/A2026/09/3020:53:1900:00:04ViewView
cmake>=3.22
Debian-12-x86_64N/A2026/09/1806:57:4000:00:00ViewView
Debian-13-x86_64N/A2026/09/1804:17:3600:00:00ViewView
Fedora-42-x86_64N/A2026/09/1808:05:5600:00:01ViewView
Fedora-44-x86_64N/A2026/09/1807:53:0200:00:00ViewView
NetBSD-11-x86_64N/A2026/09/1811:50:4200:00:00ViewView
Rocky-10-x86_64N/A2026/09/1804:40:4900:00:00ViewView
Rocky-8-x86_64N/A2026/09/1800:49:3300:00:00ViewView
Ubuntu-20.04-x86_64N/A2026/09/2118:06:0900:00:00ViewView
Ubuntu-22.04-x86_64N/A2026/09/1807:11:4800:00:00ViewView
Ubuntu-24.04-x86_64N/A2026/09/1806:42:1300:00:00ViewView
Ubuntu-26.04-x86_64N/A2026/09/1805:22:4000:00:01ViewView