robotpkg/wip/py-dynamic-graph-v3 bulk build results

py27-dynamic-graph-v3-3.1.0 (category wip or summary)

Platform Status Date Time Log files
Start Total brokenbulkcmakeconfigureextract
CentOS-7-x86_64OK2018/09/2217:42:3800:00:24
Debian-8-x86_64OK2018/09/2213:07:0800:01:09
Fedora-27-x86_64OK2018/09/2218:35:1100:00:38
Fedora-28-x86_64OK2018/09/2210:13:0000:01:10
NetBSD-8.0-x86_64Broken2018/09/2210:52:0000:00:20
/usr/pkg/bin/gmake: *** [package] Error 2
ViewViewViewView
Ubuntu-12.04-i386OK2018/09/2210:26:1800:01:00
Ubuntu-12.04-x86_64OK2018/09/2215:25:2700:00:30
Ubuntu-14.04-x86_64OK2018/09/2212:48:3700:01:29
Ubuntu-16.04-x86_64OK2018/09/2214:18:2500:01:08
Ubuntu-18.04-x86_64OK2018/09/2214:20:3900:01:24

py32-dynamic-graph-v3-3.1.0 (category wip or summary)

Platform Status Date Time Log files
Start Total brokenbuildbulkcbbhcmakeconfigureextract
CentOS-7-x86_64N/A2018/09/2217:43:0200:00:01ViewView
Debian-8-x86_64N/A2018/09/2213:08:1800:00:00ViewView
Fedora-27-x86_64N/A2018/09/2218:35:4900:00:00ViewView
Fedora-28-x86_64N/A2018/09/2210:14:1100:00:01ViewView
NetBSD-8.0-x86_64N/A2018/09/2210:52:2000:00:01ViewView
Ubuntu-12.04-i386Broken2018/09/2210:27:1800:00:17
make: *** [package] Error 2
ViewViewViewViewView
Ubuntu-12.04-x86_64Broken2018/09/2215:25:5700:00:09
make: *** [package] Error 2
ViewViewViewViewView
Ubuntu-14.04-x86_64N/A2018/09/2212:50:0700:00:01ViewView
Ubuntu-16.04-x86_64N/A2018/09/2214:19:3400:00:01ViewView
Ubuntu-18.04-x86_64N/A2018/09/2214:22:0400:00:00ViewView

py34-dynamic-graph-v3-3.1.0 (category wip or summary)

Platform Status Date Time Log files
Start Total brokenbuildbulkcbbhcbbhbycmakeconfigureextractsysdep
CentOS-7-x86_64Sysdep2018/09/2217:43:0300:00:03ViewView
py-sphinx>=1.1
View
Debian-8-x86_64Broken2018/09/2213:08:1800:00:15
make: *** [package] Error 2
ViewViewViewViewView
Fedora-27-x86_64N/A2018/09/2218:35:5000:00:00ViewView
Fedora-28-x86_64N/A2018/09/2210:14:1200:00:01ViewView
NetBSD-8.0-x86_64N/A2018/09/2210:52:2100:00:00ViewView
Ubuntu-12.04-i386N/A2018/09/2210:27:3600:00:00ViewView
Ubuntu-12.04-x86_64N/A2018/09/2215:26:0600:00:00ViewView
Ubuntu-14.04-x86_64Broken2018/09/2212:50:0800:00:29
make: *** [package] Error 2
ViewViewViewViewView
Ubuntu-16.04-x86_64N/A2018/09/2214:19:3500:00:01ViewView
Ubuntu-18.04-x86_64N/A2018/09/2214:22:0500:00:00ViewView

py35-dynamic-graph-v3-3.1.0 (category wip or summary)

Platform Status Date Time Log files
Start Total brokenbulkcbbhcmakeconfigureextract
CentOS-7-x86_64N/A2018/09/2217:43:0700:00:00ViewView
Debian-8-x86_64N/A2018/09/2213:08:3400:00:00ViewView
Fedora-27-x86_64N/A2018/09/2218:35:5000:00:00ViewView
Fedora-28-x86_64N/A2018/09/2210:14:1400:00:00ViewView
NetBSD-8.0-x86_64N/A2018/09/2210:52:2100:00:01ViewView
Ubuntu-12.04-i386N/A2018/09/2210:27:3700:00:01ViewView
Ubuntu-12.04-x86_64N/A2018/09/2215:26:0600:00:01ViewView
Ubuntu-14.04-x86_64N/A2018/09/2212:50:3800:00:00ViewView
Ubuntu-16.04-x86_64Broken2018/09/2214:19:3600:00:26
make: *** [package] Error 2
ViewViewViewView
Ubuntu-18.04-x86_64N/A2018/09/2214:22:0600:00:00ViewView

py36-dynamic-graph-v3-3.1.0 (category wip or summary)

Platform Status Date Time Log files
Start Total brokenbulkcbbhcmakeconfigureextract
CentOS-7-x86_64N/A2018/09/2217:43:0700:00:00ViewView
Debian-8-x86_64N/A2018/09/2213:08:3400:00:01ViewView
Fedora-27-x86_64Broken2018/09/2218:35:5000:00:10
make: *** [package] Error 2
ViewViewViewView
Fedora-28-x86_64Broken2018/09/2210:14:1500:00:25
make: *** [package] Error 2
ViewViewViewView
NetBSD-8.0-x86_64Broken2018/09/2210:52:2200:00:23
/usr/pkg/bin/gmake: *** [package] Error 2
ViewViewViewView
Ubuntu-12.04-i386N/A2018/09/2210:27:3800:00:01ViewView
Ubuntu-12.04-x86_64N/A2018/09/2215:26:0700:00:00ViewView
Ubuntu-14.04-x86_64N/A2018/09/2212:50:3900:00:00ViewView
Ubuntu-16.04-x86_64N/A2018/09/2214:20:0300:00:01ViewView
Ubuntu-18.04-x86_64Broken2018/09/2214:22:0600:00:17
make: *** [package] Error 2
ViewViewViewView