robotpkg/wip/py-casadi bulk build results

py27-casadi-3.4.5 (category wip or summary)

Platform Status Date Time Log files
Start Total brokenbuildbulkcmakeconfigureextract
CentOS-7-x86_64Broken2019/12/ 514:49:1700:03:09
make: *** [package] Error 2
ViewViewViewViewView
Debian-8-x86_64Broken2019/12/ 516:17:1200:06:54
make: *** [package] Error 2
ViewViewViewViewView
Debian-9-x86_64Broken2019/12/ 518:07:1800:07:57
make: *** [package] Error 2
ViewViewViewViewView
Fedora-27-x86_64Broken2019/12/ 515:37:2600:02:58
make: *** [package] Error 2
ViewViewViewViewView
Fedora-28-x86_64Broken2019/12/ 516:17:0700:06:54
make: *** [package] Error 2
ViewViewViewViewView
NetBSD-8.0-x86_64Broken2019/12/ 515:44:2600:01:25
/usr/pkg/bin/gmake: *** [package] Error 2
ViewViewViewViewView
Ubuntu-14.04-x86_64Broken2019/12/ 515:14:1300:03:25
make: *** [package] Error 2
ViewViewViewViewView
Ubuntu-16.04-x86_64Broken2019/12/ 517:43:0500:04:39
make: *** [package] Error 2
ViewViewViewViewView
Ubuntu-18.04-x86_64Broken2019/12/ 516:48:5000:07:59
make: *** [package] Error 2
ViewViewViewViewView
Ubuntu-19.04-x86_64Broken2019/12/ 516:24:1800:07:03
make: *** [package] Error 2
ViewViewViewViewView

py34-casadi-3.4.5 (category wip or summary)

Platform Status Date Time Log files
Start Total brokenbuildbulkcbbhcmakeconfigureextract
CentOS-7-x86_64Broken2019/12/ 514:52:2700:03:19
make: *** [package] Error 2
ViewViewViewViewView
Debian-8-x86_64Broken2019/12/ 516:24:0700:07:54
make: *** [package] Error 2
ViewViewViewViewView
Debian-9-x86_64N/A2019/11/2613:50:1600:00:01ViewView
Fedora-27-x86_64N/A2019/11/2613:01:5900:00:01ViewView
Fedora-28-x86_64N/A2019/11/2618:12:2200:00:01ViewView
NetBSD-8.0-x86_64N/A2019/11/2611:21:4700:00:00ViewView
Ubuntu-14.04-x86_64Broken2019/12/ 515:17:3800:02:24
make: *** [package] Error 2
ViewViewViewViewView
Ubuntu-16.04-x86_64N/A2019/11/2614:38:0300:00:01ViewView
Ubuntu-18.04-x86_64N/A2019/11/2618:18:0500:00:00ViewView
Ubuntu-19.04-x86_64N/A2019/11/2613:28:1700:00:01ViewView

py35-casadi-3.4.5 (category wip or summary)

Platform Status Date Time Log files
Start Total brokenbuildbulkcbbhcmakeconfigureextract
CentOS-7-x86_64N/A2019/11/2612:30:4800:00:00ViewView
Debian-8-x86_64N/A2019/11/2613:04:2700:00:01ViewView
Debian-9-x86_64Broken2019/12/ 518:15:1700:06:39
make: *** [package] Error 2
ViewViewViewViewView
Fedora-27-x86_64N/A2019/11/2613:02:0100:00:00ViewView
Fedora-28-x86_64N/A2019/11/2618:12:2400:00:00ViewView
NetBSD-8.0-x86_64N/A2019/11/2611:21:4800:00:00ViewView
Ubuntu-14.04-x86_64N/A2019/11/2619:06:5500:00:01ViewView
Ubuntu-16.04-x86_64Broken2019/12/ 517:47:4600:06:24
make: *** [package] Error 2
ViewViewViewViewView
Ubuntu-18.04-x86_64N/A2019/11/2618:18:0600:00:00ViewView
Ubuntu-19.04-x86_64N/A2019/11/2613:28:1800:00:00ViewView

py36-casadi-3.4.5 (category wip or summary)

Platform Status Date Time Log files
Start Total brokenbuildbulkcbbhcmakeconfigureextract
CentOS-7-x86_64N/A2019/11/2612:30:4800:00:01ViewView
Debian-8-x86_64N/A2019/11/2613:04:2800:00:01ViewView
Debian-9-x86_64N/A2019/11/2613:55:5100:00:00ViewView
Fedora-27-x86_64Broken2019/12/ 515:40:2400:02:51
make: *** [package] Error 2
ViewViewViewViewView
Fedora-28-x86_64Broken2019/12/ 516:24:0300:07:36
make: *** [package] Error 2
ViewViewViewViewView
NetBSD-8.0-x86_64Broken2019/12/ 515:45:5200:01:43
/usr/pkg/bin/gmake: *** [package] Error 2
ViewViewViewViewView
Ubuntu-14.04-x86_64N/A2019/11/2619:06:5600:00:00ViewView
Ubuntu-16.04-x86_64N/A2019/11/2614:43:5100:00:00ViewView
Ubuntu-18.04-x86_64Broken2019/12/ 516:56:5000:05:19
make: *** [package] Error 2
ViewViewViewViewView
Ubuntu-19.04-x86_64N/A2019/11/2613:28:1900:00:00ViewView

py37-casadi-3.4.5 (category wip or summary)

Platform Status Date Time Log files
Start Total brokenbuildbulkcbbhcmakeconfigureextract
CentOS-7-x86_64N/A2019/11/2612:30:4900:00:01ViewView
Debian-8-x86_64N/A2019/11/2613:04:3000:00:01ViewView
Debian-9-x86_64N/A2019/11/2613:55:5100:00:00ViewView
Fedora-27-x86_64N/A2019/11/2613:08:5200:00:01ViewView
Fedora-28-x86_64N/A2019/11/2618:18:2500:00:01ViewView
NetBSD-8.0-x86_64N/A2019/11/2611:23:4100:00:00ViewView
Ubuntu-14.04-x86_64N/A2019/11/2619:06:5700:00:00ViewView
Ubuntu-16.04-x86_64N/A2019/11/2614:43:5200:00:01ViewView
Ubuntu-18.04-x86_64N/A2019/11/2618:24:5900:00:01ViewView
Ubuntu-19.04-x86_64Broken2019/12/ 516:31:2200:03:55
make: *** [package] Error 2
ViewViewViewViewView

py38-casadi-3.4.5 (category wip or summary)

Platform Status Date Time Log files
Start Total bulkcbbh
CentOS-7-x86_64N/A2019/11/2612:30:5000:00:01ViewView
Debian-8-x86_64N/A2019/11/2613:04:3100:00:01ViewView
Debian-9-x86_64N/A2019/11/2613:55:5200:00:00ViewView
Fedora-27-x86_64N/A2019/11/2613:08:5300:00:01ViewView
Fedora-28-x86_64N/A2019/11/2618:18:2600:00:01ViewView
NetBSD-8.0-x86_64N/A2019/11/2611:23:4100:00:01ViewView
Ubuntu-14.04-x86_64N/A2019/11/2619:06:5800:00:00ViewView
Ubuntu-16.04-x86_64N/A2019/11/2614:43:5400:00:00ViewView
Ubuntu-18.04-x86_64N/A2019/11/2618:25:0000:00:01ViewView
Ubuntu-19.04-x86_64N/A2019/11/2613:33:2900:00:00ViewView