robotpkg/wip/pmb2-navigation bulk build results
Log for pmb2-navigation-2.0.1 on NetBSD-11-x86_64: bulk.log (Back)
=> Checking for clear installation
===> Installing bootstrap dependencies for pmb2-navigation-2.0.1
=> Installing /opt/robotpkg/var/lib/robotpkg/packages/bsd/NetBSD-11-x86_64/All/digest-20080510.tgz
=> Installing /opt/robotpkg/var/lib/robotpkg/packages/bsd/NetBSD-11-x86_64/All/tnftp-20151004~ssl.tgz
===> Checking bootstrap dependencies for pmb2-navigation-2.0.1
=> Required robotpkg package digest>=20080510: digest-20080510 found
=> Required robotpkg package tnftp>=20091122: tnftp-20151004~ssl found
=> Required system package gzip: gzip-20260107 found
=> Required system package pax and tar archivers: pax found
=> Required system package pkg_install>=20110805.12: pkg_install-20211115.4 found
===> Done bootstrap-depends for pmb2-navigation-2.0.1
===> Installing full dependencies for pmb2-navigation-2.0.1
=> Dependency digest-20080510 already installed
=> Installing /opt/robotpkg/var/lib/robotpkg/packages/bsd/NetBSD-11-x86_64/All/py313-catkin-pkg-1.0.0.tgz
=> Installing /opt/robotpkg/var/lib/robotpkg/packages/bsd/NetBSD-11-x86_64/All/py313-ros-catkin-0.8.12.tgz
To use ros, the following environment variables must contain those values:
ROS_MASTER_URI http://localhost:11311
ROS_PACKAGE_PATH /opt/openrobots/share
PYTHONPATH /opt/openrobots/lib/python3.13/site-packages
PATH /opt/openrobots/bin
As an alternative to the above configuration, commands can be executed by
using the `env.sh' wrapper. For instance, roscore can be started like so:
/opt/openrobots/etc/ros/env.sh roscore
In Bourne shell scripts, the following file can be sourced instead:
/opt/openrobots/etc/ros/setup.sh
=> Installing /opt/robotpkg/var/lib/robotpkg/packages/bsd/NetBSD-11-x86_64/All/ros-comm-1.17.4.tgz
=> Installing /opt/robotpkg/var/lib/robotpkg/packages/bsd/NetBSD-11-x86_64/All/ros-common-msgs-1.13.1.tgz
=> Dependency ros-genmsg-0.6.1 already installed
=> Dependency ros-genpy-0.6.18 already installed
=> Dependency ros-message-generation-0.4.1 already installed
=> Dependency ros-message-runtime-0.4.13 already installed
=> Dependency ros-std-msgs-0.5.14 already installed
=> Dependency tnftp-20151004~ssl already installed
===> Checking build options for pmb2-navigation-2.0.1
=> Building with no option.
===> Checking alternatives for pmb2-navigation-2.0.1
=> Use the GNU C++ compiler: c++-compiler provided by g++>=3
=> Use the GNU C compiler: c-compiler provided by gcc>=3
=> Use python-3.13: python>=2.5 provided by python313>=3.13<3.14
===> Checking dependencies for pmb2-navigation-2.0.1
=> Required system package boost-headers>=1.60: boost-headers-1.91 found
=> Required system package boostlib-thread>=1.34.1: boost-libs-1.91.0 found
=> Required system package cmake>=2.8.3: cmake-4.3.3 found
=> Required system package g++>=3: g++-12.5.0 found
=> Required system package gcc>=3: gcc-12.5.0 found
=> Required system package libstdc++: libstdc++ found
=> Required system package pkg-config>=0.22: pkg-config-2.5.1 found
=> Required system package py313-empy>=3: py313-empy-3.3.4 found
=> Required system package py313-pyparsing: py313-pyparsing found
=> Required system package python313>=3.13<3.14: python313-3.13.14 found
=> Required robotpkg package py313-catkin-pkg>=0.2: py313-catkin-pkg-1.0.0 found
=> Required robotpkg package py313-ros-catkin>=0.7: py313-ros-catkin-0.8.12 found
=> Required robotpkg package ros-comm>=1.13: ros-comm-1.17.4 found
=> Required robotpkg package ros-common-msgs>=1.12: ros-common-msgs-1.13.1 found
=> Required robotpkg package ros-genmsg>=0.5<0.7: ros-genmsg-0.6.1 found
=> Required robotpkg package ros-genpy>=0.6<0.7: ros-genpy-0.6.18 found
=> Required robotpkg package ros-message-generation>=0.4: ros-message-generation-0.4.1 found
=> Required robotpkg package ros-message-runtime>=0.4<0.5: ros-message-runtime-0.4.13 found
=> Required robotpkg package ros-std-msgs>=0.5: ros-std-msgs-0.5.14 found
===> Done depends for pmb2-navigation-2.0.1
===> Extracting for pmb2-navigation-2.0.1
=> SHA1 checksums OK
=> RMD160 checksums OK
x pmb2_navigation-2.0.1/
x pmb2_navigation-2.0.1/pmb2_2dnav/
x pmb2_navigation-2.0.1/pmb2_2dnav/CHANGELOG.rst
x pmb2_navigation-2.0.1/pmb2_2dnav/CMakeLists.txt
x pmb2_navigation-2.0.1/pmb2_2dnav/config/
x pmb2_navigation-2.0.1/pmb2_2dnav/config/rviz/
x pmb2_navigation-2.0.1/pmb2_2dnav/config/rviz/advanced_navigation.rviz
x pmb2_navigation-2.0.1/pmb2_2dnav/config/rviz/navigation.rviz
x pmb2_navigation-2.0.1/pmb2_2dnav/launch/
x pmb2_navigation-2.0.1/pmb2_2dnav/launch/localization.launch
x pmb2_navigation-2.0.1/pmb2_2dnav/launch/mapping.launch
x pmb2_navigation-2.0.1/pmb2_2dnav/launch/move_base.launch
x pmb2_navigation-2.0.1/pmb2_2dnav/launch/state_machine.launch
x pmb2_navigation-2.0.1/pmb2_2dnav/package.xml
x pmb2_navigation-2.0.1/pmb2_2dnav/scripts/
x pmb2_navigation-2.0.1/pmb2_2dnav/scripts/filter_mapping_bag.sh
x pmb2_navigation-2.0.1/pmb2_2dnav/scripts/record_mapping.sh
x pmb2_navigation-2.0.1/pmb2_2dnav/scripts/record_move_base.sh
x pmb2_navigation-2.0.1/pmb2_2dnav/scripts/record_odom.sh
x pmb2_navigation-2.0.1/pmb2_2dnav/scripts/record_patrol.sh
x pmb2_navigation-2.0.1/pmb2_2dnav/scripts/record_rgbd.sh
x pmb2_navigation-2.0.1/pmb2_laser_sensors/
x pmb2_navigation-2.0.1/pmb2_laser_sensors/CHANGELOG.rst
x pmb2_navigation-2.0.1/pmb2_laser_sensors/CMakeLists.txt
x pmb2_navigation-2.0.1/pmb2_laser_sensors/config/
x pmb2_navigation-2.0.1/pmb2_laser_sensors/config/hokuyo_filter.yaml
x pmb2_navigation-2.0.1/pmb2_laser_sensors/config/hokuyo_urg_04lx_ug01_laser.yaml
x pmb2_navigation-2.0.1/pmb2_laser_sensors/config/rgbd_cloud_laser.yaml
x pmb2_navigation-2.0.1/pmb2_laser_sensors/config/sick-551_filter.yaml
x pmb2_navigation-2.0.1/pmb2_laser_sensors/config/sick-561_filter.yaml
x pmb2_navigation-2.0.1/pmb2_laser_sensors/config/sick-571_filter.yaml
x pmb2_navigation-2.0.1/pmb2_laser_sensors/config/sick_tim551_laser.yaml
x pmb2_navigation-2.0.1/pmb2_laser_sensors/config/sick_tim561_laser.yaml
x pmb2_navigation-2.0.1/pmb2_laser_sensors/config/sick_tim571_laser.yaml
x pmb2_navigation-2.0.1/pmb2_laser_sensors/launch/
x pmb2_navigation-2.0.1/pmb2_laser_sensors/launch/base_laser.launch
x pmb2_navigation-2.0.1/pmb2_laser_sensors/launch/hokuyo_laser.launch
x pmb2_navigation-2.0.1/pmb2_laser_sensors/launch/laser.launch
x pmb2_navigation-2.0.1/pmb2_laser_sensors/launch/rgbd_cloud_laser.launch
x pmb2_navigation-2.0.1/pmb2_laser_sensors/launch/sick-551_laser.launch
x pmb2_navigation-2.0.1/pmb2_laser_sensors/launch/sick-561_laser.launch
x pmb2_navigation-2.0.1/pmb2_laser_sensors/launch/sick-571_laser.launch
x pmb2_navigation-2.0.1/pmb2_laser_sensors/package.xml
x pmb2_navigation-2.0.1/pmb2_maps/
x pmb2_navigation-2.0.1/pmb2_maps/CHANGELOG.rst
x pmb2_navigation-2.0.1/pmb2_maps/CMakeLists.txt
x pmb2_navigation-2.0.1/pmb2_maps/building.yaml
x pmb2_navigation-2.0.1/pmb2_maps/building_description.yaml
x pmb2_navigation-2.0.1/pmb2_maps/buildings/
x pmb2_navigation-2.0.1/pmb2_maps/buildings/pal_building/
x pmb2_navigation-2.0.1/pmb2_maps/buildings/pal_building/building_description.yaml
x pmb2_navigation-2.0.1/pmb2_maps/config
x pmb2_navigation-2.0.1/pmb2_maps/configurations/
x pmb2_navigation-2.0.1/pmb2_maps/configurations/pal_office/
x pmb2_navigation-2.0.1/pmb2_maps/configurations/pal_office/map.pgm
x pmb2_navigation-2.0.1/pmb2_maps/configurations/pal_office/map.yaml
x pmb2_navigation-2.0.1/pmb2_maps/configurations/pal_office/mmap.yaml
x pmb2_navigation-2.0.1/pmb2_maps/configurations/pal_office/submap_0.pgm
x pmb2_navigation-2.0.1/pmb2_maps/configurations/pal_office/transformation.xml
x pmb2_navigation-2.0.1/pmb2_maps/configurations/small_office/
x pmb2_navigation-2.0.1/pmb2_maps/configurations/small_office/map.bmp
x pmb2_navigation-2.0.1/pmb2_maps/configurations/small_office/map.bt
x pmb2_navigation-2.0.1/pmb2_maps/configurations/small_office/map.ot
x pmb2_navigation-2.0.1/pmb2_maps/configurations/small_office/map.pgm
x pmb2_navigation-2.0.1/pmb2_maps/configurations/small_office/map.yaml
x pmb2_navigation-2.0.1/pmb2_maps/configurations/small_office/mmap.yaml
x pmb2_navigation-2.0.1/pmb2_maps/configurations/small_office/transformation.yaml
x pmb2_navigation-2.0.1/pmb2_maps/package.xml
x pmb2_navigation-2.0.1/pmb2_navigation/
x pmb2_navigation-2.0.1/pmb2_navigation/CHANGELOG.rst
x pmb2_navigation-2.0.1/pmb2_navigation/CMakeLists.txt
x pmb2_navigation-2.0.1/pmb2_navigation/package.xml
x pmb2_navigation-2.0.1/pmb2_rgbd_sensors/
x pmb2_navigation-2.0.1/pmb2_rgbd_sensors/CHANGELOG.rst
x pmb2_navigation-2.0.1/pmb2_rgbd_sensors/CMakeLists.txt
x pmb2_navigation-2.0.1/pmb2_rgbd_sensors/config/
x pmb2_navigation-2.0.1/pmb2_rgbd_sensors/config/elp_rgb.yaml
x pmb2_navigation-2.0.1/pmb2_rgbd_sensors/config/structure_sensor.yaml
x pmb2_navigation-2.0.1/pmb2_rgbd_sensors/launch/
x pmb2_navigation-2.0.1/pmb2_rgbd_sensors/launch/base_structure_sensor.launch
x pmb2_navigation-2.0.1/pmb2_rgbd_sensors/launch/elp_rgb_nodelet.launch
x pmb2_navigation-2.0.1/pmb2_rgbd_sensors/launch/rgbd.launch
x pmb2_navigation-2.0.1/pmb2_rgbd_sensors/launch/roof_structure_sensor.launch
x pmb2_navigation-2.0.1/pmb2_rgbd_sensors/package.xml
===> Configuring for pmb2-navigation-2.0.1
CMake Deprecation Warning at CMakeLists.txt:4 (cmake_minimum_required):
Compatibility with CMake < 3.10 will be removed from a future version of
CMake.
Update the VERSION argument <min> value. Or, use the <min>...<max> syntax
to tell CMake that the project requires at least <min> but has been updated
to work with policies introduced by <max> or earlier.
CMake Warning (dev) at /opt/openrobots/share/catkin/cmake/python.cmake:4 (find_package):
Policy CMP0148 is not set: The FindPythonInterp and FindPythonLibs modules
are removed. Run "cmake --help-policy CMP0148" for policy details. Use
the cmake_policy command to set the policy and suppress this warning.
Call Stack (most recent call first):
/opt/openrobots/share/catkin/cmake/all.cmake:164 (include)
/opt/openrobots/share/catkin/cmake/catkinConfig.cmake:20 (include)
CMakeLists.txt:58 (find_package)
This warning is for project developers. Use -Wno-dev to suppress it.
CMake Error at pmb2_2dnav/CMakeLists.txt:1 (cmake_minimum_required):
Compatibility with CMake < 3.5 has been removed from CMake.
Update the VERSION argument <min> value. Or, use the <min>...<max> syntax
to tell CMake that the project requires at least <min> but has been updated
to work with policies introduced by <max> or earlier.
Or, add -DCMAKE_POLICY_VERSION_MINIMUM=3.5 to try configuring anyway.
An unexpected error occured. The last 10 log lines are shown below.
| Compatibility with CMake < 3.5 has been removed from CMake.
|
| Update the VERSION argument <min> value. Or, use the <min>...<max> syntax
| to tell CMake that the project requires at least <min> but has been updated
| to work with policies introduced by <max> or earlier.
|
| Or, add -DCMAKE_POLICY_VERSION_MINIMUM=3.5 to try configuring anyway.
|
|
| -- Configuring incomplete, errors occurred!
For details or bug reports, check the complete log file in:
/local/robotpkg/var/tmp/robotpkg/wip/pmb2-navigation/work/configure.log
gmake[3]: *** [/local/robotpkg/var/lib/robotpkg/mk/configure/cmake-configure.mk:101: do-configure-cmake(/local/robotpkg/var/tmp/robotpkg/wip/pmb2-navigation/work/pmb2_navigation-2.0.1/build)] Error 1
=> Marking pmb2-navigation-2.0.1 as broken
gmake[2]: *** [/local/robotpkg/var/lib/robotpkg/mk/pkg/package.mk:42: pkg-check-installed] Error 2
ERROR: /usr/pkg/bin/gmake: *** [package] Error 2
===> Deinstalling for pmb2-navigation
Removed digest-20080510
Removing dependency py313-rosdep-0.26.0
Removing dependency py313-ros-catkin-0.8.12
Removing dependency ros-environment-1.3.2r1
Removing dependency ros-rospack-2.5.1r1
Removing dependency ros-roscpp-core-0.7.3r1
Removing dependency ros-genmsg-0.6.1
Removing dependency ros-ros-1.15.8r1
Removing dependency ros-console-1.14.4
Removing dependency ros-gennodejs-2.0.1
Removing dependency ros-genlisp-0.4.18
Removing dependency ros-geneus-3.0.0
Removing dependency ros-gencpp-0.7.2
Removing dependency ros-genpy-0.6.18
Removing dependency ros-message-runtime-0.4.13
Removing dependency ros-message-generation-0.4.1
Removing dependency ros-std-msgs-0.5.14
Removing dependency ros-common-msgs-1.13.1
Removing dependency ros-comm-msgs-1.11.4
Removing dependency ros-class-loader-0.5.2
Removing dependency ros-pluginlib-1.13.2
Removing dependency ros-comm-1.17.4
Removed py313-catkin-pkg-1.0.0
Removed tnftp-20151004~ssl