robotpkg/wip/opensim-core bulk build results

py27-opensim-core-4.4 (category simulation or summary)

Platform Status Date Time Log files
Start Total brokenbuildbulkcbbhcmakeconfigureextract
Debian-11-x86_64N/A2026/09/1803:13:5600:00:01ViewView
Debian-12-x86_64N/A2026/09/1807:06:0300:00:00ViewView
Debian-13-x86_64N/A2026/09/1805:08:4000:00:01ViewView
Fedora-42-x86_64N/A2026/09/1808:58:1600:00:01ViewView
Fedora-44-x86_64N/A2026/09/1808:08:5400:00:00ViewView
NetBSD-11-x86_64N/A2026/09/1811:58:4700:00:00ViewView
Rocky-10-x86_64N/A2026/09/1805:09:3900:00:00ViewView
Rocky-8-x86_64N/A2026/09/1800:55:2400:00:00ViewView
Ubuntu-20.04-x86_64Broken2026/09/3021:18:0500:34:55
make: *** [package] Error 2
ViewViewViewViewView
Ubuntu-22.04-x86_64Broken2026/09/3021:34:4600:00:39
make: *** [package] Error 2
ViewViewViewViewView
Ubuntu-24.04-x86_64N/A2026/09/1806:54:2900:00:01ViewView
Ubuntu-26.04-x86_64N/A2026/09/1805:17:2200:00:00ViewView

py310-opensim-core-4.4 (category simulation or summary)

Platform Status Date Time Log files
Start Total brokenbuildbulkcbbhcmakeconfigureextract
Debian-11-x86_64N/A2026/09/1803:13:5700:00:00ViewView
Debian-12-x86_64N/A2026/09/1807:06:0300:00:00ViewView
Debian-13-x86_64N/A2026/09/1805:08:4100:00:00ViewView
Fedora-42-x86_64N/A2026/09/1808:58:1700:00:01ViewView
Fedora-44-x86_64N/A2026/09/1808:08:5400:00:01ViewView
NetBSD-11-x86_64N/A2026/09/1811:58:4800:00:00ViewView
Rocky-10-x86_64N/A2026/09/1805:09:3900:00:01ViewView
Rocky-8-x86_64N/A2026/09/1800:55:2500:00:00ViewView
Ubuntu-20.04-x86_64N/A2026/09/2118:30:1600:00:01ViewView
Ubuntu-22.04-x86_64Broken2026/09/3021:35:2500:00:34
make: *** [package] Error 2
ViewViewViewViewView
Ubuntu-24.04-x86_64N/A2026/09/1806:54:3000:00:00ViewView
Ubuntu-26.04-x86_64N/A2026/09/1805:17:2200:00:00ViewView

py311-opensim-core-4.4 (category simulation or summary)

Platform Status Date Time Log files
Start Total brokenbuildbulkcbbhcmakeconfigureextract
Debian-11-x86_64N/A2026/09/1803:13:5700:00:01ViewView
Debian-12-x86_64Broken2026/09/3021:13:4000:00:54
make: *** [package] Error 2
ViewViewViewViewView
Debian-13-x86_64N/A2026/09/1805:08:4100:00:00ViewView
Fedora-42-x86_64N/A2026/09/1808:58:1800:00:00ViewView
Fedora-44-x86_64N/A2026/09/1808:08:5500:00:01ViewView
NetBSD-11-x86_64N/A2026/09/1811:58:4900:00:00ViewView
Rocky-10-x86_64N/A2026/09/1805:09:4000:00:00ViewView
Rocky-8-x86_64N/A2026/09/1800:55:2500:00:00ViewView
Ubuntu-20.04-x86_64N/A2026/09/2118:30:1700:00:00ViewView
Ubuntu-22.04-x86_64N/A2026/09/1807:58:2200:00:00ViewView
Ubuntu-24.04-x86_64N/A2026/09/1806:54:3000:00:01ViewView
Ubuntu-26.04-x86_64N/A2026/09/1805:17:2300:00:00ViewView

py312-opensim-core-4.4 (category simulation or summary)

Platform Status Date Time Log files
Start Total brokenbuildbulkcbbhcmakeconfigureextract
Debian-11-x86_64N/A2026/09/1803:13:5800:00:00ViewView
Debian-12-x86_64N/A2026/09/1807:06:4200:00:00ViewView
Debian-13-x86_64N/A2026/09/1805:08:4200:00:00ViewView
Fedora-42-x86_64N/A2026/09/1808:58:1900:00:00ViewView
Fedora-44-x86_64N/A2026/09/1808:08:5600:00:00ViewView
NetBSD-11-x86_64N/A2026/09/1811:58:5000:00:00ViewView
Rocky-10-x86_64Broken2026/09/3021:00:5400:00:34
make: *** [package] Error 2
ViewViewViewViewView
Rocky-8-x86_64N/A2026/09/1800:55:2500:00:00ViewView
Ubuntu-20.04-x86_64N/A2026/09/2118:30:1800:00:00ViewView
Ubuntu-22.04-x86_64N/A2026/09/1807:58:2300:00:00ViewView
Ubuntu-24.04-x86_64Broken2026/09/3021:42:4200:00:31
make: *** [package] Error 2
ViewViewViewViewView
Ubuntu-26.04-x86_64N/A2026/09/1805:17:2300:00:00ViewView

py313-opensim-core-4.4 (category simulation or summary)

Platform Status Date Time Log files
Start Total brokenbrokenbybuildbulkcbbhcmakeconfigureextract
Debian-11-x86_64N/A2026/09/1803:13:5800:00:01ViewView
Debian-12-x86_64N/A2026/09/1807:06:4200:00:01ViewView
Debian-13-x86_64Broken2026/09/3021:37:0700:00:35
make: *** [package] Error 2
ViewViewViewViewView
Fedora-42-x86_64Broken2026/09/3021:19:1800:00:23
make: *** [package] Error 2
ViewViewViewViewView
Fedora-44-x86_64N/A2026/09/1808:08:5700:00:00ViewView
NetBSD-11-x86_64Broken2026/09/3021:45:5300:00:04
Required robotpkg package docopt-cpp>=0.6.3: BROKEN Required robotpkg package simbody>=3.7: BROKEN
View
Rocky-10-x86_64N/A2026/09/1805:10:0400:00:00ViewView
Rocky-8-x86_64N/A2026/09/1800:55:2600:00:00ViewView
Ubuntu-20.04-x86_64N/A2026/09/2118:30:1800:00:01ViewView
Ubuntu-22.04-x86_64N/A2026/09/1807:58:2300:00:01ViewView
Ubuntu-24.04-x86_64N/A2026/09/1806:55:0500:00:00ViewView
Ubuntu-26.04-x86_64N/A2026/09/1805:17:2400:00:00ViewView

py314-opensim-core-4.4 (category simulation or summary)

Platform Status Date Time Log files
Start Total brokenbrokenbybulkcbbh
Debian-11-x86_64N/A2026/09/1803:13:5900:00:00ViewView
Debian-12-x86_64N/A2026/09/1807:06:4300:00:00ViewView
Debian-13-x86_64N/A2026/09/1805:09:1400:00:00ViewView
Fedora-42-x86_64N/A2026/09/1808:58:3800:00:01ViewView
Fedora-44-x86_64Broken2026/09/3021:18:5500:00:03
Required robotpkg package docopt-cpp>=0.6.3: BROKEN Required robotpkg package simbody>=3.7: BROKEN
View
NetBSD-11-x86_64N/A2026/09/1811:58:5600:00:00ViewView
Rocky-10-x86_64N/A2026/09/1805:10:0400:00:01ViewView
Rocky-8-x86_64N/A2026/09/1800:55:2600:00:00ViewView
Ubuntu-20.04-x86_64N/A2026/09/2118:30:1900:00:00ViewView
Ubuntu-22.04-x86_64N/A2026/09/1807:58:2400:00:00ViewView
Ubuntu-24.04-x86_64N/A2026/09/1806:55:0500:00:00ViewView
Ubuntu-26.04-x86_64Broken2026/09/3021:12:3900:00:02
Required robotpkg package docopt-cpp>=0.6.3: BROKEN Required robotpkg package simbody>=3.7: BROKEN
View

py36-opensim-core-4.4 (category simulation or summary)

Platform Status Date Time Log files
Start Total bulkcbbhcbbhby
Debian-11-x86_64N/A2026/09/1803:13:5900:00:00ViewView
Debian-12-x86_64N/A2026/09/1807:06:4300:00:01ViewView
Debian-13-x86_64N/A2026/09/1805:09:1500:00:00ViewView
Fedora-42-x86_64N/A2026/09/1808:58:3900:00:01ViewView
Fedora-44-x86_64N/A2026/09/1808:09:0200:00:00ViewView
NetBSD-11-x86_64N/A2026/09/1811:58:5700:00:00ViewView
Rocky-10-x86_64N/A2026/09/1805:10:0500:00:00ViewView
Rocky-8-x86_64N/A2026/09/3021:53:3500:00:04ViewView
ipopt>=3.11
Ubuntu-20.04-x86_64N/A2026/09/2118:30:2000:00:00ViewView
Ubuntu-22.04-x86_64N/A2026/09/1807:58:2400:00:01ViewView
Ubuntu-24.04-x86_64N/A2026/09/1806:55:0500:00:01ViewView
Ubuntu-26.04-x86_64N/A2026/09/1805:17:2700:00:00ViewView

py38-opensim-core-4.4 (category simulation or summary)

Platform Status Date Time Log files
Start Total brokenbuildbulkcbbhcmakeconfigureextract
Debian-11-x86_64N/A2026/09/1803:14:0000:00:00ViewView
Debian-12-x86_64N/A2026/09/1807:06:4400:00:00ViewView
Debian-13-x86_64N/A2026/09/1805:09:1500:00:00ViewView
Fedora-42-x86_64N/A2026/09/1808:58:4000:00:00ViewView
Fedora-44-x86_64N/A2026/09/1808:09:0300:00:00ViewView
NetBSD-11-x86_64N/A2026/09/1811:58:5700:00:01ViewView
Rocky-10-x86_64N/A2026/09/1805:10:0600:00:00ViewView
Rocky-8-x86_64N/A2026/09/1800:55:2900:00:01ViewView
Ubuntu-20.04-x86_64Broken2026/09/3021:53:0100:24:26
make: *** [package] Error 2
ViewViewViewViewView
Ubuntu-22.04-x86_64N/A2026/09/1807:58:2500:00:00ViewView
Ubuntu-24.04-x86_64N/A2026/09/1806:55:0600:00:00ViewView
Ubuntu-26.04-x86_64N/A2026/09/1805:17:2700:00:01ViewView

py39-opensim-core-4.4 (category simulation or summary)

Platform Status Date Time Log files
Start Total brokenbuildbulkcbbhcmakeconfigureextract
Debian-11-x86_64Broken2026/09/3020:40:3500:00:33
make: *** [package] Error 2
ViewViewViewViewView
Debian-12-x86_64N/A2026/09/1807:06:4400:00:01ViewView
Debian-13-x86_64N/A2026/09/1805:09:1500:00:01ViewView
Fedora-42-x86_64N/A2026/09/1808:58:4100:00:00ViewView
Fedora-44-x86_64N/A2026/09/1808:09:0300:00:01ViewView
NetBSD-11-x86_64N/A2026/09/1811:58:5800:00:01ViewView
Rocky-10-x86_64N/A2026/09/1805:10:0600:00:01ViewView
Rocky-8-x86_64N/A2026/09/1800:55:3000:00:00ViewView
Ubuntu-20.04-x86_64N/A2026/09/2118:53:5300:00:00ViewView
Ubuntu-22.04-x86_64N/A2026/09/1807:58:2600:00:00ViewView
Ubuntu-24.04-x86_64N/A2026/09/1806:55:0600:00:00ViewView
Ubuntu-26.04-x86_64N/A2026/09/1805:17:2800:00:00ViewView