robotpkg/wip/infuse-envire bulk build results

Log for infuse-envire-0.1.1 on NetBSD-11-x86_64: build.log (Back)

--- Environment --- LC_MONETARY=C _overrides_pkgtools_pkg_install_PKGREQD=pkg_install>=20110805.12 pkg_install>=20110805.12 pkg_install>=20110805.12 CXX=/usr/bin/g++ PAX=/bin/pax MFLAGS=--no-print-directory OS_KERNEL_VERSION=11.0_STABLE MAKEFLAGS= --no-print-directory -- PKGREQD.cmdline=infuse-envire-0.1.1~!doc RECURSIVE_PKGPATH=wip/infuse-envire\ tag=NetBSD-11-x86_64 BULK_LOGDIR=/local/robotpkg/var/log/bulk BULKBASE=/opt/openrobots LOCALBASE=/opt/openrobots PKG_DBDIR=/opt/openrobots/var/db/robotpkg EXPECT_TARGETS=package TAR=/usr/bin/tar GXX=/usr/bin/g++ BULK_LOGDIR=/local/robotpkg/var/log/bulk PWD=/local/robotpkg/var/lib/robotpkg/wip/infuse-envire LANG=C GZIP_CMD=/usr/bin/gzip _overrides_math_eigen3_PKGREQD=eigen3>=3.3 eigen3>=3.3 eigen3>=3.3 HOME=/ CMAKE=/usr/pkg/bin/cmake PATH=/sbin:/bin:/usr/sbin:/usr/bin CXXCPP=/usr/bin/g++ -E LC_MESSAGES=C _overrides_archivers_pax_PKGREQD=pax pax _override_vars_pkgtools_pkg_install=PKGREQD PKGREQD PKGREQD MAKELEVEL=4 _override_vars_pkgtools_tnftp=PKGREQD PKGREQD LOWER_OS_VERSION=11 hline="$bf======================================================================$rm" ZCAT=/usr/bin/zcat MACHINE_PLATFORM=NetBSD-11-x86_64 _override_vars_pkgtools_digest=PKGREQD PKGREQD _overrides_wip_infuse_envire_PKGREQD=infuse-envire-0.1.1~!doc LC_NUMERIC=C OLDPWD=/local/robotpkg/var/lib/robotpkg/wip/py-sl1m CC=/usr/bin/gcc FC=false _overrides_pkgtools_tnftp_PKGREQD=tnftp>=20091122 tnftp>=20091122 PKG_CONFIG=/usr/pkg/bin/pkg-config tag=NetBSD-11-x86_64 OS_KERNEL=NetBSD ROBOTPKG_TRUSTED_ENV=robotpkg LC_CTYPE=C _override_vars_math_eigen3=PKGREQD PKGREQD PKGREQD _ROBOTPKG_NOW=0918113838 LOWER_ARCH=x86_64 OWNER_GID=robots ROBOTPKG_BASE=/local/robotpkg NODENAME=hydra64-netbsd10 bf= DIGEST=/opt/openrobots/sbin/robotpkg_digest ECHO_N=echo -n OS_VERSION=11 EXPECT_TARGETS=package LC_COLLATE=C rm= _overrides_pkgtools_digest_PKGREQD=digest>=20080510 digest>=20080510 OWNER_UID=rbulk RECURSIVE_PKGPATH=wip/infuse-envire MACHINE_ARCH=x86_64 ROBOTPKG_DIR=/local/robotpkg/var/lib/robotpkg _override_vars_archivers_pax=PKGREQD PKGREQD LOWER_OPSYS=netbsd LC_TIME=C TNFTP=/opt/openrobots/sbin/tnftp OPSYS=NetBSD LOCALBASE=/opt/openrobots LOWER_OS_KERNEL=netbsd PKGTOOLS_VERSION=20211115.4 _override_vars_wip_infuse_envire=PKGREQD BULKBASE=/opt/openrobots PKG_CONFIG_LIBDIR=/usr/lib/pkgconfig MACHINE_KERNEL=NetBSD-11.0_STABLE-x86_64 GCC=/usr/bin/gcc PKG_CONFIG_PATH=/usr/pkg-2026Q2/lib/pkgconfig PKG_DBDIR=/opt/openrobots/var/db/robotpkg MAKECONF=/opt/robotpkg/etc/robotpkg-wip.conf CPP=/usr/bin/gcc -E --- Running set -e; cd /local/robotpkg/var/tmp/robotpkg/wip/infuse-envire/work/infuse-envire-0.1.1 && cd '/local/robotpkg/var/tmp/robotpkg/wip/infuse-envire/work/infuse-envire-0.1.1' && /usr/bin/env MAKE=/usr/pkg/bin/gmake MAKELEVEL= 'CPPFLAGS=' 'CFLAGS=-pipe -O3 -DNDEBUG' 'LDFLAGS=' 'CXXFLAGS=-pipe -O3 -DNDEBUG' PREFIX='/opt/openrobots' HOME=/local/robotpkg/var/tmp/robotpkg/wip/infuse-envire/work PATH='/opt/openrobots/sbin:/sbin:/bin:/usr/sbin:/usr/bin' LD_LIBRARY_PATH='' LOCALBASE=/opt/openrobots PKGMANDIR=man /usr/pkg/bin/gmake -j4 -f Makefile all /usr/pkg/bin/cmake -S/local/robotpkg/var/tmp/robotpkg/wip/infuse-envire/work/infuse-envire-0.1.1 -B/local/robotpkg/var/tmp/robotpkg/wip/infuse-envire/work/infuse-envire-0.1.1 --check-build-system CMakeFiles/Makefile.cmake 0 /usr/pkg/bin/cmake -E cmake_progress_start /local/robotpkg/var/tmp/robotpkg/wip/infuse-envire/work/infuse-envire-0.1.1/CMakeFiles /local/robotpkg/var/tmp/robotpkg/wip/infuse-envire/work/infuse-envire-0.1.1//CMakeFiles/progress.marks /usr/pkg/bin/gmake -f CMakeFiles/Makefile2 all gmake[1]: Entering directory '/local/robotpkg/var/tmp/robotpkg/wip/infuse-envire/work/infuse-envire-0.1.1' /usr/pkg/bin/gmake -f CMakeFiles/infuse_envire.dir/build.make CMakeFiles/infuse_envire.dir/depend gmake[2]: Entering directory '/local/robotpkg/var/tmp/robotpkg/wip/infuse-envire/work/infuse-envire-0.1.1' cd /local/robotpkg/var/tmp/robotpkg/wip/infuse-envire/work/infuse-envire-0.1.1 && /usr/pkg/bin/cmake -E cmake_depends "Unix Makefiles" /local/robotpkg/var/tmp/robotpkg/wip/infuse-envire/work/infuse-envire-0.1.1 /local/robotpkg/var/tmp/robotpkg/wip/infuse-envire/work/infuse-envire-0.1.1 /local/robotpkg/var/tmp/robotpkg/wip/infuse-envire/work/infuse-envire-0.1.1 /local/robotpkg/var/tmp/robotpkg/wip/infuse-envire/work/infuse-envire-0.1.1 /local/robotpkg/var/tmp/robotpkg/wip/infuse-envire/work/infuse-envire-0.1.1/CMakeFiles/infuse_envire.dir/DependInfo.cmake "--color=" infuse_envire gmake[2]: Leaving directory '/local/robotpkg/var/tmp/robotpkg/wip/infuse-envire/work/infuse-envire-0.1.1' /usr/pkg/bin/gmake -f CMakeFiles/infuse_envire.dir/build.make CMakeFiles/infuse_envire.dir/build gmake[2]: Entering directory '/local/robotpkg/var/tmp/robotpkg/wip/infuse-envire/work/infuse-envire-0.1.1' [ 6%] Building CXX object CMakeFiles/infuse_envire.dir/src/events/GraphEvent.cpp.o /usr/bin/g++ -DBOOST_ATOMIC_DYN_LINK -DBOOST_ATOMIC_NO_LIB -DBOOST_FILESYSTEM_DYN_LINK -DBOOST_FILESYSTEM_NO_LIB -DBOOST_SERIALIZATION_DYN_LINK -DBOOST_SERIALIZATION_NO_LIB -Dinfuse_envire_EXPORTS -I/usr/pkg/include/eigen3 -isystem /usr/pkg-2026Q2/include -pipe -O3 -DNDEBUG -std=c++11 -Wall -fPIC -MD -MT CMakeFiles/infuse_envire.dir/src/events/GraphEvent.cpp.o -MF CMakeFiles/infuse_envire.dir/src/events/GraphEvent.cpp.o.d -o CMakeFiles/infuse_envire.dir/src/events/GraphEvent.cpp.o -c /local/robotpkg/var/tmp/robotpkg/wip/infuse-envire/work/infuse-envire-0.1.1/src/events/GraphEvent.cpp [ 12%] Building CXX object CMakeFiles/infuse_envire.dir/src/events/GraphEventSubscriber.cpp.o /usr/bin/g++ -DBOOST_ATOMIC_DYN_LINK -DBOOST_ATOMIC_NO_LIB -DBOOST_FILESYSTEM_DYN_LINK -DBOOST_FILESYSTEM_NO_LIB -DBOOST_SERIALIZATION_DYN_LINK -DBOOST_SERIALIZATION_NO_LIB -Dinfuse_envire_EXPORTS -I/usr/pkg/include/eigen3 -isystem /usr/pkg-2026Q2/include -pipe -O3 -DNDEBUG -std=c++11 -Wall -fPIC -MD -MT CMakeFiles/infuse_envire.dir/src/events/GraphEventSubscriber.cpp.o -MF CMakeFiles/infuse_envire.dir/src/events/GraphEventSubscriber.cpp.o.d -o CMakeFiles/infuse_envire.dir/src/events/GraphEventSubscriber.cpp.o -c /local/robotpkg/var/tmp/robotpkg/wip/infuse-envire/work/infuse-envire-0.1.1/src/events/GraphEventSubscriber.cpp [ 18%] Building CXX object CMakeFiles/infuse_envire.dir/src/events/GraphEventPublisher.cpp.o /usr/bin/g++ -DBOOST_ATOMIC_DYN_LINK -DBOOST_ATOMIC_NO_LIB -DBOOST_FILESYSTEM_DYN_LINK -DBOOST_FILESYSTEM_NO_LIB -DBOOST_SERIALIZATION_DYN_LINK -DBOOST_SERIALIZATION_NO_LIB -Dinfuse_envire_EXPORTS -I/usr/pkg/include/eigen3 -isystem /usr/pkg-2026Q2/include -pipe -O3 -DNDEBUG -std=c++11 -Wall -fPIC -MD -MT CMakeFiles/infuse_envire.dir/src/events/GraphEventPublisher.cpp.o -MF CMakeFiles/infuse_envire.dir/src/events/GraphEventPublisher.cpp.o.d -o CMakeFiles/infuse_envire.dir/src/events/GraphEventPublisher.cpp.o -c /local/robotpkg/var/tmp/robotpkg/wip/infuse-envire/work/infuse-envire-0.1.1/src/events/GraphEventPublisher.cpp [ 25%] Building CXX object CMakeFiles/infuse_envire.dir/src/events/GraphEventDispatcher.cpp.o /usr/bin/g++ -DBOOST_ATOMIC_DYN_LINK -DBOOST_ATOMIC_NO_LIB -DBOOST_FILESYSTEM_DYN_LINK -DBOOST_FILESYSTEM_NO_LIB -DBOOST_SERIALIZATION_DYN_LINK -DBOOST_SERIALIZATION_NO_LIB -Dinfuse_envire_EXPORTS -I/usr/pkg/include/eigen3 -isystem /usr/pkg-2026Q2/include -pipe -O3 -DNDEBUG -std=c++11 -Wall -fPIC -MD -MT CMakeFiles/infuse_envire.dir/src/events/GraphEventDispatcher.cpp.o -MF CMakeFiles/infuse_envire.dir/src/events/GraphEventDispatcher.cpp.o.d -o CMakeFiles/infuse_envire.dir/src/events/GraphEventDispatcher.cpp.o -c /local/robotpkg/var/tmp/robotpkg/wip/infuse-envire/work/infuse-envire-0.1.1/src/events/GraphEventDispatcher.cpp [ 31%] Building CXX object CMakeFiles/infuse_envire.dir/src/graph/EnvireGraph.cpp.o /usr/bin/g++ -DBOOST_ATOMIC_DYN_LINK -DBOOST_ATOMIC_NO_LIB -DBOOST_FILESYSTEM_DYN_LINK -DBOOST_FILESYSTEM_NO_LIB -DBOOST_SERIALIZATION_DYN_LINK -DBOOST_SERIALIZATION_NO_LIB -Dinfuse_envire_EXPORTS -I/usr/pkg/include/eigen3 -isystem /usr/pkg-2026Q2/include -pipe -O3 -DNDEBUG -std=c++11 -Wall -fPIC -MD -MT CMakeFiles/infuse_envire.dir/src/graph/EnvireGraph.cpp.o -MF CMakeFiles/infuse_envire.dir/src/graph/EnvireGraph.cpp.o.d -o CMakeFiles/infuse_envire.dir/src/graph/EnvireGraph.cpp.o -c /local/robotpkg/var/tmp/robotpkg/wip/infuse-envire/work/infuse-envire-0.1.1/src/graph/EnvireGraph.cpp [ 37%] Building CXX object CMakeFiles/infuse_envire.dir/src/graph/Path.cpp.o /usr/bin/g++ -DBOOST_ATOMIC_DYN_LINK -DBOOST_ATOMIC_NO_LIB -DBOOST_FILESYSTEM_DYN_LINK -DBOOST_FILESYSTEM_NO_LIB -DBOOST_SERIALIZATION_DYN_LINK -DBOOST_SERIALIZATION_NO_LIB -Dinfuse_envire_EXPORTS -I/usr/pkg/include/eigen3 -isystem /usr/pkg-2026Q2/include -pipe -O3 -DNDEBUG -std=c++11 -Wall -fPIC -MD -MT CMakeFiles/infuse_envire.dir/src/graph/Path.cpp.o -MF CMakeFiles/infuse_envire.dir/src/graph/Path.cpp.o.d -o CMakeFiles/infuse_envire.dir/src/graph/Path.cpp.o -c /local/robotpkg/var/tmp/robotpkg/wip/infuse-envire/work/infuse-envire-0.1.1/src/graph/Path.cpp [ 43%] Building CXX object CMakeFiles/infuse_envire.dir/src/graph/TreeView.cpp.o /usr/bin/g++ -DBOOST_ATOMIC_DYN_LINK -DBOOST_ATOMIC_NO_LIB -DBOOST_FILESYSTEM_DYN_LINK -DBOOST_FILESYSTEM_NO_LIB -DBOOST_SERIALIZATION_DYN_LINK -DBOOST_SERIALIZATION_NO_LIB -Dinfuse_envire_EXPORTS -I/usr/pkg/include/eigen3 -isystem /usr/pkg-2026Q2/include -pipe -O3 -DNDEBUG -std=c++11 -Wall -fPIC -MD -MT CMakeFiles/infuse_envire.dir/src/graph/TreeView.cpp.o -MF CMakeFiles/infuse_envire.dir/src/graph/TreeView.cpp.o.d -o CMakeFiles/infuse_envire.dir/src/graph/TreeView.cpp.o -c /local/robotpkg/var/tmp/robotpkg/wip/infuse-envire/work/infuse-envire-0.1.1/src/graph/TreeView.cpp In file included from /local/robotpkg/var/tmp/robotpkg/wip/infuse-envire/work/infuse-envire-0.1.1/src/events/EdgeEvents.hpp:30, from /local/robotpkg/var/tmp/robotpkg/wip/infuse-envire/work/infuse-envire-0.1.1/src/events/GraphEventDispatcher.cpp:29: /local/robotpkg/var/tmp/robotpkg/wip/infuse-envire/work/infuse-envire-0.1.1/src/events/../graph/GraphTypes.hpp:165:28: warning: 'template<class _Arg, class _Result> struct std::unary_function' is deprecated [-Wdeprecated-declarations] 165 | struct EdgeHash : std::unary_function<typename GRAPH::edge_descriptor, std::size_t> | ^~~~~~~~~~~~~~ In file included from /usr/include/g++/string:48, from /usr/include/g++/stdexcept:39, from /local/robotpkg/var/tmp/robotpkg/wip/infuse-envire/work/infuse-envire-0.1.1/src/events/GraphEventExceptions.hpp:29, from /local/robotpkg/var/tmp/robotpkg/wip/infuse-envire/work/infuse-envire-0.1.1/src/events/GraphEvent.hpp:28, from /local/robotpkg/var/tmp/robotpkg/wip/infuse-envire/work/infuse-envire-0.1.1/src/events/GraphEventDispatcher.cpp:28: /usr/include/g++/bits/stl_function.h:117:12: note: declared here 117 | struct unary_function | ^~~~~~~~~~~~~~ /local/robotpkg/var/tmp/robotpkg/wip/infuse-envire/work/infuse-envire-0.1.1/src/events/../graph/GraphTypes.hpp:182:30: warning: 'template<class _Arg, class _Result> struct std::unary_function' is deprecated [-Wdeprecated-declarations] 182 | struct VertexHash : std::unary_function<GraphTraits::vertex_descriptor, std::size_t> { | ^~~~~~~~~~~~~~ /usr/include/g++/bits/stl_function.h:117:12: note: declared here 117 | struct unary_function | ^~~~~~~~~~~~~~ In file included from /local/robotpkg/var/tmp/robotpkg/wip/infuse-envire/work/infuse-envire-0.1.1/src/graph/TreeView.hpp:29, from /local/robotpkg/var/tmp/robotpkg/wip/infuse-envire/work/infuse-envire-0.1.1/src/graph/TreeView.cpp:27: /local/robotpkg/var/tmp/robotpkg/wip/infuse-envire/work/infuse-envire-0.1.1/src/graph/GraphTypes.hpp:165:28: warning: 'template<class _Arg, class _Result> struct std::unary_function' is deprecated [-Wdeprecated-declarations] 165 | struct EdgeHash : std::unary_function<typename GRAPH::edge_descriptor, std::size_t> | ^~~~~~~~~~~~~~ In file included from /usr/include/g++/bits/refwrap.h:39, from /usr/include/g++/vector:66, from /usr/pkg-2026Q2/include/boost/graph/adjacency_list.hpp:16, from /local/robotpkg/var/tmp/robotpkg/wip/infuse-envire/work/infuse-envire-0.1.1/src/graph/GraphTypes.hpp:29: /usr/include/g++/bits/stl_function.h:117:12: note: declared here 117 | struct unary_function | ^~~~~~~~~~~~~~ /local/robotpkg/var/tmp/robotpkg/wip/infuse-envire/work/infuse-envire-0.1.1/src/graph/GraphTypes.hpp:182:30: warning: 'template<class _Arg, class _Result> struct std::unary_function' is deprecated [-Wdeprecated-declarations] 182 | struct VertexHash : std::unary_function<GraphTraits::vertex_descriptor, std::size_t> { | ^~~~~~~~~~~~~~ /usr/include/g++/bits/stl_function.h:117:12: note: declared here 117 | struct unary_function | ^~~~~~~~~~~~~~ /local/robotpkg/var/tmp/robotpkg/wip/infuse-envire/work/infuse-envire-0.1.1/src/graph/TreeView.hpp: In member function 'void envire::core::TreeView::visitBfs(envire::core::GraphTraits::vertex_descriptor, Func)': /local/robotpkg/var/tmp/robotpkg/wip/infuse-envire/work/infuse-envire-0.1.1/src/graph/TreeView.hpp:137:18: error: 'deque' is not a member of 'std' 137 | std::deque<GraphTraits::vertex_descriptor> nodesToVisit; | ^~~~~ /local/robotpkg/var/tmp/robotpkg/wip/infuse-envire/work/infuse-envire-0.1.1/src/graph/TreeView.hpp:30:1: note: 'std::deque' is defined in header '<deque>'; did you forget to '#include <deque>'? 29 | #include "GraphTypes.hpp" +++ |+#include <deque> 30 | /local/robotpkg/var/tmp/robotpkg/wip/infuse-envire/work/infuse-envire-0.1.1/src/graph/TreeView.hpp:137:54: error: expected primary-expression before '>' token 137 | std::deque<GraphTraits::vertex_descriptor> nodesToVisit; | ^ /local/robotpkg/var/tmp/robotpkg/wip/infuse-envire/work/infuse-envire-0.1.1/src/graph/TreeView.hpp:137:56: error: 'nodesToVisit' was not declared in this scope 137 | std::deque<GraphTraits::vertex_descriptor> nodesToVisit; | ^~~~~~~~~~~~ In file included from /local/robotpkg/var/tmp/robotpkg/wip/infuse-envire/work/infuse-envire-0.1.1/src/graph/Path.hpp:28, from /local/robotpkg/var/tmp/robotpkg/wip/infuse-envire/work/infuse-envire-0.1.1/src/graph/Path.cpp:27: /local/robotpkg/var/tmp/robotpkg/wip/infuse-envire/work/infuse-envire-0.1.1/src/graph/GraphTypes.hpp:165:28: warning: 'template<class _Arg, class _Result> struct std::unary_function' is deprecated [-Wdeprecated-declarations] 165 | struct EdgeHash : std::unary_function<typename GRAPH::edge_descriptor, std::size_t> | ^~~~~~~~~~~~~~ In file included from /usr/include/g++/bits/refwrap.h:39, from /usr/include/g++/vector:66, from /usr/pkg-2026Q2/include/boost/graph/adjacency_list.hpp:16, from /local/robotpkg/var/tmp/robotpkg/wip/infuse-envire/work/infuse-envire-0.1.1/src/graph/GraphTypes.hpp:29: /usr/include/g++/bits/stl_function.h:117:12: note: declared here 117 | struct unary_function | ^~~~~~~~~~~~~~ /local/robotpkg/var/tmp/robotpkg/wip/infuse-envire/work/infuse-envire-0.1.1/src/graph/GraphTypes.hpp:182:30: warning: 'template<class _Arg, class _Result> struct std::unary_function' is deprecated [-Wdeprecated-declarations] 182 | struct VertexHash : std::unary_function<GraphTraits::vertex_descriptor, std::size_t> { | ^~~~~~~~~~~~~~ /usr/include/g++/bits/stl_function.h:117:12: note: declared here 117 | struct unary_function | ^~~~~~~~~~~~~~ [ 50%] Building CXX object CMakeFiles/infuse_envire.dir/src/items/ItemBase.cpp.o /usr/bin/g++ -DBOOST_ATOMIC_DYN_LINK -DBOOST_ATOMIC_NO_LIB -DBOOST_FILESYSTEM_DYN_LINK -DBOOST_FILESYSTEM_NO_LIB -DBOOST_SERIALIZATION_DYN_LINK -DBOOST_SERIALIZATION_NO_LIB -Dinfuse_envire_EXPORTS -I/usr/pkg/include/eigen3 -isystem /usr/pkg-2026Q2/include -pipe -O3 -DNDEBUG -std=c++11 -Wall -fPIC -MD -MT CMakeFiles/infuse_envire.dir/src/items/ItemBase.cpp.o -MF CMakeFiles/infuse_envire.dir/src/items/ItemBase.cpp.o.d -o CMakeFiles/infuse_envire.dir/src/items/ItemBase.cpp.o -c /local/robotpkg/var/tmp/robotpkg/wip/infuse-envire/work/infuse-envire-0.1.1/src/items/ItemBase.cpp In file included from /local/robotpkg/var/tmp/robotpkg/wip/infuse-envire/work/infuse-envire-0.1.1/src/graph/../events/EdgeEvents.hpp:30, from /local/robotpkg/var/tmp/robotpkg/wip/infuse-envire/work/infuse-envire-0.1.1/src/graph/Graph.hpp:33, from /local/robotpkg/var/tmp/robotpkg/wip/infuse-envire/work/infuse-envire-0.1.1/src/graph/TransformGraph.hpp:13, from /local/robotpkg/var/tmp/robotpkg/wip/infuse-envire/work/infuse-envire-0.1.1/src/graph/EnvireGraph.hpp:38, from /local/robotpkg/var/tmp/robotpkg/wip/infuse-envire/work/infuse-envire-0.1.1/src/graph/EnvireGraph.cpp:28: /local/robotpkg/var/tmp/robotpkg/wip/infuse-envire/work/infuse-envire-0.1.1/src/graph/../events/../graph/GraphTypes.hpp:165:28: warning: 'template<class _Arg, class _Result> struct std::unary_function' is deprecated [-Wdeprecated-declarations] 165 | struct EdgeHash : std::unary_function<typename GRAPH::edge_descriptor, std::size_t> | ^~~~~~~~~~~~~~ In file included from /usr/include/g++/unordered_set:44, from /local/robotpkg/var/tmp/robotpkg/wip/infuse-envire/work/infuse-envire-0.1.1/src/graph/EnvireGraph.hpp:32: /usr/include/g++/bits/stl_function.h:117:12: note: declared here 117 | struct unary_function | ^~~~~~~~~~~~~~ /local/robotpkg/var/tmp/robotpkg/wip/infuse-envire/work/infuse-envire-0.1.1/src/graph/../events/../graph/GraphTypes.hpp:182:30: warning: 'template<class _Arg, class _Result> struct std::unary_function' is deprecated [-Wdeprecated-declarations] 182 | struct VertexHash : std::unary_function<GraphTraits::vertex_descriptor, std::size_t> { | ^~~~~~~~~~~~~~ /usr/include/g++/bits/stl_function.h:117:12: note: declared here 117 | struct unary_function | ^~~~~~~~~~~~~~ gmake[2]: *** [CMakeFiles/infuse_envire.dir/build.make:166: CMakeFiles/infuse_envire.dir/src/graph/TreeView.cpp.o] Error 1 gmake[2]: *** Waiting for unfinished jobs.... /local/robotpkg/var/tmp/robotpkg/wip/infuse-envire/work/infuse-envire-0.1.1/src/graph/Graph.hpp: In instantiation of 'void envire::core::Graph<FRAME_PROP, EDGE_PROP>::add_edge(vertex_descriptor, vertex_descriptor, const E&) [with FRAME_PROP = envire::core::Frame; EDGE_PROP = envire::core::Transform; vertex_descriptor = void*]': /local/robotpkg/var/tmp/robotpkg/wip/infuse-envire/work/infuse-envire-0.1.1/src/graph/Graph.hpp:671:20: required from 'void envire::core::Graph<FRAME_PROP, EDGE_PROP>::add_edge(const envire::core::FrameId&, const envire::core::FrameId&, const E&) [with FRAME_PROP = envire::core::Frame; EDGE_PROP = envire::core::Transform; envire::core::FrameId = std::__cxx11::basic_string<char>]' /local/robotpkg/var/tmp/robotpkg/wip/infuse-envire/work/infuse-envire-0.1.1/src/graph/TransformGraph.hpp:271:17: required from 'void envire::core::TransformGraph<FRAME_PROP>::addTransform(const envire::core::FrameId&, const envire::core::FrameId&, const envire::core::Transform&) [with FRAME_PROP = envire::core::Frame; envire::core::FrameId = std::__cxx11::basic_string<char>]' /local/robotpkg/var/tmp/robotpkg/wip/infuse-envire/work/infuse-envire-0.1.1/src/graph/EnvireGraph.cpp:322:37: required from here /local/robotpkg/var/tmp/robotpkg/wip/infuse-envire/work/infuse-envire-0.1.1/src/graph/Graph.hpp:638:14: warning: variable 'edge_pair_inv' set but not used [-Wunused-but-set-variable] 638 | EdgePair edge_pair_inv = boost::add_edge(target, origin, edgeProperty.inverse(), *this); | ^~~~~~~~~~~~~ gmake[2]: Leaving directory '/local/robotpkg/var/tmp/robotpkg/wip/infuse-envire/work/infuse-envire-0.1.1' gmake[1]: Leaving directory '/local/robotpkg/var/tmp/robotpkg/wip/infuse-envire/work/infuse-envire-0.1.1' gmake[1]: *** [CMakeFiles/Makefile2:90: CMakeFiles/infuse_envire.dir/all] Error 2 gmake: *** [Makefile:139: all] Error 2