robotpkg/wip/infuse-envire bulk build results
Log for infuse-envire-0.1.1 on Fedora-44-x86_64: build.log (Back)
--- Environment ---
EXPECT_TARGETS=package
_overrides_pkgtools_pkg_install_PKGREQD=pkg_install>=20110805.12 pkg_install>=20110805.12 pkg_install>=20110805.12
PKG_CONFIG_PATH=
BULKBASE=/opt/openrobots
CPP=/usr/bin/gcc -E
TAR=/usr/bin/tar
_override_vars_wip_infuse_envire=PKGREQD
LC_MONETARY=C
_override_vars_pkgtools_tnftp=PKGREQD PKGREQD
OPSYS=Fedora
_override_vars_math_eigen3=PKGREQD PKGREQD PKGREQD
ECHO_N=echo -n
PWD=/local/robotpkg/var/lib/robotpkg/wip/infuse-envire
DIGEST=/opt/openrobots/sbin/robotpkg_digest
LOCALBASE=/opt/openrobots
CXX=/usr/bin/g++
PAX=/usr/bin/pax
CXXCPP=/usr/bin/g++ -E
RPM_ARCH=x86_64
MACHINE_PLATFORM=Fedora-44-x86_64
CMAKE=/usr/bin/cmake
LANG=C
OWNER_GID=robots
BULK_LOGDIR=/local/robotpkg/var/log/bulk
MACHINE_KERNEL=Linux-7.2.5-200.fc44.x86_64-x86_64
ROBOTPKG_TRUSTED_ENV=robotpkg
_overrides_math_eigen3_PKGREQD=eigen3>=3.3 eigen3>=3.3 eigen3>=3.3
ROBOTPKG_BASE=/local/robotpkg
_overrides_pkgtools_digest_PKGREQD=digest>=20080510 digest>=20080510
RPM_PACKAGE_RELEASE=
_ROBOTPKG_NOW=0918073442
PKG_DBDIR=/opt/openrobots/var/db/robotpkg
PKG_CONFIG_LIBDIR=/usr/lib64/pkgconfig:/usr/share/pkgconfig
RECURSIVE_PKGPATH=wip/infuse-envire
GXX=/usr/bin/g++
OS_VERSION=44
MFLAGS=--no-print-directory
GZIP_CMD=/usr/bin/gzip
tag=Fedora-44-x86_64
ZCAT=/usr/bin/zcat
MAKEFLAGS= --no-print-directory -- PKGREQD.cmdline=infuse-envire-0.1.1~!doc RECURSIVE_PKGPATH=wip/infuse-envire\ tag=Fedora-44-x86_64 BULK_LOGDIR=/local/robotpkg/var/log/bulk BULKBASE=/opt/openrobots LOCALBASE=/opt/openrobots PKG_DBDIR=/opt/openrobots/var/db/robotpkg EXPECT_TARGETS=package
_override_vars_pkgtools_digest=PKGREQD PKGREQD
_override_vars_archivers_pax=PKGREQD PKGREQD
LOWER_OS_KERNEL=linux
LOWER_OS_VERSION=44
ROBOTPKG_DIR=/local/robotpkg/var/lib/robotpkg
SHLVL=4
GCC=/usr/bin/gcc
MAKELEVEL=4
OWNER_UID=rbulk
LC_MESSAGES=C
rm=
MAKECONF=/opt/robotpkg/etc/robotpkg-wip.conf
hline="$bf======================================================================$rm"
_overrides_wip_infuse_envire_PKGREQD=infuse-envire-0.1.1~!doc
LC_CTYPE=C
MACHINE_ARCH=x86_64
OS_KERNEL_VERSION=7.2.5-200.fc44.x86_64
RPM_PACKAGE_VERSION=
LC_TIME=C
TNFTP=/opt/openrobots/sbin/tnftp
FC=false
LOWER_OPSYS=fedora
LC_COLLATE=C
LOWER_ARCH=x86_64
PATH=/usr/local/bin:/usr/bin
_overrides_archivers_pax_PKGREQD=pax pax
NODENAME=hydra64-fedora44
CC=/usr/bin/gcc
PKGTOOLS_VERSION=20211115.4
bf=
_override_vars_pkgtools_pkg_install=PKGREQD PKGREQD PKGREQD
_overrides_pkgtools_tnftp_PKGREQD=tnftp>=20091122 tnftp>=20091122
RPM_PACKAGE_NAME=robotpkg-infuse-envire
OS_KERNEL=Linux
LC_NUMERIC=C
OLDPWD=/local/robotpkg/var/lib/robotpkg/wip/py-dynamic-graph-tutorial
PKG_CONFIG=/usr/bin/pkg-config
_=/usr/bin/env
---
Running set -e; cd /local/robotpkg/var/tmp/robotpkg/wip/infuse-envire/work/infuse-envire-0.1.1 && cd '/local/robotpkg/var/tmp/robotpkg/wip/infuse-envire/work/infuse-envire-0.1.1' && /usr/bin/env MAKE=make MAKELEVEL= 'CPPFLAGS=' 'CFLAGS=-pipe -O3 -DNDEBUG' 'LDFLAGS=' 'CXXFLAGS=-pipe -O3 -DNDEBUG' PREFIX='/opt/openrobots' HOME=/local/robotpkg/var/tmp/robotpkg/wip/infuse-envire/work PATH='/opt/openrobots/sbin:/usr/local/bin:/usr/bin' LD_LIBRARY_PATH='' LOCALBASE=/opt/openrobots PKGMANDIR=man make -j4 -f Makefile all
/usr/bin/cmake -S/local/robotpkg/var/tmp/robotpkg/wip/infuse-envire/work/infuse-envire-0.1.1 -B/local/robotpkg/var/tmp/robotpkg/wip/infuse-envire/work/infuse-envire-0.1.1 --check-build-system CMakeFiles/Makefile.cmake 0
/usr/bin/cmake -E cmake_progress_start /local/robotpkg/var/tmp/robotpkg/wip/infuse-envire/work/infuse-envire-0.1.1/CMakeFiles /local/robotpkg/var/tmp/robotpkg/wip/infuse-envire/work/infuse-envire-0.1.1//CMakeFiles/progress.marks
make -f CMakeFiles/Makefile2 all
make[1]: Entering directory '/local/robotpkg/var/tmp/robotpkg/wip/infuse-envire/work/infuse-envire-0.1.1'
make -f CMakeFiles/infuse_envire.dir/build.make CMakeFiles/infuse_envire.dir/depend
make[2]: Entering directory '/local/robotpkg/var/tmp/robotpkg/wip/infuse-envire/work/infuse-envire-0.1.1'
cd /local/robotpkg/var/tmp/robotpkg/wip/infuse-envire/work/infuse-envire-0.1.1 && /usr/bin/cmake -E cmake_depends "Unix Makefiles" /local/robotpkg/var/tmp/robotpkg/wip/infuse-envire/work/infuse-envire-0.1.1 /local/robotpkg/var/tmp/robotpkg/wip/infuse-envire/work/infuse-envire-0.1.1 /local/robotpkg/var/tmp/robotpkg/wip/infuse-envire/work/infuse-envire-0.1.1 /local/robotpkg/var/tmp/robotpkg/wip/infuse-envire/work/infuse-envire-0.1.1 /local/robotpkg/var/tmp/robotpkg/wip/infuse-envire/work/infuse-envire-0.1.1/CMakeFiles/infuse_envire.dir/DependInfo.cmake "--color=" infuse_envire
make[2]: Leaving directory '/local/robotpkg/var/tmp/robotpkg/wip/infuse-envire/work/infuse-envire-0.1.1'
make -f CMakeFiles/infuse_envire.dir/build.make CMakeFiles/infuse_envire.dir/build
make[2]: Entering directory '/local/robotpkg/var/tmp/robotpkg/wip/infuse-envire/work/infuse-envire-0.1.1'
[ 6%] Building CXX object CMakeFiles/infuse_envire.dir/src/events/GraphEventDispatcher.cpp.o
[ 12%] Building CXX object CMakeFiles/infuse_envire.dir/src/events/GraphEventSubscriber.cpp.o
[ 18%] Building CXX object CMakeFiles/infuse_envire.dir/src/events/GraphEventPublisher.cpp.o
[ 25%] Building CXX object CMakeFiles/infuse_envire.dir/src/events/GraphEvent.cpp.o
/usr/bin/g++ -DBOOST_FILESYSTEM_DYN_LINK -DBOOST_FILESYSTEM_NO_LIB -DBOOST_SERIALIZATION_DYN_LINK -DBOOST_SERIALIZATION_NO_LIB -Dinfuse_envire_EXPORTS -pipe -O3 -DNDEBUG -std=c++11 -Wall -fPIC -MD -MT CMakeFiles/infuse_envire.dir/src/events/GraphEventSubscriber.cpp.o -MF CMakeFiles/infuse_envire.dir/src/events/GraphEventSubscriber.cpp.o.d -o CMakeFiles/infuse_envire.dir/src/events/GraphEventSubscriber.cpp.o -c /local/robotpkg/var/tmp/robotpkg/wip/infuse-envire/work/infuse-envire-0.1.1/src/events/GraphEventSubscriber.cpp
/usr/bin/g++ -DBOOST_FILESYSTEM_DYN_LINK -DBOOST_FILESYSTEM_NO_LIB -DBOOST_SERIALIZATION_DYN_LINK -DBOOST_SERIALIZATION_NO_LIB -Dinfuse_envire_EXPORTS -pipe -O3 -DNDEBUG -std=c++11 -Wall -fPIC -MD -MT CMakeFiles/infuse_envire.dir/src/events/GraphEventDispatcher.cpp.o -MF CMakeFiles/infuse_envire.dir/src/events/GraphEventDispatcher.cpp.o.d -o CMakeFiles/infuse_envire.dir/src/events/GraphEventDispatcher.cpp.o -c /local/robotpkg/var/tmp/robotpkg/wip/infuse-envire/work/infuse-envire-0.1.1/src/events/GraphEventDispatcher.cpp
/usr/bin/g++ -DBOOST_FILESYSTEM_DYN_LINK -DBOOST_FILESYSTEM_NO_LIB -DBOOST_SERIALIZATION_DYN_LINK -DBOOST_SERIALIZATION_NO_LIB -Dinfuse_envire_EXPORTS -pipe -O3 -DNDEBUG -std=c++11 -Wall -fPIC -MD -MT CMakeFiles/infuse_envire.dir/src/events/GraphEvent.cpp.o -MF CMakeFiles/infuse_envire.dir/src/events/GraphEvent.cpp.o.d -o CMakeFiles/infuse_envire.dir/src/events/GraphEvent.cpp.o -c /local/robotpkg/var/tmp/robotpkg/wip/infuse-envire/work/infuse-envire-0.1.1/src/events/GraphEvent.cpp
/usr/bin/g++ -DBOOST_FILESYSTEM_DYN_LINK -DBOOST_FILESYSTEM_NO_LIB -DBOOST_SERIALIZATION_DYN_LINK -DBOOST_SERIALIZATION_NO_LIB -Dinfuse_envire_EXPORTS -pipe -O3 -DNDEBUG -std=c++11 -Wall -fPIC -MD -MT CMakeFiles/infuse_envire.dir/src/events/GraphEventPublisher.cpp.o -MF CMakeFiles/infuse_envire.dir/src/events/GraphEventPublisher.cpp.o.d -o CMakeFiles/infuse_envire.dir/src/events/GraphEventPublisher.cpp.o -c /local/robotpkg/var/tmp/robotpkg/wip/infuse-envire/work/infuse-envire-0.1.1/src/events/GraphEventPublisher.cpp
[ 31%] Building CXX object CMakeFiles/infuse_envire.dir/src/graph/EnvireGraph.cpp.o
/usr/bin/g++ -DBOOST_FILESYSTEM_DYN_LINK -DBOOST_FILESYSTEM_NO_LIB -DBOOST_SERIALIZATION_DYN_LINK -DBOOST_SERIALIZATION_NO_LIB -Dinfuse_envire_EXPORTS -pipe -O3 -DNDEBUG -std=c++11 -Wall -fPIC -MD -MT CMakeFiles/infuse_envire.dir/src/graph/EnvireGraph.cpp.o -MF CMakeFiles/infuse_envire.dir/src/graph/EnvireGraph.cpp.o.d -o CMakeFiles/infuse_envire.dir/src/graph/EnvireGraph.cpp.o -c /local/robotpkg/var/tmp/robotpkg/wip/infuse-envire/work/infuse-envire-0.1.1/src/graph/EnvireGraph.cpp
[ 37%] Building CXX object CMakeFiles/infuse_envire.dir/src/graph/Path.cpp.o
/usr/bin/g++ -DBOOST_FILESYSTEM_DYN_LINK -DBOOST_FILESYSTEM_NO_LIB -DBOOST_SERIALIZATION_DYN_LINK -DBOOST_SERIALIZATION_NO_LIB -Dinfuse_envire_EXPORTS -pipe -O3 -DNDEBUG -std=c++11 -Wall -fPIC -MD -MT CMakeFiles/infuse_envire.dir/src/graph/Path.cpp.o -MF CMakeFiles/infuse_envire.dir/src/graph/Path.cpp.o.d -o CMakeFiles/infuse_envire.dir/src/graph/Path.cpp.o -c /local/robotpkg/var/tmp/robotpkg/wip/infuse-envire/work/infuse-envire-0.1.1/src/graph/Path.cpp
[ 43%] Building CXX object CMakeFiles/infuse_envire.dir/src/graph/TreeView.cpp.o
/usr/bin/g++ -DBOOST_FILESYSTEM_DYN_LINK -DBOOST_FILESYSTEM_NO_LIB -DBOOST_SERIALIZATION_DYN_LINK -DBOOST_SERIALIZATION_NO_LIB -Dinfuse_envire_EXPORTS -pipe -O3 -DNDEBUG -std=c++11 -Wall -fPIC -MD -MT CMakeFiles/infuse_envire.dir/src/graph/TreeView.cpp.o -MF CMakeFiles/infuse_envire.dir/src/graph/TreeView.cpp.o.d -o CMakeFiles/infuse_envire.dir/src/graph/TreeView.cpp.o -c /local/robotpkg/var/tmp/robotpkg/wip/infuse-envire/work/infuse-envire-0.1.1/src/graph/TreeView.cpp
In file included from /local/robotpkg/var/tmp/robotpkg/wip/infuse-envire/work/infuse-envire-0.1.1/src/graph/../items/../base-types/Pose.hpp:4,
from /local/robotpkg/var/tmp/robotpkg/wip/infuse-envire/work/infuse-envire-0.1.1/src/graph/../items/../base-types/TransformWithCovariance.hpp:4,
from /local/robotpkg/var/tmp/robotpkg/wip/infuse-envire/work/infuse-envire-0.1.1/src/graph/../items/Transform.hpp:38,
from /local/robotpkg/var/tmp/robotpkg/wip/infuse-envire/work/infuse-envire-0.1.1/src/graph/Path.hpp:29,
from /local/robotpkg/var/tmp/robotpkg/wip/infuse-envire/work/infuse-envire-0.1.1/src/graph/Path.cpp:27:
/local/robotpkg/var/tmp/robotpkg/wip/infuse-envire/work/infuse-envire-0.1.1/src/graph/../items/../base-types/Eigen.hpp:4:10: fatal error: Eigen/Core: No such file or directory
4 | #include <Eigen/Core>
| ^~~~~~~~~~~~
compilation terminated.
make[2]: *** [CMakeFiles/infuse_envire.dir/build.make:152: CMakeFiles/infuse_envire.dir/src/graph/Path.cpp.o] Error 1
make[2]: *** Waiting for unfinished jobs....
In file included from /local/robotpkg/var/tmp/robotpkg/wip/infuse-envire/work/infuse-envire-0.1.1/src/graph/../items/../base-types/Pose.hpp:4,
from /local/robotpkg/var/tmp/robotpkg/wip/infuse-envire/work/infuse-envire-0.1.1/src/graph/../items/../base-types/TransformWithCovariance.hpp:4,
from /local/robotpkg/var/tmp/robotpkg/wip/infuse-envire/work/infuse-envire-0.1.1/src/graph/../items/Transform.hpp:38,
from /local/robotpkg/var/tmp/robotpkg/wip/infuse-envire/work/infuse-envire-0.1.1/src/graph/Path.hpp:29,
from /local/robotpkg/var/tmp/robotpkg/wip/infuse-envire/work/infuse-envire-0.1.1/src/graph/Graph.hpp:43,
from /local/robotpkg/var/tmp/robotpkg/wip/infuse-envire/work/infuse-envire-0.1.1/src/graph/TransformGraph.hpp:13,
from /local/robotpkg/var/tmp/robotpkg/wip/infuse-envire/work/infuse-envire-0.1.1/src/graph/EnvireGraph.hpp:38,
from /local/robotpkg/var/tmp/robotpkg/wip/infuse-envire/work/infuse-envire-0.1.1/src/graph/EnvireGraph.cpp:28:
/local/robotpkg/var/tmp/robotpkg/wip/infuse-envire/work/infuse-envire-0.1.1/src/graph/../items/../base-types/Eigen.hpp:4:10: fatal error: Eigen/Core: No such file or directory
4 | #include <Eigen/Core>
| ^~~~~~~~~~~~
compilation terminated.
make[2]: *** [CMakeFiles/infuse_envire.dir/build.make:138: CMakeFiles/infuse_envire.dir/src/graph/EnvireGraph.cpp.o] Error 1
In file included from /local/robotpkg/var/tmp/robotpkg/wip/infuse-envire/work/infuse-envire-0.1.1/src/events/EdgeEvents.hpp:30,
from /local/robotpkg/var/tmp/robotpkg/wip/infuse-envire/work/infuse-envire-0.1.1/src/events/GraphEventDispatcher.cpp:29:
/local/robotpkg/var/tmp/robotpkg/wip/infuse-envire/work/infuse-envire-0.1.1/src/events/../graph/GraphTypes.hpp:165:28: warning: 'template<class _Arg, class _Result> struct std::unary_function' is deprecated [-Wdeprecated-declarations]
165 | struct EdgeHash : std::unary_function<typename GRAPH::edge_descriptor, std::size_t>
| ^~~~~~~~~~~~~~
In file included from /usr/include/c++/16/string:52,
from /usr/include/c++/16/stdexcept:41,
from /local/robotpkg/var/tmp/robotpkg/wip/infuse-envire/work/infuse-envire-0.1.1/src/events/GraphEventExceptions.hpp:29,
from /local/robotpkg/var/tmp/robotpkg/wip/infuse-envire/work/infuse-envire-0.1.1/src/events/GraphEvent.hpp:28,
from /local/robotpkg/var/tmp/robotpkg/wip/infuse-envire/work/infuse-envire-0.1.1/src/events/GraphEventDispatcher.cpp:28:
/usr/include/c++/16/bits/stl_function.h:120:12: note: declared here
120 | struct unary_function
| ^~~~~~~~~~~~~~
/local/robotpkg/var/tmp/robotpkg/wip/infuse-envire/work/infuse-envire-0.1.1/src/events/../graph/GraphTypes.hpp:182:30: warning: 'template<class _Arg, class _Result> struct std::unary_function' is deprecated [-Wdeprecated-declarations]
182 | struct VertexHash : std::unary_function<GraphTraits::vertex_descriptor, std::size_t> {
| ^~~~~~~~~~~~~~
/usr/include/c++/16/bits/stl_function.h:120:12: note: declared here
120 | struct unary_function
| ^~~~~~~~~~~~~~
In file included from /local/robotpkg/var/tmp/robotpkg/wip/infuse-envire/work/infuse-envire-0.1.1/src/graph/TreeView.hpp:29,
from /local/robotpkg/var/tmp/robotpkg/wip/infuse-envire/work/infuse-envire-0.1.1/src/graph/TreeView.cpp:27:
/local/robotpkg/var/tmp/robotpkg/wip/infuse-envire/work/infuse-envire-0.1.1/src/graph/GraphTypes.hpp:165:28: warning: 'template<class _Arg, class _Result> struct std::unary_function' is deprecated [-Wdeprecated-declarations]
165 | struct EdgeHash : std::unary_function<typename GRAPH::edge_descriptor, std::size_t>
| ^~~~~~~~~~~~~~
In file included from /usr/include/c++/16/bits/predefined_ops.h:33,
from /usr/include/c++/16/bits/stl_algobase.h:70,
from /usr/include/c++/16/vector:64,
from /usr/include/boost/graph/adjacency_list.hpp:16,
from /local/robotpkg/var/tmp/robotpkg/wip/infuse-envire/work/infuse-envire-0.1.1/src/graph/GraphTypes.hpp:29:
/usr/include/c++/16/bits/stl_function.h:120:12: note: declared here
120 | struct unary_function
| ^~~~~~~~~~~~~~
/local/robotpkg/var/tmp/robotpkg/wip/infuse-envire/work/infuse-envire-0.1.1/src/graph/GraphTypes.hpp:182:30: warning: 'template<class _Arg, class _Result> struct std::unary_function' is deprecated [-Wdeprecated-declarations]
182 | struct VertexHash : std::unary_function<GraphTraits::vertex_descriptor, std::size_t> {
| ^~~~~~~~~~~~~~
/usr/include/c++/16/bits/stl_function.h:120:12: note: declared here
120 | struct unary_function
| ^~~~~~~~~~~~~~
/local/robotpkg/var/tmp/robotpkg/wip/infuse-envire/work/infuse-envire-0.1.1/src/graph/TreeView.hpp: In member function 'void envire::core::TreeView::visitBfs(envire::core::GraphTraits::vertex_descriptor, Func)':
/local/robotpkg/var/tmp/robotpkg/wip/infuse-envire/work/infuse-envire-0.1.1/src/graph/TreeView.hpp:137:18: error: 'deque' is not a member of 'std' [-Wtemplate-body]
137 | std::deque<GraphTraits::vertex_descriptor> nodesToVisit;
| ^~~~~
/local/robotpkg/var/tmp/robotpkg/wip/infuse-envire/work/infuse-envire-0.1.1/src/graph/TreeView.hpp:30:1: note: 'std::deque' is defined in header '<deque>'; this is probably fixable by adding '#include <deque>'
29 | #include "GraphTypes.hpp"
+++ |+#include <deque>
30 |
/local/robotpkg/var/tmp/robotpkg/wip/infuse-envire/work/infuse-envire-0.1.1/src/graph/TreeView.hpp:137:54: error: expected primary-expression before '>' token [-Wtemplate-body]
137 | std::deque<GraphTraits::vertex_descriptor> nodesToVisit;
| ^
/local/robotpkg/var/tmp/robotpkg/wip/infuse-envire/work/infuse-envire-0.1.1/src/graph/TreeView.hpp:137:56: error: 'nodesToVisit' was not declared in this scope [-Wtemplate-body]
137 | std::deque<GraphTraits::vertex_descriptor> nodesToVisit;
| ^~~~~~~~~~~~
make[2]: *** [CMakeFiles/infuse_envire.dir/build.make:166: CMakeFiles/infuse_envire.dir/src/graph/TreeView.cpp.o] Error 1
make[2]: Leaving directory '/local/robotpkg/var/tmp/robotpkg/wip/infuse-envire/work/infuse-envire-0.1.1'
make[1]: Leaving directory '/local/robotpkg/var/tmp/robotpkg/wip/infuse-envire/work/infuse-envire-0.1.1'
make[1]: *** [CMakeFiles/Makefile2:90: CMakeFiles/infuse_envire.dir/all] Error 2
make: *** [Makefile:139: all] Error 2