| Platform | Status | Date | Time | Log files | ||||||||
|---|---|---|---|---|---|---|---|---|---|---|---|---|
| Start | Total | broken | build | bulk | cbbh | cbbhby | cmake | configure | extract | |||
| Debian-11-x86_64 | N/A | 2026/09/16 | 01:44:51 | 00:00:02 | View | View | cmake>=3.22 | |||||
| Debian-12-x86_64 | OK | 2026/09/10 | 13:22:19 | 00:00:38 | ||||||||
| Debian-13-x86_64 | OK | 2026/09/10 | 09:54:58 | 00:00:37 | ||||||||
| Fedora-42-x86_64 | OK | 2026/09/10 | 11:48:58 | 00:00:37 | ||||||||
| Fedora-44-x86_64 | Broken | 2026/09/16 | 15:49:58 | 00:00:04 | make: *** [package] Error 2
| View | View | View | View | |||
| NetBSD-11-x86_64 | Broken | 2026/09/16 | 15:55:02 | 00:00:03 | /usr/pkg/bin/gmake: *** [package] Error 2
| View | View | View | View | |||
| Rocky-10-x86_64 | Broken | 2026/09/16 | 01:57:42 | 00:00:17 | make: *** [package] Error 2
| View | View | View | View | View | ||
| Rocky-8-x86_64 | OK | 2026/09/10 | 08:33:09 | 00:00:41 | ||||||||
| Ubuntu-20.04-x86_64 | N/A | 2026/09/16 | 15:54:39 | 00:00:03 | View | View | cmake>=3.22 | |||||
| Ubuntu-22.04-x86_64 | OK | 2026/09/10 | 13:42:12 | 00:00:39 | ||||||||
| Ubuntu-24.04-x86_64 | OK | 2026/09/10 | 12:32:49 | 00:00:38 | ||||||||
| Ubuntu-26.04-x86_64 | Broken | 2026/09/16 | 15:54:37 | 00:00:03 | make: *** [package] Error 2
| View | View | View | View | |||