robotpkg/wip/backward-ros bulk build results

Log for backward-ros-0.1.7 on CentOS-7-x86_64: bulk.log (Back)

=> Checking for clear installation ===> Installing bootstrap dependencies for backward-ros-0.1.7 => Installing /opt/robotpkg/var/lib/robotpkg/packages/bsd/CentOS-7-x86_64/All/digest-20080510.tgz => Installing /opt/robotpkg/var/lib/robotpkg/packages/bsd/CentOS-7-x86_64/All/tnftp-20151004~ssl.tgz ===> Checking bootstrap dependencies for backward-ros-0.1.7 => Required robotpkg package digest>=20080510: digest-20080510 found => Required robotpkg package tnftp>=20130505~ssl: tnftp-20151004~ssl found => Required system package gzip: gzip-1.5 found => Required system package pax and tar archivers: pax found => Required system package pkg_install>=20110805.9: pkg_install-20110805.9 found ===> Done bootstrap-depends for backward-ros-0.1.7 ===> Installing full dependencies for backward-ros-0.1.7 => Dependency digest-20080510 already installed => Installing /opt/robotpkg/var/lib/robotpkg/packages/bsd/CentOS-7-x86_64/All/py27-catkin-pkg-0.4.8.tgz => Installing /opt/robotpkg/var/lib/robotpkg/packages/bsd/CentOS-7-x86_64/All/py27-ros-catkin-0.7.16r1.tgz To use ros, the following environment variables must contain those values: ROS_MASTER_URI http://localhost:11311 ROS_PACKAGE_PATH /opt/openrobots/share PYTHONPATH /opt/openrobots/lib/python2.7/site-packages PATH /opt/openrobots/bin As an alternative to the above configuration, commands can be executed by using the `env.sh' wrapper. For instance, roscore can be started like so: /opt/openrobots/etc/ros/env.sh roscore In Bourne shell scripts, the following file can be sourced instead: /opt/openrobots/etc/ros/setup.sh => Installing /opt/robotpkg/var/lib/robotpkg/packages/bsd/CentOS-7-x86_64/All/ros-comm-1.14.3r3.tgz => Dependency tnftp-20151004~ssl already installed ===> Checking build options for backward-ros-0.1.7 => Building with no option. ===> Checking alternatives for backward-ros-0.1.7 => Use the GNU C++ compiler: c++-compiler provided by g++>=3 => Use the GNU C compiler: c-compiler provided by gcc>=3 => Use python-2.7: python>=2.5<3.9 provided by python27>=2.7<2.8 => Use ros melodic: ros>=groovy provided by ros-melodic ===> Checking dependencies for backward-ros-0.1.7 => Required system package cmake>=2.8.3: cmake-2.8.12.2 found => Required system package g++>=3: g++-4.8.5 found => Required system package gcc>=3: gcc-4.8.5 found => Required system package googletest: googletest found => Required system package libstdc++: libstdc++ found => Required system package pkg-config>=0.22: pkg-config-0.27.1 found => Required system package py27-empy>=3: py27-empy-3.3.2 found => Required system package py27-nose>=0.10: py27-nose-1.3.7 found => Required system package py27-pyparsing>=1: py27-pyparsing-1.5.6 found => Required system package python27>=2.7<2.8: python27-2.7.5 found => Required robotpkg package py27-catkin-pkg>=0.2: py27-catkin-pkg-0.4.8 found => Required robotpkg package py27-ros-catkin>=0.7<0.8: py27-ros-catkin-0.7.16r1 found => Required robotpkg package ros-comm>=1.13<1.15: ros-comm-1.14.3r3 found ===> Done depends for backward-ros-0.1.7 ===> Extracting for backward-ros-0.1.7 => SHA1 checksums OK => RMD160 checksums OK ===> Configuring for backward-ros-0.1.7 CMake Error at cmake/BackwardConfig.cmake:146 (add_library): Cannot find source file: INTERFACE Tried extensions .c .C .c++ .cc .cpp .cxx .m .M .mm .h .hh .h++ .hm .hpp .hxx .in .txx Call Stack (most recent call first): CMakeLists.txt:34 (include) CMake Error in CMakeLists.txt: Cannot find source file: IMPORTED Tried extensions .c .C .c++ .cc .cpp .cxx .m .M .mm .h .hh .h++ .hm .hpp .hxx .in .txx An unexpected error occured. The last 10 log lines are shown below. | CMake Error in CMakeLists.txt: | Cannot find source file: | | IMPORTED | | Tried extensions .c .C .c++ .cc .cpp .cxx .m .M .mm .h .hh .h++ .hm .hpp | .hxx .in .txx | | | -- Build files have been written to: /local/robotpkg/var/tmp/robotpkg/wip/backward-ros/work/backward_ros-0.1.7 For details or bug reports, check the complete log file in: /local/robotpkg/var/tmp/robotpkg/wip/backward-ros/work/configure.log make[3]: *** [do-configure-cmake] Error 1 make[2]: *** [pkg-check-installed] Error 2 => Marking backward-ros-0.1.7 as broken ERROR: make: *** [package] Error 2 ===> Deinstalling for backward-ros Removed digest-20080510 Removing dependency py27-rosdistro-0.3.5 Removing dependency py27-rosdep-0.10.30 Removing dependency py27-ros-catkin-0.7.16r1 Removing dependency ros-rospack-2.5.1 Removing dependency ros-roscpp-core-0.6.11 Removing dependency ros-genmsg-0.5.11 Removing dependency ros-ros-1.14.4r1 Removing dependency ros-console-1.13.7 Removing dependency ros-gennodejs-2.0.1 Removing dependency ros-genlisp-0.4.16 Removing dependency ros-geneus-2.2.6 Removing dependency ros-gencpp-0.6.0 Removing dependency ros-genpy-0.6.7 Removing dependency ros-message-runtime-0.4.12 Removing dependency ros-message-generation-0.4.0 Removing dependency ros-std-msgs-0.5.11 Removing dependency ros-comm-msgs-1.11.2r1 Removing dependency ros-class-loader-0.4.1 Removing dependency ros-pluginlib-1.12.1 Removing dependency ros-comm-1.14.3r3 Removed py27-catkin-pkg-0.4.8 Removed tnftp-20151004~ssl