robotpkg/wip/aruco-ros bulk build results

aruco-ros-0.2.4 (category wip or summary)

Platform Status Date Time Log files
Start Total brokenbulkcbbhcbbhbycmakeconfigureextract
Debian-11-x86_64Broken2026/09/3020:53:2400:00:10
make: *** [package] Error 2
ViewViewViewView
Debian-12-x86_64Broken2026/09/3021:25:0500:00:08
make: *** [package] Error 2
ViewViewViewView
Debian-13-x86_64Broken2026/09/3021:35:4000:00:08
make: *** [package] Error 2
ViewViewViewView
Fedora-42-x86_64Broken2026/09/3021:41:1800:00:10
make: *** [package] Error 2
ViewViewViewView
Fedora-44-x86_64Broken2026/09/3021:03:0200:00:09
make: *** [package] Error 2
ViewViewViewView
NetBSD-11-x86_64Broken2026/09/3021:40:5900:00:12
/usr/pkg/bin/gmake: *** [package] Error 2
ViewViewViewView
Rocky-10-x86_64N/A2026/09/3021:06:3100:00:04ViewView
poco>=1
Rocky-8-x86_64N/A2026/09/3021:33:3300:00:04ViewView
poco>=1
Ubuntu-20.04-x86_64Broken2026/09/3021:14:1300:00:20
make: *** [package] Error 2
ViewViewViewView
Ubuntu-22.04-x86_64Broken2026/09/3021:33:3600:00:13
make: *** [package] Error 2
ViewViewViewView
Ubuntu-24.04-x86_64Broken2026/09/3021:25:1300:00:09
make: *** [package] Error 2
ViewViewViewView
Ubuntu-26.04-x86_64Broken2026/09/3021:11:0300:00:09
make: *** [package] Error 2
ViewViewViewView