| Platform | Status | Date | Time | Log files | |||||
|---|---|---|---|---|---|---|---|---|---|
| Start | Total | broken | bulk | cbbh | cbbhby | fetch | |||
| Debian-11-x86_64 | N/A | 2026/09/16 | 01:50:21 | 00:00:01 | View | View | cmake>=3.22 | ||
| Debian-12-x86_64 | Broken | 2026/09/16 | 01:48:02 | 00:00:02 | make: *** [package] Error 2
| View | View | ||
| Debian-13-x86_64 | Broken | 2026/09/16 | 01:47:55 | 00:00:03 | make: *** [package] Error 2
| View | View | ||
| Fedora-42-x86_64 | Broken | 2026/09/14 | 22:34:05 | 00:00:04 | make: *** [package] Error 2
| View | View | ||
| Fedora-44-x86_64 | Broken | 2026/09/16 | 01:27:14 | 00:00:05 | make: *** [package] Error 2
| View | View | ||
| NetBSD-11-x86_64 | Broken | 2026/09/16 | 02:36:19 | 00:00:06 | /usr/pkg/bin/gmake: *** [package] Error 2
| View | View | ||
| Rocky-10-x86_64 | Broken | 2026/09/16 | 01:55:04 | 00:00:14 | make: *** [package] Error 2
| View | View | ||
| Rocky-8-x86_64 | Broken | 2026/09/16 | 01:38:12 | 00:00:04 | make: *** [package] Error 2
| View | View | ||
| Ubuntu-20.04-x86_64 | N/A | 2026/09/16 | 01:58:54 | 00:00:04 | View | View | cmake>=3.22 | ||
| Ubuntu-22.04-x86_64 | Broken | 2026/09/16 | 01:46:50 | 00:00:05 | make: *** [package] Error 2
| View | View | ||
| Ubuntu-24.04-x86_64 | Broken | 2026/09/16 | 01:46:45 | 00:00:03 | make: *** [package] Error 2
| View | View | ||
| Ubuntu-26.04-x86_64 | Broken | 2026/09/16 | 01:57:54 | 00:00:03 | make: *** [package] Error 2
| View | View | ||