robotpkg/wip bulk build results

Log for Ubuntu-18.04-x86_64 (Back)

--- Syncing bulk database ---------------------------------------- setting Ubuntu-18.04-x86_64 as running --- Updating robotpkg -------------------------------------------- Pulling /local/robotpkg/var/lib/robotpkg/wip From git://git.openrobots.org/robots/robotpkg/robotpkg-wip c8e3fb6..d2b3103 master -> origin/master HEAD is now at d2b3103 [wip/infuse-envire] Fixed Makefile and relocated distfiles on redmine Updating pkgtools/pkg_install ===> Updating for pkg_install-20110805.9 pkg_install-20110805.9 is already installed and up-to-date. Updating pkgtools/rbulkit ===> Updating for rbulkit-20180807 rbulkit-20180807 is already installed and up-to-date. Updating pkgtools/pkgrepo2deb ===> Updating for pkgrepo2deb-1.3 pkgrepo2deb-1.3 is already installed and up-to-date. --- Running build for bulk-rbulk-wip ------------------------------- ===> Sorting packages for rbulk wip set Scanning wip/libmove3d-hri:* Scanning wip/sot-torque-control:* Scanning wip/prf-gazebo-ros-pkgs:* Scanning pkgtools/tnftp:tnftp>=20130505~ssl Scanning wip/head-action:* Scanning wip/orocos-dot_service:* Scanning wip/certi:* Scanning wip/gdalwrap:* Scanning wip/mumps:* Scanning wip/metapod:* [wip/metapod:*] Warning: DOXYGEN_PLIST_DIR in wip/metapod is deprecated. [wip/metapod:*] Warning: use DYNAMIC_PLIST_DIRS instead. Scanning wip/sot-pattern-generator-v3:* Scanning wip/py-laaswm:* Scanning wip/jsbsim:* Scanning wip/dptu-genom3:* Scanning wip/ros-swri-string-util:* Scanning wip/ros-swri-serial-util:* Scanning wip/can-utils:* Scanning wip/chilitags:* Scanning wip/pal-gazebo-plugins:* Scanning wip/tf-lookup:* Scanning wip/ros-swri-math-util:* Scanning wip/hrp2-14-description:* Scanning wip/hrp2-computer-monitor:* Scanning wip/FRILibrary:* Scanning wip/py-sot-tools-v3:* Scanning wip/sot-talos:* Scanning wip/sot-dyninv:* Scanning wip/pal-hardware-gazebo:* Scanning wip/mhp-genom:* Scanning wip/hrp2-dev:* Scanning wip/hatpconsole:* Scanning wip/jrl-walkgen-v3:* Scanning wip/pal-transmissions:* Scanning wip/py-hla:* Scanning wip/py-example-adder:* Scanning wip/ompl:* Scanning wip/infuse-asn1-types:* Scanning wip/move3d-studio:* Scanning wip/talos-data:* Scanning wip/backward-ros:* Scanning wip/sot-hrp2-v3:* Scanning wip/move3d-assets:* Scanning wip/hyper-genom-plugin:* Scanning wip/ros-swri-nodelet:* Scanning wip/sot-tools-v3:* Scanning wip/morse-hla:* Scanning wip/hyper-viewer:* Scanning wip/pal-hardware-interfaces:* Scanning wip/hrp2-bringup:* Scanning wip/hyper:* Scanning wip/gerard-bauzil:* Scanning wip/urg:* Scanning wip/hatptester:* Scanning wip/dynamic-graph-v3:* Scanning wip/py-dynamic-graph-tutorial:* Scanning wip/spark-genom:* Scanning wip/talos-metapkg-ros-control-sot:* Scanning wip/histodet:* Scanning wip/octovis:* Scanning wip/rqt-dynamic-graph:* Scanning wip/openhrp3-hrp2:* Scanning wip/vnet-yarp:* Scanning wip/talos-simulation:* Scanning wip/prf-ros-controllers:* Scanning wip/py-morse:* Scanning wip/simple-humanoid-description:* Scanning wip/infuse-envire:* Scanning wip/soth:* Scanning wip/infuse-novatel-gps-driver-ros:* Scanning wip/atlaas-genom:* Scanning wip/kukaFri-libs:* Scanning wip/libmove3d-planners:* Scanning wip/infuse-idl:* Scanning wip/ros-swri-roscpp:* Scanning wip/roscontrol-sot:* Scanning wip/play-motion:* Scanning wip/sot-hrprtc-hrp2:* Scanning wip/tsid:* Scanning wip/orocos-bfl:* Scanning wip/sot-dynamic-pinocchio-v3:* Scanning wip/laaswm-gui:* Scanning wip/py-mraa:* Scanning wip/osg-dae:* Scanning wip/sot-dyninv-v3:* Scanning wip/morse-pocolibs:* Scanning wip/py-jsbsim:* Scanning wip/dynamic-introspection:* Scanning wip/gladys:* Scanning wip/msgconnector:* Scanning wip/lua-rfsm:* Scanning wip/py-parametric-curves:* Scanning wip/roralink:* Scanning wip/talos-dev:* Scanning wip/sot-application-v3:* Scanning wip/morse-mavlink:* Scanning wip/sot-hrp2:* Scanning wip/antlr2:* Scanning wip/pal-msgs:* Scanning wip/parametric-curves:* Scanning wip/libfreenect:* Scanning wip/example-adder:* Scanning wip/robotModelParser-libs:* Scanning wip/talos-moveit-config:* Scanning wip/sot-romeo-v3:* Scanning wip/atlaas:* Scanning wip/ur5-description:* [wip/ur5-description:*] Warning: the LICENSE of wip/ur5-description is undefined. Scanning wip/orocos-yarp_transport:* Scanning middleware/orocos-rtt:orocos-rtt>=2.5 Scanning wip/infuse-asn1-conversions:* Scanning wip/infuse-msgs-ros:* Scanning wip/talos-robot:* Scanning wip/tiago-robot:* Scanning wip/libmove3d:* Scanning wip/py-sot-torque-control:* Scanning wip/mavlink:* Scanning wip/pal-gazebo-worlds:* Scanning wip/dynamic-graph-bridge-v3:* Scanning wip/morse-ros:* Scanning wip/hrp2-machine:* Scanning wip/openhrp3-simulator-wo-rtm:* Scanning wip/prf-roboticsgroup-gazebo-plugins:* Scanning wip/sot-core-v3:* Scanning wip/eigen-quadprog:* Scanning wip/dynamic-graph-tutorial:* Scanning wip/prf-ros-control:* Scanning wip/py-mavlink:* Scanning wip/libnabo:* Scanning wip/py-dynamic-graph-v3:* Scanning wip/hatponboard-lib:* Scanning wip/hri-simulation:* Scanning wip/libhatp:* Scanning wip/py-mavlink:py36-mavlink-1.1.62 Scanning wip/py-mavlink:py35-mavlink-1.1.62 Scanning wip/py-mavlink:py34-mavlink-1.1.62 Scanning wip/py-mavlink:py32-mavlink-1.1.62 Scanning wip/py-sot-torque-control:py36-sot-torque-control-1.0.0r3 Scanning wip/py-dynamic-graph-v3:py36-dynamic-graph-v3>=3.0 Scanning wip/py-sot-torque-control:py35-sot-torque-control-1.0.0r3 Scanning wip/py-dynamic-graph-v3:py35-dynamic-graph-v3>=3.0 Scanning wip/py-sot-torque-control:py34-sot-torque-control-1.0.0r3 Scanning wip/py-dynamic-graph-v3:py34-dynamic-graph-v3>=3.0 Scanning wip/py-sot-torque-control:py32-sot-torque-control-1.0.0r3 Scanning wip/py-dynamic-graph-v3:py32-dynamic-graph-v3>=3.0 Scanning wip/py-parametric-curves:py36-parametric-curves-1.1.1 Scanning wip/py-parametric-curves:py35-parametric-curves-1.1.1 Scanning wip/py-parametric-curves:py34-parametric-curves-1.1.1 Scanning wip/py-parametric-curves:py32-parametric-curves-1.1.1 Scanning wip/py-jsbsim:py36-jsbsim-20150424r1 Scanning wip/py-jsbsim:py35-jsbsim-20150424r1 Scanning wip/py-jsbsim:py34-jsbsim-20150424r1 Scanning wip/py-jsbsim:py32-jsbsim-20150424r1 Scanning wip/py-morse:py35-morse-1.4 Scanning wip/py-morse:py34-morse-1.4 Scanning wip/py-morse:py32-morse-1.4 Scanning wip/rqt-dynamic-graph:py36-rqt-dynamic-graph-1.0.0 Scanning wip/rqt-dynamic-graph:py35-rqt-dynamic-graph-1.0.0 Scanning wip/rqt-dynamic-graph:py34-rqt-dynamic-graph-1.0.0 Scanning wip/rqt-dynamic-graph:py32-rqt-dynamic-graph-1.0.0 Scanning wip/py-dynamic-graph-tutorial:py36-dynamic-graph-tutorial-1.1.1 Scanning wip/py-dynamic-graph-tutorial:py35-dynamic-graph-tutorial-1.1.1 Scanning wip/py-dynamic-graph-tutorial:py34-dynamic-graph-tutorial-1.1.1 Scanning wip/py-dynamic-graph-tutorial:py32-dynamic-graph-tutorial-1.1.1 Scanning wip/py-example-adder:py36-example-adder-1.0.0 Scanning wip/py-example-adder:py35-example-adder-1.0.0 Scanning wip/py-example-adder:py34-example-adder-1.0.0 Scanning wip/py-example-adder:py32-example-adder-1.0.0 Scanning wip/py-hla:py36-hla-1.1.1r1 Scanning wip/py-hla:py35-hla-1.1.1r1 Scanning wip/py-hla:py34-hla-1.1.1r1 Scanning wip/py-hla:py32-hla-1.1.1r1 Scanning wip/dptu-genom3:dptu-genom3-0.2~codels+openprs+ros-client-c+ros-client-ros+ros-server+!* Scanning wip/dptu-genom3:dptu-genom3-0.2~pocolibs-client-c+codels+openprs+pocolibs-server+!* Scanned 279 packages (239 unique) [24%] Processing wip/mavlink:mavlink-20150929 ===> Bulk building for mavlink-20150929 Binary package for mavlink-20150929 is up-to-date. [24%] Processing wip/libmove3d:libmove3d-3.22.0r1 ===> Cleaning temporary files for libmove3d-3.22.0r1 ===> Bulk building for libmove3d-3.22.0r1 => Checking for clear installation => Installing /opt/robotpkg/var/lib/robotpkg/packages/bsd/Ubuntu-18.04-x86_64/All/digest-20080510.tgz => Installing /opt/robotpkg/var/lib/robotpkg/packages/bsd/Ubuntu-18.04-x86_64/All/tnftp-20130505~ssl.tgz => Required robotpkg package digest>=20080510: digest-20080510 found => Required robotpkg package tnftp>=20091122: tnftp-20130505~ssl found => Required system package gnupg>=1: gnupg-2.2.4 found => Required system package gzip: gzip-1.6 found => Required system package pax and tar archivers: pax found => Required system package pkg_install>=20110805.9: pkg_install-20110805.9 found => Required system package pkgrepo2deb>=1.3: pkgrepo2deb-1.3 found => Dependency digest-20080510 already installed => Installing /opt/robotpkg/var/lib/robotpkg/packages/bsd/Ubuntu-18.04-x86_64/All/gbM-0.11~tcl.tgz WARNING: Cannot check installed version of glpk WARNING: Cannot check installed version of libXpm => Installing /opt/robotpkg/var/lib/robotpkg/packages/bsd/Ubuntu-18.04-x86_64/All/softMotion-libs-3.12~tcl.tgz => Dependency tnftp-20130505~ssl already installed => Building with no option. => Use the GNU C++ compiler: c++-compiler provided by g++>=3 => Use the GNU C compiler: c-compiler provided by gcc>=3 => Required system package boost-headers>=1.34.1: boost-headers-1.65.1 found => Required system package boostlib-filesystem>=1.34.1: boost-libs-1.65.1 found => Required system package boostlib-iostreams>=1.34.1: boost-libs-1.65.1 found => Required system package boostlib-math>=1.34.1: boost-libs-1.65.1 found => Required system package boostlib-thread>=1.34.1: boost-libs-1.65.1 found => Required system package cmake>=2.6: cmake-3.10.2 found => Required system package freeglut: freeglut found => Required system package g++>=3: g++-7 found => Required system package gcc>=3: gcc-7 found => Required system package glib2>=2.20: glib2-2.56.1 found => Required system package glpk>=4.36: glpk found => Required system package glu>=7: glu-9.0.0 found => Required system package gsl>=1: gsl-2.4 found => Required system package gts>=0.7: gts-0.7.6 found => Required system package libXpm>=3.5.7: libXpm found => Required system package libstdc++: libstdc++ found => Required system package libxml2>=2: libxml2-2.9.4 found => Required system package qhull: qhull found WARNING: Cannot check installed version of glpk WARNING: Cannot check installed version of libXpm => Required robotpkg package gbM>=0.9: gbM-0.11~tcl found => Required robotpkg package softMotion-libs>=3.10: softMotion-libs-3.12~tcl found => SHA1 checksums OK => RMD160 checksums OK An unexpected error occured. The last 10 log lines are shown below. | fgets(buffer, 256, outfile); | ~~~~~^~~~~~~~~~~~~~~~~~~~~~ | make[2]: *** [CMakeFiles/move3d.dir/graspPlanning/gpConvexHull.cpp.o] Error 1 | make[2]: *** Waiting for unfinished jobs.... | make[2]: Leaving directory '/local/robotpkg/var/tmp/robotpkg/wip/libmove3d/work/libmove3d-3.22.0' | make[1]: *** [CMakeFiles/move3d.dir/all] Error 2 | CMakeFiles/Makefile2:70: recipe for target 'CMakeFiles/move3d.dir/all' failed | make[1]: Leaving directory '/local/robotpkg/var/tmp/robotpkg/wip/libmove3d/work/libmove3d-3.22.0' | Makefile:143: recipe for target 'all' failed | make: *** [all] Error 2 For details or bug reports, check the complete log file in: /local/robotpkg/var/tmp/robotpkg/wip/libmove3d/work/build.log make[3]: *** [do-build] Error 2 make[2]: *** [pkg-check-installed] Error 2 => Marking libmove3d-3.22.0r1 as broken ERROR: make: *** [package] Error 2 ===> Logging bulk summary for libmove3d-3.22.0r1 => Checking leftover files => Creating bulk log files => Logging bulk metadata ===> Cleaning temporary files for libmove3d-3.22.0r1 ===> Done bulk for libmove3d-3.22.0r1 [25%] Processing wip/morse-ros:morse-ros-1.4 ===> Cleaning temporary files for morse-ros-1.4 ===> Bulk building for morse-ros-1.4 => Checking for clear installation => Installing /opt/robotpkg/var/lib/robotpkg/packages/bsd/Ubuntu-18.04-x86_64/All/digest-20080510.tgz => Installing /opt/robotpkg/var/lib/robotpkg/packages/bsd/Ubuntu-18.04-x86_64/All/tnftp-20130505~ssl.tgz => Required robotpkg package digest>=20080510: digest-20080510 found => Required robotpkg package tnftp>=20091122: tnftp-20130505~ssl found => Required system package gnupg>=1: gnupg-2.2.4 found => Required system package gzip: gzip-1.6 found => Required system package patch>=2.0: patch-2.7.6 found => Required system package pax and tar archivers: pax found => Required system package pkg_install>=20110805.9: pkg_install-20110805.9 found => Required system package pkgrepo2deb>=1.3: pkgrepo2deb-1.3 found => Dependency digest-20080510 already installed => Installing /opt/robotpkg/var/lib/robotpkg/packages/bsd/Ubuntu-18.04-x86_64/All/morse-1.4~doc.tgz => Required system package py36-catkin-pkg>=0.2: MISSING => Dependency tnftp-20130505~ssl already installed ERROR: ====================================================================== ERROR: Missing system packages required for morse-ros-1.4: ERROR: ERROR: py36-catkin-pkg>=0.2 (Ubuntu package python-catkin-pkg) ERROR: ERROR: Please use the system package management tool to install these ERROR: dependencies. If a robotpkg version of a dependency is available, ERROR: you can configure robotpkg.conf to use this version instead. ERROR: ERROR: See /local/robotpkg/var/tmp/robotpkg/wip/morse-ros/work/sysdep.log for details. ERROR: ====================================================================== make[2]: *** [sys-depends] Error 2 ===> Logging bulk summary for morse-ros-1.4 => Checking leftover files => Creating bulk log files => Logging bulk metadata ===> Cleaning temporary files for morse-ros-1.4 ===> Done bulk for morse-ros-1.4 [25%] Processing wip/openhrp3-simulator-wo-rtm:openhrp3-simulator-wo-rtm-1.2.0 ===> Cleaning temporary files for openhrp3-simulator-wo-rtm-1.2.0 ===> Bulk building for openhrp3-simulator-wo-rtm-1.2.0 => Checking for clear installation => Installing /opt/robotpkg/var/lib/robotpkg/packages/bsd/Ubuntu-18.04-x86_64/All/digest-20080510.tgz => Installing /opt/robotpkg/var/lib/robotpkg/packages/bsd/Ubuntu-18.04-x86_64/All/tnftp-20130505~ssl.tgz => Required robotpkg package digest>=20080510: digest-20080510 found => Required robotpkg package tnftp>=20091122: tnftp-20130505~ssl found => Required system package gnupg>=1: gnupg-2.2.4 found => Required system package gzip: gzip-1.6 found => Required system package pax and tar archivers: pax found => Required system package pkg_install>=20110805.9: pkg_install-20110805.9 found => Required system package pkgrepo2deb>=1.3: pkgrepo2deb-1.3 found => Dependency digest-20080510 already installed => Installing /opt/robotpkg/var/lib/robotpkg/packages/bsd/Ubuntu-18.04-x86_64/All/gepetto-viewer-2.1.3.tgz => Dependency tnftp-20130505~ssl already installed => Building with no option. => Use the GNU C++ compiler: c++-compiler provided by g++>=3 => Use the GNU C compiler: c-compiler provided by gcc>=3 => Use python-2.7: python>=2.5<3.7 provided by python27>=2.7<2.8 => Use ros melodic: ros>=groovy provided by ros-melodic => Required system package cmake>=2.8.3: cmake-3.10.2 found => Required system package g++>=3: g++-7 found => Required system package gcc>=3: gcc-7 found => Required system package googletest: googletest found => Required system package libstdc++: libstdc++ found => Required system package pkg-config>=0.22: pkg-config-0.29.1 found => Required system package py27-empy>=3: py27-empy-3.3.2 found => Required system package py27-nose>=0.10: py27-nose-1.3.7 found => Required system package python27>=2.7<2.8: python27-2.7.151 found => Required system package ros-catkin>=0.7<0.8: ros-catkin-0.7.14 found => Required system package ros-common-msgs>=1.12<1.13: ros-common-msgs-1.12.6 found => Required system package ros-genmsg>=0.5<0.6: ros-genmsg-0.5.11 found => Required system package ros-message-generation>=0.4<0.5: ros-message-generation-0.4.0 found => Required system package ros-roscpp-core>=0.6<0.7: ros-roscpp-core-0.6.11 found => Required system package ros-std-msgs>=0.5 : ros-std-msgs-0.5.11 found => Required robotpkg package gepetto-viewer>=2.1.2: gepetto-viewer-2.1.3 found => SHA1 checksums OK => RMD160 checksums OK An unexpected error occured. The last 10 log lines are shown below. | make[2]: Leaving directory '/local/robotpkg/var/tmp/robotpkg/wip/openhrp3-simulator-wo-rtm/work/openhrp3_simulator_wo_rtm-1.2.0' | [ 25%] Built target png | [ 25%] Linking C shared library /local/robotpkg/var/tmp/robotpkg/wip/openhrp3-simulator-wo-rtm/work/stage/lib/libjpeg.so | cd /local/robotpkg/var/tmp/robotpkg/wip/openhrp3-simulator-wo-rtm/work/openhrp3_simulator_wo_rtm-1.2.0/hrplib/hrpUtil/Jpeg-6b && /usr/bin/cmake -E cmake_link_script CMakeFiles/jpeg.dir/link.txt --verbose=1 | /usr/bin/gcc -fPIC -pipe -O3 -DNDEBUG -shared -Wl,-soname,libjpeg.so -o /local/robotpkg/var/tmp/robotpkg/wip/openhrp3-simulator-wo-rtm/work/stage/lib/libjpeg.so CMakeFiles/jpeg.dir/jcapimin.c.o CMakeFiles/jpeg.dir/jcapistd.c.o CMakeFiles/jpeg.dir/jccoefct.c.o CMakeFiles/jpeg.dir/jccolor.c.o CMakeFiles/jpeg.dir/jcdctmgr.c.o CMakeFiles/jpeg.dir/jchuff.c.o CMakeFiles/jpeg.dir/jcinit.c.o CMakeFiles/jpeg.dir/jcmainct.c.o CMakeFiles/jpeg.dir/jcmarker.c.o CMakeFiles/jpeg.dir/jcmaster.c.o CMakeFiles/jpeg.dir/jcomapi.c.o CMakeFiles/jpeg.dir/jcparam.c.o CMakeFiles/jpeg.dir/jcphuff.c.o CMakeFiles/jpeg.dir/jcprepct.c.o CMakeFiles/jpeg.dir/jcsample.c.o CMakeFiles/jpeg.dir/jctrans.c.o CMakeFiles/jpeg.dir/jdapimin.c.o CMakeFiles/jpeg.dir/jdapistd.c.o CMakeFiles/jpeg.dir/jdatadst.c.o CMakeFiles/jpeg.dir/jdatasrc.c.o CMakeFiles/jpeg.dir/jdcoefct.c.o CMakeFiles/jpeg.dir/jdcolor.c.o CMakeFiles/jpeg.dir/jddctmgr.c.o CMakeFiles/jpeg.dir/jdhuff.c.o CMakeFiles/jpeg.dir/jdinput.c.o CMakeFiles/jpeg.dir/jdmainct.c.o CMakeFiles/jpeg.dir/jdmarker.c.o CMakeFiles/jpeg.dir/jdmaster.c.o CMakeFiles/jpeg.dir/jdmerge.c.o CMakeFiles/jpeg.dir/jdphuff.c.o CMakeFiles/jpeg.dir/jdpostct.c.o CMakeFiles/jpeg.dir/jdsample.c.o CMakeFiles/jpeg.dir/jdtrans.c.o CMakeFiles/jpeg.dir/jerror.c.o CMakeFiles/jpeg.dir/jfdctflt.c.o CMakeFiles/jpeg.dir/jfdctfst.c.o CMakeFiles/jpeg.dir/jfdctint.c.o CMakeFiles/jpeg.dir/jidctflt.c.o CMakeFiles/jpeg.dir/jidctfst.c.o CMakeFiles/jpeg.dir/jidctint.c.o CMakeFiles/jpeg.dir/jidctred.c.o CMakeFiles/jpeg.dir/jquant1.c.o CMakeFiles/jpeg.dir/jquant2.c.o CMakeFiles/jpeg.dir/jutils.c.o CMakeFiles/jpeg.dir/jmemmgr.c.o CMakeFiles/jpeg.dir/jmemnobs.c.o | make[2]: Leaving directory '/local/robotpkg/var/tmp/robotpkg/wip/openhrp3-simulator-wo-rtm/work/openhrp3_simulator_wo_rtm-1.2.0' | [ 25%] Built target jpeg | make[1]: Leaving directory '/local/robotpkg/var/tmp/robotpkg/wip/openhrp3-simulator-wo-rtm/work/openhrp3_simulator_wo_rtm-1.2.0' | make: *** [all] Error 2 | Makefile:143: recipe for target 'all' failed For details or bug reports, check the complete log file in: /local/robotpkg/var/tmp/robotpkg/wip/openhrp3-simulator-wo-rtm/work/build.log make[3]: *** [do-build] Error 2 make[2]: *** [pkg-check-installed] Error 2 => Marking openhrp3-simulator-wo-rtm-1.2.0 as broken ERROR: make: *** [package] Error 2 ===> Logging bulk summary for openhrp3-simulator-wo-rtm-1.2.0 => Checking leftover files => Creating bulk log files => Logging bulk metadata ===> Cleaning temporary files for openhrp3-simulator-wo-rtm-1.2.0 ===> Done bulk for openhrp3-simulator-wo-rtm-1.2.0 [26%] Processing wip/hrp2-machine:hrp2-machine-1.0.2 ===> Bulk building for hrp2-machine-1.0.2 Binary package for hrp2-machine-1.0.2 is up-to-date. [27%] Processing wip/eigen-quadprog:eigen-quadprog-1.0.0 ===> Bulk building for eigen-quadprog-1.0.0 Binary package for eigen-quadprog-1.0.0 is up-to-date. [27%] Processing wip/py-mavlink:py36-mavlink-1.1.62 ===> Cleaning temporary files for py36-mavlink-1.1.62 ===> Bulk building for py36-mavlink-1.1.62 => Checking for clear installation => Installing /opt/robotpkg/var/lib/robotpkg/packages/bsd/Ubuntu-18.04-x86_64/All/digest-20080510.tgz => Installing /opt/robotpkg/var/lib/robotpkg/packages/bsd/Ubuntu-18.04-x86_64/All/tnftp-20130505~ssl.tgz => Required robotpkg package digest>=20080510: digest-20080510 found => Required robotpkg package tnftp>=20091122: tnftp-20130505~ssl found => Required system package git>=1.6: git-2.17.1 found => Required system package gnupg>=1: gnupg-2.2.4 found => Required system package gzip: gzip-1.6 found => Required system package pax and tar archivers: pax found => Required system package pkg_install>=20110805.9: pkg_install-20110805.9 found => Required system package pkgrepo2deb>=1.3: pkgrepo2deb-1.3 found => Dependency digest-20080510 already installed => Dependency tnftp-20130505~ssl already installed => Building with no option. => Use the GNU C compiler: c-compiler provided by gcc>=3 => Use python-3.6: python>=2.5<3.7 provided by python36>=3.6<3.7 => Required system package gcc>=3: gcc-7 found => Required system package python36>=3.6<3.7: python36-3.6.5 found => SHA1 checksums OK => RMD160 checksums OK => Compiling python files File "/opt/openrobots/lib/python3.6/site-packages/pymavlink/generator/lib/genxmlif/__init__.py", line 81 raise AttributeError, "Unknown XML interface: %s" %(xmlIf) ^ SyntaxError: invalid syntax File "/opt/openrobots/lib/python3.6/site-packages/pymavlink/generator/lib/genxmlif/xmlif4Dom.py", line 58 print "Using 4Dom interface module..." ^ SyntaxError: Missing parentheses in call to 'print'. Did you mean print("Using 4Dom interface module...")? File "/opt/openrobots/lib/python3.6/site-packages/pymavlink/generator/lib/genxmlif/xmlifApi.py", line 370 raise AttributeError, "Attribute %s not found!" %(repr(tupleOrAttrName)) ^ SyntaxError: invalid syntax File "/opt/openrobots/lib/python3.6/site-packages/pymavlink/generator/lib/genxmlif/xmlifDom.py", line 69 print "Xinclude: %s" %href ^ SyntaxError: Missing parentheses in call to 'print'. Did you mean print("Xinclude: %s" %href)? File "/opt/openrobots/lib/python3.6/site-packages/pymavlink/generator/lib/genxmlif/xmlifElementTree.py", line 72 print "Using elementtree interface module..." ^ SyntaxError: Missing parentheses in call to 'print'. Did you mean print("Using elementtree interface module...")? File "/opt/openrobots/lib/python3.6/site-packages/pymavlink/generator/lib/genxmlif/xmlifMinidom.py", line 63 print "Using minidom interface module..." ^ SyntaxError: Missing parentheses in call to 'print'. Did you mean print("Using minidom interface module...")? File "/opt/openrobots/lib/python3.6/site-packages/pymavlink/generator/lib/genxmlif/xmlifUtils.py", line 193 raise LookupError, "Prefix for namespaceURI '%s' not found!" % (ns) ^ SyntaxError: invalid syntax File "/opt/openrobots/lib/python3.6/site-packages/pymavlink/generator/lib/genxmlif/xmliftest.py", line 12 print xmlTree.printTree(prettyPrint=1) ^ SyntaxError: invalid syntax File "/opt/openrobots/lib/python3.6/site-packages/pymavlink/generator/lib/minixsv/minixsvWrapper.py", line 36 print validSyntaxText ^ SyntaxError: Missing parentheses in call to 'print'. Did you mean print(validSyntaxText)? File "/opt/openrobots/lib/python3.6/site-packages/pymavlink/generator/lib/minixsv/pyxsval.py", line 93 raise KeyError, "xmlIfKey %s already implemented!" %(xmlIfKey) ^ SyntaxError: invalid syntax File "/opt/openrobots/lib/python3.6/site-packages/pymavlink/generator/lib/minixsv/xsvalBase.py", line 135 except TagException, errInst: ^ SyntaxError: invalid syntax File "/opt/openrobots/lib/python3.6/site-packages/pymavlink/generator/lib/minixsv/xsvalErrorHandler.py", line 122 print string.join (self.infoDict.keys(), "n") ^ SyntaxError: invalid syntax File "/opt/openrobots/lib/python3.6/site-packages/pymavlink/generator/lib/minixsv/xsvalSchema.py", line 431 except TagException, errInst: ^ SyntaxError: invalid syntax File "/opt/openrobots/lib/python3.6/site-packages/pymavlink/generator/lib/minixsv/xsvalSimpleTypes.py", line 78 except BaseTypeError, errstr: ^ SyntaxError: invalid syntax File "/opt/openrobots/lib/python3.6/site-packages/pymavlink/generator/lib/minixsv/xsvalUtils.py", line 48 r"Cc" : ur"x00-x1fx7f-x9f", ^ SyntaxError: invalid syntax File "/opt/openrobots/lib/python3.6/site-packages/pymavlink/generator/lib/genxmlif/__init__.py", line 81 raise AttributeError, "Unknown XML interface: %s" %(xmlIf) ^ SyntaxError: invalid syntax File "/opt/openrobots/lib/python3.6/site-packages/pymavlink/generator/lib/genxmlif/xmlif4Dom.py", line 58 print "Using 4Dom interface module..." ^ SyntaxError: Missing parentheses in call to 'print'. Did you mean print("Using 4Dom interface module...")? File "/opt/openrobots/lib/python3.6/site-packages/pymavlink/generator/lib/genxmlif/xmlifApi.py", line 370 raise AttributeError, "Attribute %s not found!" %(repr(tupleOrAttrName)) ^ SyntaxError: invalid syntax File "/opt/openrobots/lib/python3.6/site-packages/pymavlink/generator/lib/genxmlif/xmlifDom.py", line 69 print "Xinclude: %s" %href ^ SyntaxError: Missing parentheses in call to 'print'. Did you mean print("Xinclude: %s" %href)? File "/opt/openrobots/lib/python3.6/site-packages/pymavlink/generator/lib/genxmlif/xmlifElementTree.py", line 72 print "Using elementtree interface module..." ^ SyntaxError: Missing parentheses in call to 'print'. Did you mean print("Using elementtree interface module...")? File "/opt/openrobots/lib/python3.6/site-packages/pymavlink/generator/lib/genxmlif/xmlifMinidom.py", line 63 print "Using minidom interface module..." ^ SyntaxError: Missing parentheses in call to 'print'. Did you mean print("Using minidom interface module...")? File "/opt/openrobots/lib/python3.6/site-packages/pymavlink/generator/lib/genxmlif/xmlifUtils.py", line 193 raise LookupError, "Prefix for namespaceURI '%s' not found!" % (ns) ^ SyntaxError: invalid syntax File "/opt/openrobots/lib/python3.6/site-packages/pymavlink/generator/lib/genxmlif/xmliftest.py", line 12 print xmlTree.printTree(prettyPrint=1) ^ SyntaxError: invalid syntax File "/opt/openrobots/lib/python3.6/site-packages/pymavlink/generator/lib/minixsv/minixsvWrapper.py", line 36 print validSyntaxText ^ SyntaxError: Missing parentheses in call to 'print'. Did you mean print(validSyntaxText)? File "/opt/openrobots/lib/python3.6/site-packages/pymavlink/generator/lib/minixsv/pyxsval.py", line 93 raise KeyError, "xmlIfKey %s already implemented!" %(xmlIfKey) ^ SyntaxError: invalid syntax File "/opt/openrobots/lib/python3.6/site-packages/pymavlink/generator/lib/minixsv/xsvalBase.py", line 135 except TagException, errInst: ^ SyntaxError: invalid syntax File "/opt/openrobots/lib/python3.6/site-packages/pymavlink/generator/lib/minixsv/xsvalErrorHandler.py", line 122 print string.join (self.infoDict.keys(), "n") ^ SyntaxError: invalid syntax File "/opt/openrobots/lib/python3.6/site-packages/pymavlink/generator/lib/minixsv/xsvalSchema.py", line 431 except TagException, errInst: ^ SyntaxError: invalid syntax File "/opt/openrobots/lib/python3.6/site-packages/pymavlink/generator/lib/minixsv/xsvalSimpleTypes.py", line 78 except BaseTypeError, errstr: ^ SyntaxError: invalid syntax File "/opt/openrobots/lib/python3.6/site-packages/pymavlink/generator/lib/minixsv/xsvalUtils.py", line 48 r"Cc" : ur"x00-x1fx7f-x9f", ^ SyntaxError: invalid syntax robotpkg_create: can't stat `/opt/openrobots/lib/python3.6/site-packages/mavnative.so' robotpkg_create: can't stat `/opt/openrobots/lib/python3.6/site-packages/pymavlink/generator/lib/genxmlif/__pycache__/__init__.cpython-36.pyc' robotpkg_create: can't stat `/opt/openrobots/lib/python3.6/site-packages/pymavlink/generator/lib/genxmlif/__pycache__/__init__.cpython-36.opt-1.pyc' robotpkg_create: can't stat `/opt/openrobots/lib/python3.6/site-packages/pymavlink/generator/lib/genxmlif/__pycache__/xmlif4Dom.cpython-36.pyc' robotpkg_create: can't stat `/opt/openrobots/lib/python3.6/site-packages/pymavlink/generator/lib/genxmlif/__pycache__/xmlif4Dom.cpython-36.opt-1.pyc' robotpkg_create: can't stat `/opt/openrobots/lib/python3.6/site-packages/pymavlink/generator/lib/genxmlif/__pycache__/xmlifApi.cpython-36.pyc' robotpkg_create: can't stat `/opt/openrobots/lib/python3.6/site-packages/pymavlink/generator/lib/genxmlif/__pycache__/xmlifApi.cpython-36.opt-1.pyc' robotpkg_create: can't stat `/opt/openrobots/lib/python3.6/site-packages/pymavlink/generator/lib/genxmlif/__pycache__/xmlifDom.cpython-36.pyc' robotpkg_create: can't stat `/opt/openrobots/lib/python3.6/site-packages/pymavlink/generator/lib/genxmlif/__pycache__/xmlifDom.cpython-36.opt-1.pyc' robotpkg_create: can't stat `/opt/openrobots/lib/python3.6/site-packages/pymavlink/generator/lib/genxmlif/__pycache__/xmlifElementTree.cpython-36.pyc' robotpkg_create: can't stat `/opt/openrobots/lib/python3.6/site-packages/pymavlink/generator/lib/genxmlif/__pycache__/xmlifElementTree.cpython-36.opt-1.pyc' robotpkg_create: can't stat `/opt/openrobots/lib/python3.6/site-packages/pymavlink/generator/lib/genxmlif/__pycache__/xmlifMinidom.cpython-36.pyc' robotpkg_create: can't stat `/opt/openrobots/lib/python3.6/site-packages/pymavlink/generator/lib/genxmlif/__pycache__/xmlifMinidom.cpython-36.opt-1.pyc' robotpkg_create: can't stat `/opt/openrobots/lib/python3.6/site-packages/pymavlink/generator/lib/genxmlif/__pycache__/xmlifUtils.cpython-36.pyc' robotpkg_create: can't stat `/opt/openrobots/lib/python3.6/site-packages/pymavlink/generator/lib/genxmlif/__pycache__/xmlifUtils.cpython-36.opt-1.pyc' robotpkg_create: can't stat `/opt/openrobots/lib/python3.6/site-packages/pymavlink/generator/lib/genxmlif/__pycache__/xmliftest.cpython-36.pyc' robotpkg_create: can't stat `/opt/openrobots/lib/python3.6/site-packages/pymavlink/generator/lib/genxmlif/__pycache__/xmliftest.cpython-36.opt-1.pyc' robotpkg_create: can't stat `/opt/openrobots/lib/python3.6/site-packages/pymavlink/generator/lib/minixsv/__pycache__/minixsvWrapper.cpython-36.pyc' robotpkg_create: can't stat `/opt/openrobots/lib/python3.6/site-packages/pymavlink/generator/lib/minixsv/__pycache__/minixsvWrapper.cpython-36.opt-1.pyc' robotpkg_create: can't stat `/opt/openrobots/lib/python3.6/site-packages/pymavlink/generator/lib/minixsv/__pycache__/pyxsval.cpython-36.pyc' robotpkg_create: can't stat `/opt/openrobots/lib/python3.6/site-packages/pymavlink/generator/lib/minixsv/__pycache__/pyxsval.cpython-36.opt-1.pyc' robotpkg_create: can't stat `/opt/openrobots/lib/python3.6/site-packages/pymavlink/generator/lib/minixsv/__pycache__/xsvalBase.cpython-36.pyc' robotpkg_create: can't stat `/opt/openrobots/lib/python3.6/site-packages/pymavlink/generator/lib/minixsv/__pycache__/xsvalBase.cpython-36.opt-1.pyc' robotpkg_create: can't stat `/opt/openrobots/lib/python3.6/site-packages/pymavlink/generator/lib/minixsv/__pycache__/xsvalErrorHandler.cpython-36.pyc' robotpkg_create: can't stat `/opt/openrobots/lib/python3.6/site-packages/pymavlink/generator/lib/minixsv/__pycache__/xsvalErrorHandler.cpython-36.opt-1.pyc' robotpkg_create: can't stat `/opt/openrobots/lib/python3.6/site-packages/pymavlink/generator/lib/minixsv/__pycache__/xsvalSchema.cpython-36.pyc' robotpkg_create: can't stat `/opt/openrobots/lib/python3.6/site-packages/pymavlink/generator/lib/minixsv/__pycache__/xsvalSchema.cpython-36.opt-1.pyc' robotpkg_create: can't stat `/opt/openrobots/lib/python3.6/site-packages/pymavlink/generator/lib/minixsv/__pycache__/xsvalSimpleTypes.cpython-36.pyc' robotpkg_create: can't stat `/opt/openrobots/lib/python3.6/site-packages/pymavlink/generator/lib/minixsv/__pycache__/xsvalSimpleTypes.cpython-36.opt-1.pyc' robotpkg_create: can't stat `/opt/openrobots/lib/python3.6/site-packages/pymavlink/generator/lib/minixsv/__pycache__/xsvalUtils.cpython-36.pyc' robotpkg_create: can't stat `/opt/openrobots/lib/python3.6/site-packages/pymavlink/generator/lib/minixsv/__pycache__/xsvalUtils.cpython-36.opt-1.pyc' => Registering installation for py36-mavlink-1.1.62 robotpkg_admin: py36-mavlink-1.1.62: File `/opt/openrobots/lib/python3.6/site-packages/mavnative.so' is in +CONTENTS but not on filesystem! robotpkg_admin: py36-mavlink-1.1.62: File `/opt/openrobots/lib/python3.6/site-packages/pymavlink/generator/lib/genxmlif/__pycache__/__init__.cpython-36.pyc' is in +CONTENTS but not on filesystem! robotpkg_admin: py36-mavlink-1.1.62: File `/opt/openrobots/lib/python3.6/site-packages/pymavlink/generator/lib/genxmlif/__pycache__/__init__.cpython-36.opt-1.pyc' is in +CONTENTS but not on filesystem! robotpkg_admin: py36-mavlink-1.1.62: File `/opt/openrobots/lib/python3.6/site-packages/pymavlink/generator/lib/genxmlif/__pycache__/xmlif4Dom.cpython-36.pyc' is in +CONTENTS but not on filesystem! robotpkg_admin: py36-mavlink-1.1.62: File `/opt/openrobots/lib/python3.6/site-packages/pymavlink/generator/lib/genxmlif/__pycache__/xmlif4Dom.cpython-36.opt-1.pyc' is in +CONTENTS but not on filesystem! robotpkg_admin: py36-mavlink-1.1.62: File `/opt/openrobots/lib/python3.6/site-packages/pymavlink/generator/lib/genxmlif/__pycache__/xmlifApi.cpython-36.pyc' is in +CONTENTS but not on filesystem! robotpkg_admin: py36-mavlink-1.1.62: File `/opt/openrobots/lib/python3.6/site-packages/pymavlink/generator/lib/genxmlif/__pycache__/xmlifApi.cpython-36.opt-1.pyc' is in +CONTENTS but not on filesystem! robotpkg_admin: py36-mavlink-1.1.62: File `/opt/openrobots/lib/python3.6/site-packages/pymavlink/generator/lib/genxmlif/__pycache__/xmlifDom.cpython-36.pyc' is in +CONTENTS but not on filesystem! robotpkg_admin: py36-mavlink-1.1.62: File `/opt/openrobots/lib/python3.6/site-packages/pymavlink/generator/lib/genxmlif/__pycache__/xmlifDom.cpython-36.opt-1.pyc' is in +CONTENTS but not on filesystem! robotpkg_admin: py36-mavlink-1.1.62: File `/opt/openrobots/lib/python3.6/site-packages/pymavlink/generator/lib/genxmlif/__pycache__/xmlifElementTree.cpython-36.pyc' is in +CONTENTS but not on filesystem! robotpkg_admin: py36-mavlink-1.1.62: File `/opt/openrobots/lib/python3.6/site-packages/pymavlink/generator/lib/genxmlif/__pycache__/xmlifElementTree.cpython-36.opt-1.pyc' is in +CONTENTS but not on filesystem! robotpkg_admin: py36-mavlink-1.1.62: File `/opt/openrobots/lib/python3.6/site-packages/pymavlink/generator/lib/genxmlif/__pycache__/xmlifMinidom.cpython-36.pyc' is in +CONTENTS but not on filesystem! robotpkg_admin: py36-mavlink-1.1.62: File `/opt/openrobots/lib/python3.6/site-packages/pymavlink/generator/lib/genxmlif/__pycache__/xmlifMinidom.cpython-36.opt-1.pyc' is in +CONTENTS but not on filesystem! robotpkg_admin: py36-mavlink-1.1.62: File `/opt/openrobots/lib/python3.6/site-packages/pymavlink/generator/lib/genxmlif/__pycache__/xmlifUtils.cpython-36.pyc' is in +CONTENTS but not on filesystem! robotpkg_admin: py36-mavlink-1.1.62: File `/opt/openrobots/lib/python3.6/site-packages/pymavlink/generator/lib/genxmlif/__pycache__/xmlifUtils.cpython-36.opt-1.pyc' is in +CONTENTS but not on filesystem! robotpkg_admin: py36-mavlink-1.1.62: File `/opt/openrobots/lib/python3.6/site-packages/pymavlink/generator/lib/genxmlif/__pycache__/xmliftest.cpython-36.pyc' is in +CONTENTS but not on filesystem! robotpkg_admin: py36-mavlink-1.1.62: File `/opt/openrobots/lib/python3.6/site-packages/pymavlink/generator/lib/genxmlif/__pycache__/xmliftest.cpython-36.opt-1.pyc' is in +CONTENTS but not on filesystem! robotpkg_admin: py36-mavlink-1.1.62: File `/opt/openrobots/lib/python3.6/site-packages/pymavlink/generator/lib/minixsv/__pycache__/minixsvWrapper.cpython-36.pyc' is in +CONTENTS but not on filesystem! robotpkg_admin: py36-mavlink-1.1.62: File `/opt/openrobots/lib/python3.6/site-packages/pymavlink/generator/lib/minixsv/__pycache__/minixsvWrapper.cpython-36.opt-1.pyc' is in +CONTENTS but not on filesystem! robotpkg_admin: py36-mavlink-1.1.62: File `/opt/openrobots/lib/python3.6/site-packages/pymavlink/generator/lib/minixsv/__pycache__/pyxsval.cpython-36.pyc' is in +CONTENTS but not on filesystem! robotpkg_admin: py36-mavlink-1.1.62: File `/opt/openrobots/lib/python3.6/site-packages/pymavlink/generator/lib/minixsv/__pycache__/pyxsval.cpython-36.opt-1.pyc' is in +CONTENTS but not on filesystem! robotpkg_admin: py36-mavlink-1.1.62: File `/opt/openrobots/lib/python3.6/site-packages/pymavlink/generator/lib/minixsv/__pycache__/xsvalBase.cpython-36.pyc' is in +CONTENTS but not on filesystem! robotpkg_admin: py36-mavlink-1.1.62: File `/opt/openrobots/lib/python3.6/site-packages/pymavlink/generator/lib/minixsv/__pycache__/xsvalBase.cpython-36.opt-1.pyc' is in +CONTENTS but not on filesystem! robotpkg_admin: py36-mavlink-1.1.62: File `/opt/openrobots/lib/python3.6/site-packages/pymavlink/generator/lib/minixsv/__pycache__/xsvalErrorHandler.cpython-36.pyc' is in +CONTENTS but not on filesystem! robotpkg_admin: py36-mavlink-1.1.62: File `/opt/openrobots/lib/python3.6/site-packages/pymavlink/generator/lib/minixsv/__pycache__/xsvalErrorHandler.cpython-36.opt-1.pyc' is in +CONTENTS but not on filesystem! robotpkg_admin: py36-mavlink-1.1.62: File `/opt/openrobots/lib/python3.6/site-packages/pymavlink/generator/lib/minixsv/__pycache__/xsvalSchema.cpython-36.pyc' is in +CONTENTS but not on filesystem! robotpkg_admin: py36-mavlink-1.1.62: File `/opt/openrobots/lib/python3.6/site-packages/pymavlink/generator/lib/minixsv/__pycache__/xsvalSchema.cpython-36.opt-1.pyc' is in +CONTENTS but not on filesystem! robotpkg_admin: py36-mavlink-1.1.62: File `/opt/openrobots/lib/python3.6/site-packages/pymavlink/generator/lib/minixsv/__pycache__/xsvalSimpleTypes.cpython-36.pyc' is in +CONTENTS but not on filesystem! robotpkg_admin: py36-mavlink-1.1.62: File `/opt/openrobots/lib/python3.6/site-packages/pymavlink/generator/lib/minixsv/__pycache__/xsvalSimpleTypes.cpython-36.opt-1.pyc' is in +CONTENTS but not on filesystem! robotpkg_admin: py36-mavlink-1.1.62: File `/opt/openrobots/lib/python3.6/site-packages/pymavlink/generator/lib/minixsv/__pycache__/xsvalUtils.cpython-36.pyc' is in +CONTENTS but not on filesystem! robotpkg_admin: py36-mavlink-1.1.62: File `/opt/openrobots/lib/python3.6/site-packages/pymavlink/generator/lib/minixsv/__pycache__/xsvalUtils.cpython-36.opt-1.pyc' is in +CONTENTS but not on filesystem! robotpkg_create: can't stat `/opt/openrobots/lib/python3.6/site-packages/mavnative.so' robotpkg_create: can't stat `/opt/openrobots/lib/python3.6/site-packages/pymavlink/generator/lib/genxmlif/__pycache__/__init__.cpython-36.pyc' robotpkg_create: can't stat `/opt/openrobots/lib/python3.6/site-packages/pymavlink/generator/lib/genxmlif/__pycache__/__init__.cpython-36.opt-1.pyc' robotpkg_create: can't stat `/opt/openrobots/lib/python3.6/site-packages/pymavlink/generator/lib/genxmlif/__pycache__/xmlif4Dom.cpython-36.pyc' robotpkg_create: can't stat `/opt/openrobots/lib/python3.6/site-packages/pymavlink/generator/lib/genxmlif/__pycache__/xmlif4Dom.cpython-36.opt-1.pyc' robotpkg_create: can't stat `/opt/openrobots/lib/python3.6/site-packages/pymavlink/generator/lib/genxmlif/__pycache__/xmlifApi.cpython-36.pyc' robotpkg_create: can't stat `/opt/openrobots/lib/python3.6/site-packages/pymavlink/generator/lib/genxmlif/__pycache__/xmlifApi.cpython-36.opt-1.pyc' robotpkg_create: can't stat `/opt/openrobots/lib/python3.6/site-packages/pymavlink/generator/lib/genxmlif/__pycache__/xmlifDom.cpython-36.pyc' robotpkg_create: can't stat `/opt/openrobots/lib/python3.6/site-packages/pymavlink/generator/lib/genxmlif/__pycache__/xmlifDom.cpython-36.opt-1.pyc' robotpkg_create: can't stat `/opt/openrobots/lib/python3.6/site-packages/pymavlink/generator/lib/genxmlif/__pycache__/xmlifElementTree.cpython-36.pyc' robotpkg_create: can't stat `/opt/openrobots/lib/python3.6/site-packages/pymavlink/generator/lib/genxmlif/__pycache__/xmlifElementTree.cpython-36.opt-1.pyc' robotpkg_create: can't stat `/opt/openrobots/lib/python3.6/site-packages/pymavlink/generator/lib/genxmlif/__pycache__/xmlifMinidom.cpython-36.pyc' robotpkg_create: can't stat `/opt/openrobots/lib/python3.6/site-packages/pymavlink/generator/lib/genxmlif/__pycache__/xmlifMinidom.cpython-36.opt-1.pyc' robotpkg_create: can't stat `/opt/openrobots/lib/python3.6/site-packages/pymavlink/generator/lib/genxmlif/__pycache__/xmlifUtils.cpython-36.pyc' robotpkg_create: can't stat `/opt/openrobots/lib/python3.6/site-packages/pymavlink/generator/lib/genxmlif/__pycache__/xmlifUtils.cpython-36.opt-1.pyc' robotpkg_create: can't stat `/opt/openrobots/lib/python3.6/site-packages/pymavlink/generator/lib/genxmlif/__pycache__/xmliftest.cpython-36.pyc' robotpkg_create: can't stat `/opt/openrobots/lib/python3.6/site-packages/pymavlink/generator/lib/genxmlif/__pycache__/xmliftest.cpython-36.opt-1.pyc' robotpkg_create: can't stat `/opt/openrobots/lib/python3.6/site-packages/pymavlink/generator/lib/minixsv/__pycache__/minixsvWrapper.cpython-36.pyc' robotpkg_create: can't stat `/opt/openrobots/lib/python3.6/site-packages/pymavlink/generator/lib/minixsv/__pycache__/minixsvWrapper.cpython-36.opt-1.pyc' robotpkg_create: can't stat `/opt/openrobots/lib/python3.6/site-packages/pymavlink/generator/lib/minixsv/__pycache__/pyxsval.cpython-36.pyc' robotpkg_create: can't stat `/opt/openrobots/lib/python3.6/site-packages/pymavlink/generator/lib/minixsv/__pycache__/pyxsval.cpython-36.opt-1.pyc' robotpkg_create: can't stat `/opt/openrobots/lib/python3.6/site-packages/pymavlink/generator/lib/minixsv/__pycache__/xsvalBase.cpython-36.pyc' robotpkg_create: can't stat `/opt/openrobots/lib/python3.6/site-packages/pymavlink/generator/lib/minixsv/__pycache__/xsvalBase.cpython-36.opt-1.pyc' robotpkg_create: can't stat `/opt/openrobots/lib/python3.6/site-packages/pymavlink/generator/lib/minixsv/__pycache__/xsvalErrorHandler.cpython-36.pyc' robotpkg_create: can't stat `/opt/openrobots/lib/python3.6/site-packages/pymavlink/generator/lib/minixsv/__pycache__/xsvalErrorHandler.cpython-36.opt-1.pyc' robotpkg_create: can't stat `/opt/openrobots/lib/python3.6/site-packages/pymavlink/generator/lib/minixsv/__pycache__/xsvalSchema.cpython-36.pyc' robotpkg_create: can't stat `/opt/openrobots/lib/python3.6/site-packages/pymavlink/generator/lib/minixsv/__pycache__/xsvalSchema.cpython-36.opt-1.pyc' robotpkg_create: can't stat `/opt/openrobots/lib/python3.6/site-packages/pymavlink/generator/lib/minixsv/__pycache__/xsvalSimpleTypes.cpython-36.pyc' robotpkg_create: can't stat `/opt/openrobots/lib/python3.6/site-packages/pymavlink/generator/lib/minixsv/__pycache__/xsvalSimpleTypes.cpython-36.opt-1.pyc' robotpkg_create: can't stat `/opt/openrobots/lib/python3.6/site-packages/pymavlink/generator/lib/minixsv/__pycache__/xsvalUtils.cpython-36.pyc' robotpkg_create: can't stat `/opt/openrobots/lib/python3.6/site-packages/pymavlink/generator/lib/minixsv/__pycache__/xsvalUtils.cpython-36.opt-1.pyc' robotpkg_create: lstat failed for file lib/python3.6/site-packages/mavnative.so: No such file or directory make[3]: *** [pkg-tarup] Error 2 => Unlinking package in /opt/robotpkg/var/lib/robotpkg/wip/packages/bsd/Ubuntu-18.04-x86_64/All => Unlinking package in /opt/robotpkg/var/lib/robotpkg/wip/packages/bsd/Ubuntu-18.04-x86_64/pub => Unlinking package in /opt/robotpkg/var/lib/robotpkg/wip/packages/bsd/Ubuntu-18.04-x86_64/jrl => Updating debian binary packages robotpkg_delete: Couldn't remove /opt/openrobots/lib/python3.6/site-packages/mavnative.so robotpkg_delete: Couldn't remove /opt/openrobots/lib/python3.6/site-packages/pymavlink/generator/lib/genxmlif/__pycache__/__init__.cpython-36.pyc robotpkg_delete: Couldn't remove /opt/openrobots/lib/python3.6/site-packages/pymavlink/generator/lib/genxmlif/__pycache__/__init__.cpython-36.opt-1.pyc robotpkg_delete: Couldn't remove /opt/openrobots/lib/python3.6/site-packages/pymavlink/generator/lib/genxmlif/__pycache__/xmlif4Dom.cpython-36.pyc robotpkg_delete: Couldn't remove /opt/openrobots/lib/python3.6/site-packages/pymavlink/generator/lib/genxmlif/__pycache__/xmlif4Dom.cpython-36.opt-1.pyc robotpkg_delete: Couldn't remove /opt/openrobots/lib/python3.6/site-packages/pymavlink/generator/lib/genxmlif/__pycache__/xmlifApi.cpython-36.pyc robotpkg_delete: Couldn't remove /opt/openrobots/lib/python3.6/site-packages/pymavlink/generator/lib/genxmlif/__pycache__/xmlifApi.cpython-36.opt-1.pyc robotpkg_delete: Couldn't remove /opt/openrobots/lib/python3.6/site-packages/pymavlink/generator/lib/genxmlif/__pycache__/xmlifDom.cpython-36.pyc robotpkg_delete: Couldn't remove /opt/openrobots/lib/python3.6/site-packages/pymavlink/generator/lib/genxmlif/__pycache__/xmlifDom.cpython-36.opt-1.pyc robotpkg_delete: Couldn't remove /opt/openrobots/lib/python3.6/site-packages/pymavlink/generator/lib/genxmlif/__pycache__/xmlifElementTree.cpython-36.pyc robotpkg_delete: Couldn't remove /opt/openrobots/lib/python3.6/site-packages/pymavlink/generator/lib/genxmlif/__pycache__/xmlifElementTree.cpython-36.opt-1.pyc robotpkg_delete: Couldn't remove /opt/openrobots/lib/python3.6/site-packages/pymavlink/generator/lib/genxmlif/__pycache__/xmlifMinidom.cpython-36.pyc robotpkg_delete: Couldn't remove /opt/openrobots/lib/python3.6/site-packages/pymavlink/generator/lib/genxmlif/__pycache__/xmlifMinidom.cpython-36.opt-1.pyc robotpkg_delete: Couldn't remove /opt/openrobots/lib/python3.6/site-packages/pymavlink/generator/lib/genxmlif/__pycache__/xmlifUtils.cpython-36.pyc robotpkg_delete: Couldn't remove /opt/openrobots/lib/python3.6/site-packages/pymavlink/generator/lib/genxmlif/__pycache__/xmlifUtils.cpython-36.opt-1.pyc robotpkg_delete: Couldn't remove /opt/openrobots/lib/python3.6/site-packages/pymavlink/generator/lib/genxmlif/__pycache__/xmliftest.cpython-36.pyc robotpkg_delete: Couldn't remove /opt/openrobots/lib/python3.6/site-packages/pymavlink/generator/lib/genxmlif/__pycache__/xmliftest.cpython-36.opt-1.pyc robotpkg_delete: Couldn't remove /opt/openrobots/lib/python3.6/site-packages/pymavlink/generator/lib/minixsv/__pycache__/minixsvWrapper.cpython-36.pyc robotpkg_delete: Couldn't remove /opt/openrobots/lib/python3.6/site-packages/pymavlink/generator/lib/minixsv/__pycache__/minixsvWrapper.cpython-36.opt-1.pyc robotpkg_delete: Couldn't remove /opt/openrobots/lib/python3.6/site-packages/pymavlink/generator/lib/minixsv/__pycache__/pyxsval.cpython-36.pyc robotpkg_delete: Couldn't remove /opt/openrobots/lib/python3.6/site-packages/pymavlink/generator/lib/minixsv/__pycache__/pyxsval.cpython-36.opt-1.pyc robotpkg_delete: Couldn't remove /opt/openrobots/lib/python3.6/site-packages/pymavlink/generator/lib/minixsv/__pycache__/xsvalBase.cpython-36.pyc robotpkg_delete: Couldn't remove /opt/openrobots/lib/python3.6/site-packages/pymavlink/generator/lib/minixsv/__pycache__/xsvalBase.cpython-36.opt-1.pyc robotpkg_delete: Couldn't remove /opt/openrobots/lib/python3.6/site-packages/pymavlink/generator/lib/minixsv/__pycache__/xsvalErrorHandler.cpython-36.pyc robotpkg_delete: Couldn't remove /opt/openrobots/lib/python3.6/site-packages/pymavlink/generator/lib/minixsv/__pycache__/xsvalErrorHandler.cpython-36.opt-1.pyc robotpkg_delete: Couldn't remove /opt/openrobots/lib/python3.6/site-packages/pymavlink/generator/lib/minixsv/__pycache__/xsvalSchema.cpython-36.pyc robotpkg_delete: Couldn't remove /opt/openrobots/lib/python3.6/site-packages/pymavlink/generator/lib/minixsv/__pycache__/xsvalSchema.cpython-36.opt-1.pyc robotpkg_delete: Couldn't remove /opt/openrobots/lib/python3.6/site-packages/pymavlink/generator/lib/minixsv/__pycache__/xsvalSimpleTypes.cpython-36.pyc robotpkg_delete: Couldn't remove /opt/openrobots/lib/python3.6/site-packages/pymavlink/generator/lib/minixsv/__pycache__/xsvalSimpleTypes.cpython-36.opt-1.pyc robotpkg_delete: Couldn't remove /opt/openrobots/lib/python3.6/site-packages/pymavlink/generator/lib/minixsv/__pycache__/xsvalUtils.cpython-36.pyc robotpkg_delete: Couldn't remove /opt/openrobots/lib/python3.6/site-packages/pymavlink/generator/lib/minixsv/__pycache__/xsvalUtils.cpython-36.opt-1.pyc robotpkg_delete: Directory `/opt/openrobots/share/mavlink' disappeared, skipping ===> Logging bulk summary for py36-mavlink-1.1.62 => Checking leftover files WARNING: 1 files leftover. => Creating bulk log files => Logging bulk metadata ===> Cleaning temporary files for py36-mavlink-1.1.62 ===> Done bulk for py36-mavlink-1.1.62 [28%] Processing wip/py-mavlink:py27-mavlink-1.1.62 ===> Bulk building for py27-mavlink-1.1.62 Binary package for py27-mavlink-1.1.62 is up-to-date. [28%] Processing wip/py-mavlink:py32-mavlink-1.1.62 ===> Bulk building for py32-mavlink-1.1.62 Binary package for py32-mavlink-1.1.62 is up-to-date. [28%] Processing wip/py-mavlink:py34-mavlink-1.1.62 ===> Bulk building for py34-mavlink-1.1.62 Binary package for py34-mavlink-1.1.62 is up-to-date. [29%] Processing wip/py-mavlink:py35-mavlink-1.1.62 ===> Bulk building for py35-mavlink-1.1.62 Binary package for py35-mavlink-1.1.62 is up-to-date. [29%] Processing wip/prf-ros-control:prf-ros-control-0.2.6r3 ===> Cleaning temporary files for prf-ros-control-0.2.6r3 ===> Bulk building for prf-ros-control-0.2.6r3 => Checking for clear installation => Installing /opt/robotpkg/var/lib/robotpkg/packages/bsd/Ubuntu-18.04-x86_64/All/digest-20080510.tgz => Installing /opt/robotpkg/var/lib/robotpkg/packages/bsd/Ubuntu-18.04-x86_64/All/tnftp-20130505~ssl.tgz => Required robotpkg package digest>=20080510: digest-20080510 found => Required robotpkg package tnftp>=20130505~ssl: tnftp-20130505~ssl found => Required system package gnupg>=1: gnupg-2.2.4 found => Required system package gzip: gzip-1.6 found => Required system package pax and tar archivers: pax found => Required system package pkg_install>=20110805.9: pkg_install-20110805.9 found => Required system package pkgrepo2deb>=1.3: pkgrepo2deb-1.3 found => Dependency digest-20080510 already installed WARNING: Cannot check installed version of py-rospkg => Required system package ros-actionlib>=1.11<1.12: MISSING => Required system package ros-catkin>=0.6<0.7: MISSING => Required system package ros-cmake-modules>=0.3 : MISSING => Required system package ros-comm>=1.11<1.12: MISSING => Required system package ros-common-msgs>=1.11<1.12: MISSING => Required system package ros-control-toolbox>=1.13<1.15: MISSING => Required system package ros-genmsg>=0.5<0.6: MISSING => Required system package ros-geometry>=1.11<1.12: MISSING => Required system package ros-message-generation>=0.2<0.3: MISSING => Required system package ros-message-runtime>=0.4<0.5 : MISSING => Required system package ros-pluginlib>=1.10<1.11: MISSING => Required system package ros-robot-model>=1.11<1.12: MISSING => Required system package ros-ros>=1.11<1.12: MISSING => Required system package ros-rqt>=0.2<0.5: MISSING => Required system package ros-std-msgs>=0.5 : MISSING => Dependency tnftp-20130505~ssl already installed ERROR: ====================================================================== ERROR: Missing system packages required for prf-ros-control-0.2.6r3: ERROR: ERROR: ros-actionlib>=1.11<1.12 (Ubuntu package ros-indigo-actionlib) ERROR: ros-catkin>=0.6<0.7 (Ubuntu package ros-indigo-catkin) ERROR: ros-cmake-modules>=0.3 (Ubuntu package ros-indigo-cmake-modules) ERROR: ros-comm>=1.11<1.12 (Ubuntu package ros-indigo-comm) ERROR: ros-common-msgs>=1.11<1.12 (Ubuntu package ros-indigo-common-msgs) ERROR: ros-control-toolbox>=1.13<1.15 (Ubuntu package ros-indigo-control-toolbox) ERROR: ros-genmsg>=0.5<0.6 (Ubuntu package ros-indigo-genmsg) ERROR: ros-geometry>=1.11<1.12 (Ubuntu package ros-indigo-geometry) ERROR: ros-message-generation>=0.2<0.3 (Ubuntu package ros-indigo-message-generation) ERROR: ros-message-runtime>=0.4<0.5 (Ubuntu package ros-indigo-message-runtime) ERROR: ros-pluginlib>=1.10<1.11 (Ubuntu package ros-indigo-pluginlib) ERROR: ros-robot-model>=1.11<1.12 (Ubuntu package ros-indigo-robot-model) ERROR: ros-ros>=1.11<1.12 (Ubuntu package ros-indigo-ros) ERROR: ros-rqt>=0.2<0.5 (Ubuntu package ros-indigo-rqt) ERROR: ros-std-msgs>=0.5 (Ubuntu package ros-indigo-std-msgs) ERROR: ERROR: Please use the system package management tool to install these ERROR: dependencies. If a robotpkg version of a dependency is available, ERROR: you can configure robotpkg.conf to use this version instead. ERROR: ERROR: See /local/robotpkg/var/tmp/robotpkg/wip/prf-ros-control/work/sysdep.log for details. ERROR: ====================================================================== make[2]: *** [sys-depends] Error 2 ===> Logging bulk summary for prf-ros-control-0.2.6r3 => Checking leftover files => Creating bulk log files => Logging bulk metadata ===> Cleaning temporary files for prf-ros-control-0.2.6r3 ===> Done bulk for prf-ros-control-0.2.6r3 [32%] Processing wip/libhatp:libhatp-1.3.0 ===> Bulk building for libhatp-1.3.0 Binary package for libhatp-1.3.0 is up-to-date. [34%] Processing wip/libmove3d-hri:libmove3d-hri-2.24 ===> Cleaning temporary files for libmove3d-hri-2.24 ===> Bulk building for libmove3d-hri-2.24 => Checking for clear installation => Installing /opt/robotpkg/var/lib/robotpkg/packages/bsd/Ubuntu-18.04-x86_64/All/digest-20080510.tgz => Installing /opt/robotpkg/var/lib/robotpkg/packages/bsd/Ubuntu-18.04-x86_64/All/tnftp-20130505~ssl.tgz => Required robotpkg package digest>=20080510: digest-20080510 found => Required robotpkg package tnftp>=20091122: tnftp-20130505~ssl found => Required system package gnupg>=1: gnupg-2.2.4 found => Required system package gzip: gzip-1.6 found => Required system package pax and tar archivers: pax found => Required system package pkg_install>=20110805.9: pkg_install-20110805.9 found => Required system package pkgrepo2deb>=1.3: pkgrepo2deb-1.3 found => Dependency digest-20080510 already installed ERROR: Required robotpkg package libmove3d>=3.22.0: BROKEN => Dependency tnftp-20130505~ssl already installed ===> Logging bulk summary for libmove3d-hri-2.24 => Checking leftover files => Creating bulk log files => Logging bulk metadata ===> Cleaning temporary files for libmove3d-hri-2.24 ===> Done bulk for libmove3d-hri-2.24 [34%] Processing wip/prf-gazebo-ros-pkgs:prf-gazebo-ros-pkgs-2.6.7r4 ===> Cleaning temporary files for prf-gazebo-ros-pkgs-2.6.7r4 ===> Bulk building for prf-gazebo-ros-pkgs-2.6.7r4 => Checking for clear installation => Installing /opt/robotpkg/var/lib/robotpkg/packages/bsd/Ubuntu-18.04-x86_64/All/digest-20080510.tgz => Installing /opt/robotpkg/var/lib/robotpkg/packages/bsd/Ubuntu-18.04-x86_64/All/tnftp-20130505~ssl.tgz => Required robotpkg package digest>=20080510: digest-20080510 found => Required robotpkg package tnftp>=20130505~ssl: tnftp-20130505~ssl found => Required system package gnupg>=1: gnupg-2.2.4 found => Required system package gzip: gzip-1.6 found => Required system package pax and tar archivers: pax found => Required system package pkg_install>=20110805.9: pkg_install-20110805.9 found => Required system package pkgrepo2deb>=1.3: pkgrepo2deb-1.3 found => Dependency digest-20080510 already installed => Required robotpkg package prf-ros-control>=0.2: N/A => Required system package ros-actionlib>=1.11<1.12: MISSING => Required system package ros-catkin>=0.6<0.7: MISSING => Required system package ros-comm>=1.11<1.12: MISSING => Required system package ros-common-msgs>=1.11<1.12: MISSING => Required system package ros-control-toolbox>=1.13<1.15: MISSING => Required system package ros-genmsg>=0.5<0.6: MISSING => Required system package ros-geometry>=1.11<1.12: MISSING => Required system package ros-message-generation>=0.2<0.3: MISSING => Required system package ros-message-runtime>=0.4<0.5 : MISSING => Required system package ros-pluginlib>=1.10<1.11: MISSING => Required system package ros-robot-model>=1.11<1.12: MISSING => Required system package ros-ros>=1.11<1.12: MISSING => Required system package ros-std-msgs>=0.5 : MISSING => Dependency tnftp-20130505~ssl already installed ERROR: ====================================================================== ERROR: Missing system packages required for prf-gazebo-ros-pkgs-2.6.7r4: ERROR: ERROR: ros-actionlib>=1.11<1.12 (Ubuntu package ros-indigo-actionlib) ERROR: ros-catkin>=0.6<0.7 (Ubuntu package ros-indigo-catkin) ERROR: ros-comm>=1.11<1.12 (Ubuntu package ros-indigo-comm) ERROR: ros-common-msgs>=1.11<1.12 (Ubuntu package ros-indigo-common-msgs) ERROR: ros-control-toolbox>=1.13<1.15 (Ubuntu package ros-indigo-control-toolbox) ERROR: ros-genmsg>=0.5<0.6 (Ubuntu package ros-indigo-genmsg) ERROR: ros-geometry>=1.11<1.12 (Ubuntu package ros-indigo-geometry) ERROR: ros-message-generation>=0.2<0.3 (Ubuntu package ros-indigo-message-generation) ERROR: ros-message-runtime>=0.4<0.5 (Ubuntu package ros-indigo-message-runtime) ERROR: ros-pluginlib>=1.10<1.11 (Ubuntu package ros-indigo-pluginlib) ERROR: ros-robot-model>=1.11<1.12 (Ubuntu package ros-indigo-robot-model) ERROR: ros-ros>=1.11<1.12 (Ubuntu package ros-indigo-ros) ERROR: ros-std-msgs>=0.5 (Ubuntu package ros-indigo-std-msgs) ERROR: ERROR: Please use the system package management tool to install these ERROR: dependencies. If a robotpkg version of a dependency is available, ERROR: you can configure robotpkg.conf to use this version instead. ERROR: ERROR: See /local/robotpkg/var/tmp/robotpkg/wip/prf-gazebo-ros-pkgs/work/sysdep.log for details. ERROR: ====================================================================== make[2]: *** [sys-depends] Error 2 ===> Logging bulk summary for prf-gazebo-ros-pkgs-2.6.7r4 => Checking leftover files => Creating bulk log files => Logging bulk metadata ===> Cleaning temporary files for prf-gazebo-ros-pkgs-2.6.7r4 ===> Done bulk for prf-gazebo-ros-pkgs-2.6.7r4 [35%] Processing wip/head-action:head-action-0.0.1r3 ===> Cleaning temporary files for head-action-0.0.1r3 ===> Bulk building for head-action-0.0.1r3 => Checking for clear installation => Installing /opt/robotpkg/var/lib/robotpkg/packages/bsd/Ubuntu-18.04-x86_64/All/digest-20080510.tgz => Installing /opt/robotpkg/var/lib/robotpkg/packages/bsd/Ubuntu-18.04-x86_64/All/tnftp-20130505~ssl.tgz => Required robotpkg package digest>=20080510: digest-20080510 found => Required robotpkg package tnftp>=20130505~ssl: tnftp-20130505~ssl found => Required system package gnupg>=1: gnupg-2.2.4 found => Required system package gzip: gzip-1.6 found => Required system package pax and tar archivers: pax found => Required system package pkg_install>=20110805.9: pkg_install-20110805.9 found => Required system package pkgrepo2deb>=1.3: pkgrepo2deb-1.3 found => Dependency digest-20080510 already installed => Installing /opt/robotpkg/var/lib/robotpkg/packages/bsd/Ubuntu-18.04-x86_64/All/orocos-kdl-1.3.0.tgz => Required system package ros-catkin>=0.6<0.7: MISSING => Required system package ros-comm>=1.11<1.12: MISSING => Required system package ros-common-msgs>=1.11<1.12: MISSING => Required system package ros-control-msgs>=1.3<1.4: MISSING => Required system package ros-genmsg>=0.5<0.6: MISSING => Required system package ros-geometry>=1.11<1.12: MISSING => Required system package ros-message-generation>=0.2<0.3: MISSING => Required system package ros-message-runtime>=0.4<0.5 : MISSING => Required system package ros-robot-model>=1.11<1.12: MISSING => Required system package ros-std-msgs>=0.5 : MISSING => Dependency tnftp-20130505~ssl already installed ERROR: ====================================================================== ERROR: Missing system packages required for head-action-0.0.1r3: ERROR: ERROR: ros-catkin>=0.6<0.7 (Ubuntu package ros-indigo-catkin) ERROR: ros-comm>=1.11<1.12 (Ubuntu package ros-indigo-comm) ERROR: ros-common-msgs>=1.11<1.12 (Ubuntu package ros-indigo-common-msgs) ERROR: ros-control-msgs>=1.3<1.4 (Ubuntu package ros-indigo-control-msgs) ERROR: ros-genmsg>=0.5<0.6 (Ubuntu package ros-indigo-genmsg) ERROR: ros-geometry>=1.11<1.12 (Ubuntu package ros-indigo-geometry) ERROR: ros-message-generation>=0.2<0.3 (Ubuntu package ros-indigo-message-generation) ERROR: ros-message-runtime>=0.4<0.5 (Ubuntu package ros-indigo-message-runtime) ERROR: ros-robot-model>=1.11<1.12 (Ubuntu package ros-indigo-robot-model) ERROR: ros-std-msgs>=0.5 (Ubuntu package ros-indigo-std-msgs) ERROR: ERROR: Please use the system package management tool to install these ERROR: dependencies. If a robotpkg version of a dependency is available, ERROR: you can configure robotpkg.conf to use this version instead. ERROR: ERROR: See /local/robotpkg/var/tmp/robotpkg/wip/head-action/work/sysdep.log for details. ERROR: ====================================================================== make[2]: *** [sys-depends] Error 2 ===> Logging bulk summary for head-action-0.0.1r3 => Checking leftover files => Creating bulk log files => Logging bulk metadata ===> Cleaning temporary files for head-action-0.0.1r3 ===> Done bulk for head-action-0.0.1r3 [35%] Processing wip/certi:certi-3.5.1 ===> Cleaning temporary files for certi-3.5.1 ===> Bulk building for certi-3.5.1 => Checking for clear installation => Installing /opt/robotpkg/var/lib/robotpkg/packages/bsd/Ubuntu-18.04-x86_64/All/digest-20080510.tgz => Installing /opt/robotpkg/var/lib/robotpkg/packages/bsd/Ubuntu-18.04-x86_64/All/tnftp-20130505~ssl.tgz => Required robotpkg package digest>=20080510: digest-20080510 found => Required robotpkg package tnftp>=20091122: tnftp-20130505~ssl found => Required system package gnupg>=1: gnupg-2.2.4 found => Required system package gzip: gzip-1.6 found => Required system package pax and tar archivers: pax found => Required system package pkg_install>=20110805.9: pkg_install-20110805.9 found => Required system package pkgrepo2deb>=1.3: pkgrepo2deb-1.3 found => Dependency digest-20080510 already installed => Dependency tnftp-20130505~ssl already installed => Building with no option. => Use the GNU C++ compiler: c++-compiler provided by g++>=3 => Use the GNU C compiler: c-compiler provided by gcc>=3 => Required system package bison: bison found => Required system package cmake>=2.8.11: cmake-3.10.2 found => Required system package flex>=2.5.33: flex-2.6.4 found => Required system package g++>=3: g++-7 found => Required system package gcc>=3: gcc-7 found => Required system package libstdc++: libstdc++ found => Required system package libxml2>=2: libxml2-2.9.4 found => SHA1 checksums OK => RMD160 checksums OK An unexpected error occured. The last 10 log lines are shown below. | ucnv_fixFileSeparator(const UConverter *cnv, UChar *source, int32_t sourceLen); | ^~~~~ | make[2]: *** [libCERTI/CMakeFiles/CERTI.dir/XmlParser2000.cc.o] Error 1 | libCERTI/CMakeFiles/CERTI.dir/build.make:966: recipe for target 'libCERTI/CMakeFiles/CERTI.dir/XmlParser2000.cc.o' failed | make[2]: Leaving directory '/local/robotpkg/var/tmp/robotpkg/wip/certi/work/CERTI-3.5.1-Source' | make[1]: *** [libCERTI/CMakeFiles/CERTI.dir/all] Error 2 | CMakeFiles/Makefile2:1401: recipe for target 'libCERTI/CMakeFiles/CERTI.dir/all' failed | make[1]: Leaving directory '/local/robotpkg/var/tmp/robotpkg/wip/certi/work/CERTI-3.5.1-Source' | make: *** [all] Error 2 | Makefile:165: recipe for target 'all' failed For details or bug reports, check the complete log file in: /local/robotpkg/var/tmp/robotpkg/wip/certi/work/build.log make[3]: *** [do-build] Error 2 make[2]: *** [pkg-check-installed] Error 2 => Marking certi-3.5.1 as broken ERROR: make: *** [package] Error 2 ===> Logging bulk summary for certi-3.5.1 => Checking leftover files => Creating bulk log files => Logging bulk metadata ===> Cleaning temporary files for certi-3.5.1 ===> Done bulk for certi-3.5.1 [35%] Processing wip/gdalwrap:gdalwrap-0.1.10 ===> Bulk building for gdalwrap-0.1.10 Binary package for gdalwrap-0.1.10 is up-to-date. [36%] Processing wip/mumps:mumps-4.10.0 ===> Bulk building for mumps-4.10.0 Binary package for mumps-4.10.0 is up-to-date. [36%] Processing wip/metapod:metapod-1.0.10 Warning: DOXYGEN_PLIST_DIR in wip/metapod is deprecated. Warning: use DYNAMIC_PLIST_DIRS instead. Warning: DOXYGEN_PLIST_DIR in wip/metapod is deprecated. Warning: use DYNAMIC_PLIST_DIRS instead. ===> Cleaning temporary files for metapod-1.0.10 ===> Bulk building for metapod-1.0.10 => Checking for clear installation Warning: DOXYGEN_PLIST_DIR in wip/metapod is deprecated. Warning: use DYNAMIC_PLIST_DIRS instead. => Installing /opt/robotpkg/var/lib/robotpkg/packages/bsd/Ubuntu-18.04-x86_64/All/digest-20080510.tgz => Installing /opt/robotpkg/var/lib/robotpkg/packages/bsd/Ubuntu-18.04-x86_64/All/tnftp-20130505~ssl.tgz Warning: DOXYGEN_PLIST_DIR in wip/metapod is deprecated. Warning: use DYNAMIC_PLIST_DIRS instead. => Required robotpkg package digest>=20080510: digest-20080510 found => Required robotpkg package tnftp>=20091122: tnftp-20130505~ssl found => Required system package gnupg>=1: gnupg-2.2.4 found => Required system package gzip: gzip-1.6 found => Required system package pax and tar archivers: pax found => Required system package pkg_install>=20110805.9: pkg_install-20110805.9 found => Required system package pkgrepo2deb>=1.3: pkgrepo2deb-1.3 found Warning: DOXYGEN_PLIST_DIR in wip/metapod is deprecated. Warning: use DYNAMIC_PLIST_DIRS instead. Warning: DOXYGEN_PLIST_DIR in wip/metapod is deprecated. Warning: use DYNAMIC_PLIST_DIRS instead. => Dependency digest-20080510 already installed => Dependency tnftp-20130505~ssl already installed Warning: DOXYGEN_PLIST_DIR in wip/metapod is deprecated. Warning: use DYNAMIC_PLIST_DIRS instead. => Building with no option. => Use the GNU C++ compiler: c++-compiler provided by g++>=3 => Use the GNU C compiler: c-compiler provided by gcc>=3 => Required system package boost-headers>=1.34.1: boost-headers-1.65.1 found => Required system package boostlib-filesystem>=1.34.1: boost-libs-1.65.1 found => Required system package boostlib-iostreams>=1.34.1: boost-libs-1.65.1 found => Required system package boostlib-math>=1.34.1: boost-libs-1.65.1 found => Required system package boostlib-thread>=1.34.1: boost-libs-1.65.1 found => Required system package cmake>=2.6: cmake-3.10.2 found => Required system package doxygen>=1.5: doxygen-1.8.13 found => Required system package eigen3>=3.0.0: eigen3-3.3.4 found => Required system package g++>=3: g++-7 found => Required system package gcc>=3: gcc-7 found => Required system package graphviz>=2: graphviz-2.40.1 found => Required system package libstdc++: libstdc++ found => Required system package pdflatex: pdflatex found => Required system package pkg-config>=0.22: pkg-config-0.29.1 found Warning: DOXYGEN_PLIST_DIR in wip/metapod is deprecated. Warning: use DYNAMIC_PLIST_DIRS instead. Warning: DOXYGEN_PLIST_DIR in wip/metapod is deprecated. Warning: use DYNAMIC_PLIST_DIRS instead. Warning: DOXYGEN_PLIST_DIR in wip/metapod is deprecated. Warning: use DYNAMIC_PLIST_DIRS instead. => SHA1 checksums OK => RMD160 checksums OK An unexpected error occured. The last 10 log lines are shown below. | make[2]: Leaving directory '/local/robotpkg/var/tmp/robotpkg/wip/metapod/work/metapod-1.0.10' | CMakeFiles/Makefile2:829: recipe for target 'tests/spatial/CMakeFiles/test_rotation.dir/all' failed | make[2]: *** [tests/spatial/CMakeFiles/test_transform.dir/test_transform.cc.o] Error 1 | tests/spatial/CMakeFiles/test_transform.dir/build.make:65: recipe for target 'tests/spatial/CMakeFiles/test_transform.dir/test_transform.cc.o' failed | make[2]: Leaving directory '/local/robotpkg/var/tmp/robotpkg/wip/metapod/work/metapod-1.0.10' | make[1]: *** [tests/spatial/CMakeFiles/test_transform.dir/all] Error 2 | CMakeFiles/Makefile2:866: recipe for target 'tests/spatial/CMakeFiles/test_transform.dir/all' failed | make[1]: Leaving directory '/local/robotpkg/var/tmp/robotpkg/wip/metapod/work/metapod-1.0.10' | make: *** [all] Error 2 | Makefile:165: recipe for target 'all' failed For details or bug reports, check the complete log file in: /local/robotpkg/var/tmp/robotpkg/wip/metapod/work/build.log make[3]: *** [do-build] Error 2 make[2]: *** [pkg-check-installed] Error 2 => Marking metapod-1.0.10 as broken ERROR: make: *** [package] Error 2 Warning: DOXYGEN_PLIST_DIR in wip/metapod is deprecated. Warning: use DYNAMIC_PLIST_DIRS instead. ===> Logging bulk summary for metapod-1.0.10 => Checking leftover files => Creating bulk log files => Logging bulk metadata Warning: DOXYGEN_PLIST_DIR in wip/metapod is deprecated. Warning: use DYNAMIC_PLIST_DIRS instead. Warning: DOXYGEN_PLIST_DIR in wip/metapod is deprecated. Warning: use DYNAMIC_PLIST_DIRS instead. Warning: DOXYGEN_PLIST_DIR in wip/metapod is deprecated. Warning: use DYNAMIC_PLIST_DIRS instead. ===> Cleaning temporary files for metapod-1.0.10 ===> Done bulk for metapod-1.0.10 [37%] Processing wip/py-laaswm:py27-laaswm-1.3r1 ===> Bulk building for py27-laaswm-1.3r1 Binary package for py27-laaswm-1.3r1 is up-to-date. [37%] Processing wip/jsbsim:jsbsim-20150424 ===> Bulk building for jsbsim-20150424 Binary package for jsbsim-20150424 is up-to-date. [38%] Processing wip/dptu-genom3:dptu-genom3-0.2~pocolibs-client-c+codels+openprs+pocolibs-server+!* ===> Bulk building for dptu-genom3-0.2~codels+openprs+pocolibs-client-c+pocolibs-server Binary package for dptu-genom3-0.2~codels+openprs+pocolibs-client-c+pocolibs-server is up-to-date. [38%] Processing wip/dptu-genom3:dptu-genom3-0.2~codels+openprs+ros-client-c+ros-client-ros+ros-server+!* ===> Bulk building for dptu-genom3-0.2~codels+openprs+ros-client-c+ros-client-ros+ros-server Binary package for dptu-genom3-0.2~codels+openprs+ros-client-c+ros-client-ros+ros-server is up-to-date. [38%] Processing wip/ros-swri-string-util:ros-swri-string-util-2.3.0 ===> Cleaning temporary files for ros-swri-string-util-2.3.0 ===> Bulk building for ros-swri-string-util-2.3.0 => Checking for clear installation => Installing /opt/robotpkg/var/lib/robotpkg/packages/bsd/Ubuntu-18.04-x86_64/All/digest-20080510.tgz => Installing /opt/robotpkg/var/lib/robotpkg/packages/bsd/Ubuntu-18.04-x86_64/All/tnftp-20130505~ssl.tgz => Required robotpkg package digest>=20080510: digest-20080510 found => Required robotpkg package tnftp>=20130505~ssl: tnftp-20130505~ssl found => Required system package gnupg>=1: gnupg-2.2.4 found => Required system package gzip: gzip-1.6 found => Required system package pax and tar archivers: pax found => Required system package pkg_install>=20110805.9: pkg_install-20110805.9 found => Required system package pkgrepo2deb>=1.3: pkgrepo2deb-1.3 found => Dependency digest-20080510 already installed => Installing /opt/robotpkg/var/lib/robotpkg/packages/bsd/Ubuntu-18.04-x86_64/All/ros-catkin-0.6.9r2.tgz => Dependency tnftp-20130505~ssl already installed => Building with no option. => Use the GNU C++ compiler: c++-compiler provided by g++>=3 => Use the GNU C compiler: c-compiler provided by gcc>=3 => Use python-2.7: python>=2.5<3.7 provided by python27>=2.7<2.8 => Use ros indigo: ros==indigo provided by ros-indigo => Required system package cmake>=2.8.3: cmake-3.10.2 found => Required system package g++>=3: g++-7 found => Required system package gcc>=3: gcc-7 found => Required system package googletest: googletest found => Required system package libstdc++: libstdc++ found => Required system package pkg-config>=0.22: pkg-config-0.29.1 found => Required system package py27-empy>=3: py27-empy-3.3.2 found => Required system package py27-nose>=0.10: py27-nose-1.3.7 found => Required system package python27>=2.7<2.8: python27-2.7.151 found => Required robotpkg package ros-catkin>=0.6<0.7: ros-catkin-0.6.9r2 found => SHA1 checksums OK => RMD160 checksums OK An unexpected error occured. The last 10 log lines are shown below. | | Add the installation prefix of "rostest" to CMAKE_PREFIX_PATH or set | "rostest_DIR" to a directory containing one of the above files. If | "rostest" provides a separate development package or SDK, be sure it has | been installed. | | | -- Configuring incomplete, errors occurred! | See also "/local/robotpkg/var/tmp/robotpkg/wip/ros-swri-string-util/work/marti_common-2.3.0/swri_string_util/CMakeFiles/CMakeOutput.log". | See also "/local/robotpkg/var/tmp/robotpkg/wip/ros-swri-string-util/work/marti_common-2.3.0/swri_string_util/CMakeFiles/CMakeError.log". For details or bug reports, check the complete log file in: /local/robotpkg/var/tmp/robotpkg/wip/ros-swri-string-util/work/configure.log make[3]: *** [do-configure-cmake] Error 1 make[2]: *** [pkg-check-installed] Error 2 => Marking ros-swri-string-util-2.3.0 as broken ERROR: make: *** [package] Error 2 ===> Logging bulk summary for ros-swri-string-util-2.3.0 => Checking leftover files => Creating bulk log files => Logging bulk metadata ===> Cleaning temporary files for ros-swri-string-util-2.3.0 ===> Done bulk for ros-swri-string-util-2.3.0 [39%] Processing wip/ros-swri-serial-util:ros-swri-serial-util-2.3.0 ===> Bulk building for ros-swri-serial-util-2.3.0 Binary package for ros-swri-serial-util-2.3.0 is up-to-date. [39%] Processing wip/can-utils:can-utils-2018.02.0 ===> Bulk building for can-utils-2018.02.0 Binary package for can-utils-2018.02.0 is up-to-date. [40%] Processing wip/chilitags:chilitags-1.3.1 ===> Cleaning temporary files for chilitags-1.3.1 ===> Bulk building for chilitags-1.3.1 => Checking for clear installation => Installing /opt/robotpkg/var/lib/robotpkg/packages/bsd/Ubuntu-18.04-x86_64/All/digest-20080510.tgz => Installing /opt/robotpkg/var/lib/robotpkg/packages/bsd/Ubuntu-18.04-x86_64/All/tnftp-20130505~ssl.tgz => Required robotpkg package digest>=20080510: digest-20080510 found => Required robotpkg package tnftp>=20130505~ssl: tnftp-20130505~ssl found => Required system package gnupg>=1: gnupg-2.2.4 found => Required system package gzip: gzip-1.6 found => Required system package pax and tar archivers: pax found => Required system package pkg_install>=20110805.9: pkg_install-20110805.9 found => Required system package pkgrepo2deb>=1.3: pkgrepo2deb-1.3 found => Dependency digest-20080510 already installed => Dependency tnftp-20130505~ssl already installed => Building with no option. => Use the GNU C++ compiler: c++-compiler provided by g++>=4.7 => Required system package cmake>=2.6: cmake-3.10.2 found => Required system package g++>=4.7: g++-7 found => Required system package libstdc++: libstdc++ found => Required system package opencv>=2.4: opencv-3.2.0 found => SHA1 checksums OK => RMD160 checksums OK An unexpected error occured. The last 10 log lines are shown below. | CMake Error at /usr/share/cmake-3.10/Modules/FindPackageHandleStandardArgs.cmake:137 (message): | Could NOT find OpenCV (missing: ts) (found version "3.2.0") | Call Stack (most recent call first): | /usr/share/cmake-3.10/Modules/FindPackageHandleStandardArgs.cmake:378 (_FPHSA_FAILURE_MESSAGE) | /usr/share/OpenCV/OpenCVConfig.cmake:260 (find_package_handle_standard_args) | CMakeLists.txt:9 (find_package) | | | -- Configuring incomplete, errors occurred! | See also "/local/robotpkg/var/tmp/robotpkg/wip/chilitags/work/chilitags-1.3.1/CMakeFiles/CMakeOutput.log". For details or bug reports, check the complete log file in: /local/robotpkg/var/tmp/robotpkg/wip/chilitags/work/configure.log make[3]: *** [do-configure-cmake] Error 1 make[2]: *** [pkg-check-installed] Error 2 => Marking chilitags-1.3.1 as broken ERROR: make: *** [package] Error 2 ===> Logging bulk summary for chilitags-1.3.1 => Checking leftover files => Creating bulk log files => Logging bulk metadata ===> Cleaning temporary files for chilitags-1.3.1 ===> Done bulk for chilitags-1.3.1 [40%] Processing wip/tf-lookup:tf-lookup-0.0.1r1 ===> Bulk building for tf-lookup-0.0.1r1 Binary package for tf-lookup-0.0.1r1 is up-to-date. [41%] Processing wip/ros-swri-math-util:ros-swri-math-util-2.3.0 ===> Bulk building for ros-swri-math-util-2.3.0 Binary package for ros-swri-math-util-2.3.0 is up-to-date. [41%] Processing wip/hrp2-14-description:hrp2-14-description-1.0.5 ===> Bulk building for hrp2-14-description-1.0.5 Binary package for hrp2-14-description-1.0.5 is up-to-date. [41%] Processing wip/hrp2-computer-monitor:hrp2-computer-monitor-1.0.2 ===> Bulk building for hrp2-computer-monitor-1.0.2 Binary package for hrp2-computer-monitor-1.0.2 is up-to-date. [42%] Processing wip/FRILibrary:FRILibrary-1.2r1 ===> Bulk building for FRILibrary-1.2r1 Binary package for FRILibrary-1.2r1 is up-to-date. [42%] Processing wip/pal-transmissions:pal-transmissions-0.2.2r2 ===> Cleaning temporary files for pal-transmissions-0.2.2r2 ===> Bulk building for pal-transmissions-0.2.2r2 => Checking for clear installation => Installing /opt/robotpkg/var/lib/robotpkg/packages/bsd/Ubuntu-18.04-x86_64/All/digest-20080510.tgz => Installing /opt/robotpkg/var/lib/robotpkg/packages/bsd/Ubuntu-18.04-x86_64/All/tnftp-20130505~ssl.tgz => Required robotpkg package digest>=20080510: digest-20080510 found => Required robotpkg package tnftp>=20130505~ssl: tnftp-20130505~ssl found => Required system package gnupg>=1: gnupg-2.2.4 found => Required system package gzip: gzip-1.6 found => Required system package pax and tar archivers: pax found => Required system package pkg_install>=20110805.9: pkg_install-20110805.9 found => Required system package pkgrepo2deb>=1.3: pkgrepo2deb-1.3 found => Dependency digest-20080510 already installed => Required robotpkg package prf-ros-control>=0.2: N/A => Dependency tnftp-20130505~ssl already installed ===> Logging bulk summary for pal-transmissions-0.2.2r2 => Checking leftover files => Creating bulk log files => Logging bulk metadata ===> Cleaning temporary files for pal-transmissions-0.2.2r2 ===> Done bulk for pal-transmissions-0.2.2r2 [43%] Processing wip/py-hla:py27-hla-1.1.1r1 ===> Cleaning temporary files for py27-hla-1.1.1r1 ===> Bulk building for py27-hla-1.1.1r1 => Checking for clear installation => Installing /opt/robotpkg/var/lib/robotpkg/packages/bsd/Ubuntu-18.04-x86_64/All/digest-20080510.tgz => Installing /opt/robotpkg/var/lib/robotpkg/packages/bsd/Ubuntu-18.04-x86_64/All/tnftp-20130505~ssl.tgz => Required robotpkg package digest>=20080510: digest-20080510 found => Required robotpkg package tnftp>=20091122: tnftp-20130505~ssl found => Required system package gnupg>=1: gnupg-2.2.4 found => Required system package gzip: gzip-1.6 found => Required system package patch>=2.0: patch-2.7.6 found => Required system package pax and tar archivers: pax found => Required system package pkg_install>=20110805.9: pkg_install-20110805.9 found => Required system package pkgrepo2deb>=1.3: pkgrepo2deb-1.3 found ERROR: Required robotpkg package certi>=3.4.0: BROKEN => Dependency digest-20080510 already installed => Dependency tnftp-20130505~ssl already installed ===> Logging bulk summary for py27-hla-1.1.1r1 => Checking leftover files => Creating bulk log files => Logging bulk metadata ===> Cleaning temporary files for py27-hla-1.1.1r1 ===> Done bulk for py27-hla-1.1.1r1 [43%] Processing wip/py-hla:py32-hla-1.1.1r1 ===> Bulk building for py32-hla-1.1.1r1 Binary package for py32-hla-1.1.1r1 is up-to-date. [43%] Processing wip/py-hla:py34-hla-1.1.1r1 ===> Bulk building for py34-hla-1.1.1r1 Binary package for py34-hla-1.1.1r1 is up-to-date. [44%] Processing wip/py-hla:py35-hla-1.1.1r1 ===> Bulk building for py35-hla-1.1.1r1 Binary package for py35-hla-1.1.1r1 is up-to-date. [44%] Processing wip/py-hla:py36-hla-1.1.1r1 ===> Cleaning temporary files for py36-hla-1.1.1r1 ===> Bulk building for py36-hla-1.1.1r1 => Checking for clear installation => Installing /opt/robotpkg/var/lib/robotpkg/packages/bsd/Ubuntu-18.04-x86_64/All/digest-20080510.tgz => Installing /opt/robotpkg/var/lib/robotpkg/packages/bsd/Ubuntu-18.04-x86_64/All/tnftp-20130505~ssl.tgz => Required robotpkg package digest>=20080510: digest-20080510 found => Required robotpkg package tnftp>=20091122: tnftp-20130505~ssl found => Required system package gnupg>=1: gnupg-2.2.4 found => Required system package gzip: gzip-1.6 found => Required system package patch>=2.0: patch-2.7.6 found => Required system package pax and tar archivers: pax found => Required system package pkg_install>=20110805.9: pkg_install-20110805.9 found => Required system package pkgrepo2deb>=1.3: pkgrepo2deb-1.3 found ERROR: Required robotpkg package certi>=3.4.0: BROKEN => Dependency digest-20080510 already installed => Dependency tnftp-20130505~ssl already installed ===> Logging bulk summary for py36-hla-1.1.1r1 => Checking leftover files => Creating bulk log files => Logging bulk metadata ===> Cleaning temporary files for py36-hla-1.1.1r1 ===> Done bulk for py36-hla-1.1.1r1 [45%] Processing wip/ompl:ompl-1.0.0 ===> Bulk building for ompl-1.0.0 Binary package for ompl-1.0.0 is up-to-date. [45%] Processing wip/infuse-asn1-types:infuse-asn1-types-0.2 ===> Cleaning temporary files for infuse-asn1-types-0.2 ===> Bulk building for infuse-asn1-types-0.2 => Checking for clear installation => Installing /opt/robotpkg/var/lib/robotpkg/packages/bsd/Ubuntu-18.04-x86_64/All/digest-20080510.tgz => Installing /opt/robotpkg/var/lib/robotpkg/packages/bsd/Ubuntu-18.04-x86_64/All/tnftp-20130505~ssl.tgz => Required robotpkg package digest>=20080510: digest-20080510 found => Required robotpkg package tnftp>=20091122: tnftp-20130505~ssl found => Required system package gnupg>=1: gnupg-2.2.4 found => Required system package gzip: gzip-1.6 found => Required system package pax and tar archivers: pax found => Required system package pkg_install>=20110805.9: pkg_install-20110805.9 found => Required system package pkgrepo2deb>=1.3: pkgrepo2deb-1.3 found => Dependency digest-20080510 already installed => Required system package mono>=4.2: MISSING => Dependency tnftp-20130505~ssl already installed ERROR: ====================================================================== ERROR: Missing system packages required for infuse-asn1-types-0.2: ERROR: ERROR: mono>=4.2 (Ubuntu package mono-devel) ERROR: ERROR: Please use the system package management tool to install these ERROR: dependencies. If a robotpkg version of a dependency is available, ERROR: you can configure robotpkg.conf to use this version instead. ERROR: ERROR: See /local/robotpkg/var/tmp/robotpkg/wip/infuse-asn1-types/work/sysdep.log for details. ERROR: ====================================================================== make[2]: *** [sys-depends] Error 2 ===> Logging bulk summary for infuse-asn1-types-0.2 => Checking leftover files => Creating bulk log files => Logging bulk metadata ===> Cleaning temporary files for infuse-asn1-types-0.2 ===> Done bulk for infuse-asn1-types-0.2 [46%] Processing wip/talos-data:talos-data-0.0.17r5 ===> Bulk building for talos-data-0.0.17r5 Binary package for talos-data-0.0.17r5 is up-to-date. [46%] Processing wip/backward-ros:backward-ros-0.1.4r3 ===> Cleaning temporary files for backward-ros-0.1.4r3 ===> Bulk building for backward-ros-0.1.4r3 => Checking for clear installation => Installing /opt/robotpkg/var/lib/robotpkg/packages/bsd/Ubuntu-18.04-x86_64/All/digest-20080510.tgz => Installing /opt/robotpkg/var/lib/robotpkg/packages/bsd/Ubuntu-18.04-x86_64/All/tnftp-20130505~ssl.tgz => Required robotpkg package digest>=20080510: digest-20080510 found => Required robotpkg package tnftp>=20091122: tnftp-20130505~ssl found => Required system package gnupg>=1: gnupg-2.2.4 found => Required system package gzip: gzip-1.6 found => Required system package pax and tar archivers: pax found => Required system package pkg_install>=20110805.9: pkg_install-20110805.9 found => Required system package pkgrepo2deb>=1.3: pkgrepo2deb-1.3 found => Dependency digest-20080510 already installed => Dependency tnftp-20130505~ssl already installed => Building with no option. => Use the GNU C++ compiler: c++-compiler provided by g++>=3 => Use the GNU C compiler: c-compiler provided by gcc>=3 => Use python-2.7: python>=2.5<3.7 provided by python27>=2.7<2.8 => Use ros melodic: ros>=groovy provided by ros-melodic => Required system package cmake>=2.8.3: cmake-3.10.2 found => Required system package g++>=3: g++-7 found => Required system package gcc>=3: gcc-7 found => Required system package googletest: googletest found => Required system package libstdc++: libstdc++ found => Required system package pkg-config>=0.22: pkg-config-0.29.1 found => Required system package py27-empy>=3: py27-empy-3.3.2 found => Required system package py27-nose>=0.10: py27-nose-1.3.7 found => Required system package python27>=2.7<2.8: python27-2.7.151 found => Required system package ros-catkin>=0.7<0.8: ros-catkin-0.7.14 found => Required system package ros-comm>=1.13<1.15: ros-comm-1.14.2 found => SHA1 checksums OK => RMD160 checksums OK An unexpected error occured. The last 10 log lines are shown below. | make[1]: *** Waiting for unfinished jobs.... | CMakeFiles/Makefile2:107: recipe for target 'CMakeFiles/backward_object.dir/all' failed | CMakeFiles/backward.dir/build.make:65: recipe for target 'CMakeFiles/backward.dir/src/backward.cpp.o' failed | make[2]: *** [CMakeFiles/backward.dir/src/backward.cpp.o] Error 1 | make[1]: *** [CMakeFiles/backward.dir/all] Error 2 | make[2]: Leaving directory '/local/robotpkg/var/tmp/robotpkg/wip/backward-ros/work/backward_ros-0.1.4' | make: *** [all] Error 2 | CMakeFiles/Makefile2:70: recipe for target 'CMakeFiles/backward.dir/all' failed | make[1]: Leaving directory '/local/robotpkg/var/tmp/robotpkg/wip/backward-ros/work/backward_ros-0.1.4' | Makefile:132: recipe for target 'all' failed For details or bug reports, check the complete log file in: /local/robotpkg/var/tmp/robotpkg/wip/backward-ros/work/build.log make[3]: *** [do-build] Error 2 make[2]: *** [pkg-check-installed] Error 2 => Marking backward-ros-0.1.4r3 as broken ERROR: make: *** [package] Error 2 ===> Logging bulk summary for backward-ros-0.1.4r3 => Checking leftover files => Creating bulk log files => Logging bulk metadata ===> Cleaning temporary files for backward-ros-0.1.4r3 ===> Done bulk for backward-ros-0.1.4r3 [46%] Processing wip/move3d-assets:move3d-assets-20120125 ===> Bulk building for move3d-assets-20120125 Binary package for move3d-assets-20120125 is up-to-date. [47%] Processing wip/ros-swri-nodelet:ros-swri-nodelet-2.3.0 ===> Bulk building for ros-swri-nodelet-2.3.0 Binary package for ros-swri-nodelet-2.3.0 is up-to-date. [47%] Processing wip/morse-hla:morse-hla-1.4 ===> Cleaning temporary files for morse-hla-1.4 ===> Bulk building for morse-hla-1.4 => Checking for clear installation => Installing /opt/robotpkg/var/lib/robotpkg/packages/bsd/Ubuntu-18.04-x86_64/All/digest-20080510.tgz => Installing /opt/robotpkg/var/lib/robotpkg/packages/bsd/Ubuntu-18.04-x86_64/All/tnftp-20130505~ssl.tgz => Required robotpkg package digest>=20080510: digest-20080510 found => Required robotpkg package tnftp>=20091122: tnftp-20130505~ssl found => Required system package gnupg>=1: gnupg-2.2.4 found => Required system package gzip: gzip-1.6 found => Required system package patch>=2.0: patch-2.7.6 found => Required system package pax and tar archivers: pax found => Required system package pkg_install>=20110805.9: pkg_install-20110805.9 found => Required system package pkgrepo2deb>=1.3: pkgrepo2deb-1.3 found => Dependency digest-20080510 already installed => Installing /opt/robotpkg/var/lib/robotpkg/packages/bsd/Ubuntu-18.04-x86_64/All/morse-1.4~doc.tgz ERROR: Required robotpkg package py36-hla>=1.1.1: BROKEN => Dependency tnftp-20130505~ssl already installed ===> Logging bulk summary for morse-hla-1.4 => Checking leftover files => Creating bulk log files => Logging bulk metadata ===> Cleaning temporary files for morse-hla-1.4 ===> Done bulk for morse-hla-1.4 [48%] Processing wip/pal-hardware-interfaces:pal-hardware-interfaces-0.0.3 ===> Cleaning temporary files for pal-hardware-interfaces-0.0.3 ===> Bulk building for pal-hardware-interfaces-0.0.3 => Checking for clear installation => Installing /opt/robotpkg/var/lib/robotpkg/packages/bsd/Ubuntu-18.04-x86_64/All/digest-20080510.tgz => Installing /opt/robotpkg/var/lib/robotpkg/packages/bsd/Ubuntu-18.04-x86_64/All/tnftp-20130505~ssl.tgz => Required robotpkg package digest>=20080510: digest-20080510 found => Required robotpkg package tnftp>=20130505~ssl: tnftp-20130505~ssl found => Required system package gnupg>=1: gnupg-2.2.4 found => Required system package gzip: gzip-1.6 found => Required system package pax and tar archivers: pax found => Required system package pkg_install>=20110805.9: pkg_install-20110805.9 found => Required system package pkgrepo2deb>=1.3: pkgrepo2deb-1.3 found => Dependency digest-20080510 already installed => Required robotpkg package prf-ros-control>=0.2: N/A => Dependency tnftp-20130505~ssl already installed ===> Logging bulk summary for pal-hardware-interfaces-0.0.3 => Checking leftover files => Creating bulk log files => Logging bulk metadata ===> Cleaning temporary files for pal-hardware-interfaces-0.0.3 ===> Done bulk for pal-hardware-interfaces-0.0.3 [48%] Processing wip/hrp2-bringup:hrp2-bringup-1.0.6 ===> Bulk building for hrp2-bringup-1.0.6 Binary package for hrp2-bringup-1.0.6 is up-to-date. [48%] Processing wip/hyper:hyper-0.13r1 ===> Cleaning temporary files for hyper-0.13r1 ===> Bulk building for hyper-0.13r1 => Checking for clear installation => Installing /opt/robotpkg/var/lib/robotpkg/packages/bsd/Ubuntu-18.04-x86_64/All/digest-20080510.tgz => Installing /opt/robotpkg/var/lib/robotpkg/packages/bsd/Ubuntu-18.04-x86_64/All/tnftp-20130505~ssl.tgz => Required robotpkg package digest>=20080510: digest-20080510 found => Required robotpkg package tnftp>=20091122: tnftp-20130505~ssl found => Required system package gnupg>=1: gnupg-2.2.4 found => Required system package gzip: gzip-1.6 found => Required system package patch>=2.0: patch-2.7.6 found => Required system package pax and tar archivers: pax found => Required system package pkg_install>=20110805.9: pkg_install-20110805.9 found => Required system package pkgrepo2deb>=1.3: pkgrepo2deb-1.3 found => Dependency digest-20080510 already installed => Dependency tnftp-20130505~ssl already installed => Building with no option. => Use the GNU C++ compiler: c++-compiler provided by g++>=3 => Use the GNU C compiler: c-compiler provided by gcc>=3 => Required system package boost-headers>=1.46.1: boost-headers-1.65.1 found => Required system package boostlib-filesystem>=1.46.1: boost-libs-1.65.1 found => Required system package boostlib-iostreams>=1.46.1: boost-libs-1.65.1 found => Required system package boostlib-math>=1.46.1: boost-libs-1.65.1 found => Required system package boostlib-thread>=1.46.1: boost-libs-1.65.1 found => Required system package cmake>=2.6: cmake-3.10.2 found => Required system package g++>=3: g++-7 found => Required system package gcc>=3: gcc-7 found => Required system package libstdc++: libstdc++ found => SHA1 checksums OK => RMD160 checksums OK => Applying robotpkg patches for hyper-0.13r1 An unexpected error occured. The last 10 log lines are shown below. | ^~~~~~~~~~~~~~~~~~~~~~~~~~~~~~~ | compilation terminated. | make[2]: *** [CMakeFiles/hyper_logic.dir/src/logic/backward_chaining.cc.o] Error 1 | make[1]: *** [CMakeFiles/hyper_logic.dir/all] Error 2 | CMakeFiles/hyper_logic.dir/build.make:65: recipe for target 'CMakeFiles/hyper_logic.dir/src/logic/backward_chaining.cc.o' failed | make[2]: Leaving directory '/local/robotpkg/var/tmp/robotpkg/wip/hyper/work/hyper-0.13' | CMakeFiles/Makefile2:1530: recipe for target 'CMakeFiles/hyper_logic.dir/all' failed | make: *** [all] Error 2 | make[1]: Leaving directory '/local/robotpkg/var/tmp/robotpkg/wip/hyper/work/hyper-0.13' | Makefile:143: recipe for target 'all' failed For details or bug reports, check the complete log file in: /local/robotpkg/var/tmp/robotpkg/wip/hyper/work/build.log make[3]: *** [do-build] Error 2 make[2]: *** [pkg-check-installed] Error 2 => Marking hyper-0.13r1 as broken ERROR: make: *** [package] Error 2 ===> Logging bulk summary for hyper-0.13r1 => Checking leftover files => Creating bulk log files => Logging bulk metadata ===> Cleaning temporary files for hyper-0.13r1 ===> Done bulk for hyper-0.13r1 [49%] Processing wip/gerard-bauzil:gerard-bauzil-1.0.1 ===> Bulk building for gerard-bauzil-1.0.1 Binary package for gerard-bauzil-1.0.1 is up-to-date. [49%] Processing wip/urg:urg-0.8.18 ===> Bulk building for urg-0.8.18 Binary package for urg-0.8.18 is up-to-date. [50%] Processing wip/spark-genom:spark-genom-3.9 ===> Cleaning temporary files for spark-genom-3.9~mightability+openprs+tcl+tclserv_client ===> Bulk building for spark-genom-3.9~mightability+openprs+tcl+tclserv_client => Checking for clear installation => Installing /opt/robotpkg/var/lib/robotpkg/packages/bsd/Ubuntu-18.04-x86_64/All/digest-20080510.tgz => Installing /opt/robotpkg/var/lib/robotpkg/packages/bsd/Ubuntu-18.04-x86_64/All/tnftp-20130505~ssl.tgz => Required robotpkg package digest>=20080510: digest-20080510 found => Required robotpkg package tnftp>=20091122: tnftp-20130505~ssl found => Required system package gnupg>=1: gnupg-2.2.4 found => Required system package gzip: gzip-1.6 found => Required system package patch>=2.0: patch-2.7.6 found => Required system package pax and tar archivers: pax found => Required system package pkg_install>=20110805.9: pkg_install-20110805.9 found => Required system package pkgrepo2deb>=1.3: pkgrepo2deb-1.3 found => Dependency digest-20080510 already installed => Installing /opt/robotpkg/var/lib/robotpkg/packages/bsd/Ubuntu-18.04-x86_64/All/genBasic-genom-0.4r1~openprs+tcl+tclserv_client.tgz => Installing /opt/robotpkg/var/lib/robotpkg/packages/bsd/Ubuntu-18.04-x86_64/All/genHum-genom-1.1r1~openprs+tcl+tclserv_client.tgz => Installing /opt/robotpkg/var/lib/robotpkg/packages/bsd/Ubuntu-18.04-x86_64/All/genManip-genom-0.9~openprs+tcl+tclserv_client.tgz => Dependency genom-2.12~doc already installed ERROR: Required robotpkg package libmove3d>=3.22.0: BROKEN ERROR: Required robotpkg package libmove3d-hri>=2.24: BROKEN => Installing /opt/robotpkg/var/lib/robotpkg/packages/bsd/Ubuntu-18.04-x86_64/All/libt3d-2.6~doc.tgz => Dependency libtclserv_client-0.5r1 already installed => Installing /opt/robotpkg/var/lib/robotpkg/packages/bsd/Ubuntu-18.04-x86_64/All/mkdep-2.7r1.tgz => Installing /opt/robotpkg/var/lib/robotpkg/packages/bsd/Ubuntu-18.04-x86_64/All/mocap-genom-1.3~openprs+tcl+tclserv_client.tgz => Installing /opt/robotpkg/var/lib/robotpkg/packages/bsd/Ubuntu-18.04-x86_64/All/niut-genom-0.6~openprs+tcl+tclserv_client.tgz => Dependency pocolibs-2.16 already installed => Installing /opt/robotpkg/var/lib/robotpkg/packages/bsd/Ubuntu-18.04-x86_64/All/pom-genom-0.7~openprs+tcl+tclserv_client.tgz => Dependency tclserv-2.8.1 already installed => Dependency tnftp-20130505~ssl already installed => Dependency transgen-1.1b1 already installed => Required robotpkg package viman-genom>=1.4: NOT found ERROR: Required robotpkg package viman-genom>=1.4: NOT found ===> Logging bulk summary for spark-genom-3.9~mightability+openprs+tcl+tclserv_client => Checking leftover files => Creating bulk log files => Logging bulk metadata ===> Cleaning temporary files for spark-genom-3.9~mightability+openprs+tcl+tclserv_client ===> Done bulk for spark-genom-3.9~mightability+openprs+tcl+tclserv_client [50%] Processing wip/dynamic-graph-v3:dynamic-graph-v3-3.0.1 ===> Bulk building for dynamic-graph-v3-3.0.1 Binary package for dynamic-graph-v3-3.0.1 is up-to-date. [51%] Processing wip/histodet:histodet-1.0r2 ===> Bulk building for histodet-1.0r2 Binary package for histodet-1.0r2 is up-to-date. [51%] Processing wip/octovis:octoviz-1.6.1 ===> Cleaning temporary files for octoviz-1.6.1 ===> Bulk building for octoviz-1.6.1 => Checking for clear installation => Installing /opt/robotpkg/var/lib/robotpkg/packages/bsd/Ubuntu-18.04-x86_64/All/digest-20080510.tgz => Installing /opt/robotpkg/var/lib/robotpkg/packages/bsd/Ubuntu-18.04-x86_64/All/tnftp-20130505~ssl.tgz => Required robotpkg package digest>=20080510: digest-20080510 found => Required robotpkg package tnftp>=20130505~ssl: tnftp-20130505~ssl found => Required system package gnupg>=1: gnupg-2.2.4 found => Required system package gzip: gzip-1.6 found => Required system package pax and tar archivers: pax found => Required system package pkg_install>=20110805.9: pkg_install-20110805.9 found => Required system package pkgrepo2deb>=1.3: pkgrepo2deb-1.3 found => Dependency digest-20080510 already installed => Required system package libqglviewer>=2.3: MISSING => Installing /opt/robotpkg/var/lib/robotpkg/packages/bsd/Ubuntu-18.04-x86_64/All/octomap-1.6.1.tgz => Dependency tnftp-20130505~ssl already installed ERROR: ====================================================================== ERROR: Missing system packages required for octoviz-1.6.1: ERROR: ERROR: libqglviewer>=2.3 (Ubuntu package libqglviewer-qt4-dev) ERROR: ERROR: Please use the system package management tool to install these ERROR: dependencies. If a robotpkg version of a dependency is available, ERROR: you can configure robotpkg.conf to use this version instead. ERROR: ERROR: See /local/robotpkg/var/tmp/robotpkg/wip/octovis/work/sysdep.log for details. ERROR: ====================================================================== make[2]: *** [sys-depends] Error 2 ===> Logging bulk summary for octoviz-1.6.1 => Checking leftover files => Creating bulk log files => Logging bulk metadata ===> Cleaning temporary files for octoviz-1.6.1 ===> Done bulk for octoviz-1.6.1 [51%] Processing wip/rqt-dynamic-graph:py27-rqt-dynamic-graph-1.0.0 ===> Bulk building for py27-rqt-dynamic-graph-1.0.0 Binary package for py27-rqt-dynamic-graph-1.0.0 is up-to-date. [52%] Processing wip/rqt-dynamic-graph:py32-rqt-dynamic-graph-1.0.0 ===> Bulk building for py32-rqt-dynamic-graph-1.0.0 Binary package for py32-rqt-dynamic-graph-1.0.0 is up-to-date. [52%] Processing wip/rqt-dynamic-graph:py34-rqt-dynamic-graph-1.0.0 ===> Bulk building for py34-rqt-dynamic-graph-1.0.0 Binary package for py34-rqt-dynamic-graph-1.0.0 is up-to-date. [53%] Processing wip/rqt-dynamic-graph:py35-rqt-dynamic-graph-1.0.0 ===> Bulk building for py35-rqt-dynamic-graph-1.0.0 Binary package for py35-rqt-dynamic-graph-1.0.0 is up-to-date. [53%] Processing wip/rqt-dynamic-graph:py36-rqt-dynamic-graph-1.0.0 ===> Cleaning temporary files for py36-rqt-dynamic-graph-1.0.0 ===> Bulk building for py36-rqt-dynamic-graph-1.0.0 => Checking for clear installation => Installing /opt/robotpkg/var/lib/robotpkg/packages/bsd/Ubuntu-18.04-x86_64/All/digest-20080510.tgz => Installing /opt/robotpkg/var/lib/robotpkg/packages/bsd/Ubuntu-18.04-x86_64/All/tnftp-20130505~ssl.tgz => Required robotpkg package digest>=20080510: digest-20080510 found => Required robotpkg package tnftp>=20091122: tnftp-20130505~ssl found => Required system package gnupg>=1: gnupg-2.2.4 found => Required system package gzip: gzip-1.6 found => Required system package pax and tar archivers: pax found => Required system package pkg_install>=20110805.9: pkg_install-20110805.9 found => Required system package pkgrepo2deb>=1.3: pkgrepo2deb-1.3 found => Dependency digest-20080510 already installed => Required system package py36-empy>=3: MISSING => Required system package ros-catkin>=0.7<0.8: MISSING => Required system package ros-rqt>=0.3<0.6: MISSING => Dependency tnftp-20130505~ssl already installed ERROR: ====================================================================== ERROR: Missing system packages required for py36-rqt-dynamic-graph-1.0.0: ERROR: ERROR: py36-empy>=3 (Ubuntu package python-empy (python-3.6)) ERROR: ros-catkin>=0.7<0.8 (Ubuntu package ros-melodic-catkin) ERROR: ros-rqt>=0.3<0.6 (Ubuntu package ros-melodic-rqt) ERROR: ERROR: Please use the system package management tool to install these ERROR: dependencies. If a robotpkg version of a dependency is available, ERROR: you can configure robotpkg.conf to use this version instead. ERROR: ERROR: See /local/robotpkg/var/tmp/robotpkg/wip/rqt-dynamic-graph/work/sysdep.log for details. ERROR: ====================================================================== make[2]: *** [sys-depends] Error 2 ===> Logging bulk summary for py36-rqt-dynamic-graph-1.0.0 => Checking leftover files => Creating bulk log files => Logging bulk metadata ===> Cleaning temporary files for py36-rqt-dynamic-graph-1.0.0 ===> Done bulk for py36-rqt-dynamic-graph-1.0.0 [53%] Processing wip/vnet-yarp:vnet-yarp-0.2r2 ===> Bulk building for vnet-yarp-0.2r2 Binary package for vnet-yarp-0.2r2 is up-to-date. [54%] Processing wip/prf-ros-controllers:prf-ros-controllers-0.3.5r3 ===> Cleaning temporary files for prf-ros-controllers-0.3.5r3 ===> Bulk building for prf-ros-controllers-0.3.5r3 => Checking for clear installation => Installing /opt/robotpkg/var/lib/robotpkg/packages/bsd/Ubuntu-18.04-x86_64/All/digest-20080510.tgz => Installing /opt/robotpkg/var/lib/robotpkg/packages/bsd/Ubuntu-18.04-x86_64/All/tnftp-20130505~ssl.tgz => Required robotpkg package digest>=20080510: digest-20080510 found => Required robotpkg package tnftp>=20130505~ssl: tnftp-20130505~ssl found => Required system package gnupg>=1: gnupg-2.2.4 found => Required system package gzip: gzip-1.6 found => Required system package pax and tar archivers: pax found => Required system package pkg_install>=20110805.9: pkg_install-20110805.9 found => Required system package pkgrepo2deb>=1.3: pkgrepo2deb-1.3 found => Dependency digest-20080510 already installed => Required robotpkg package pal-hardware-interfaces>=0.0.3: N/A => Required robotpkg package prf-ros-control>=0.2: N/A => Required system package ros-actionlib>=1.11<1.12: MISSING => Required system package ros-catkin>=0.6<0.7: MISSING => Required system package ros-comm>=1.11<1.12: MISSING => Required system package ros-common-msgs>=1.11<1.12: MISSING => Required system package ros-control-msgs>=1.3<1.4: MISSING => Required system package ros-control-toolbox>=1.13<1.15: MISSING => Required system package ros-four-wheel-steering-msgs>=1 : MISSING => Required system package ros-genmsg>=0.5<0.6: MISSING => Required system package ros-geometry>=1.11<1.12: MISSING => Required system package ros-message-generation>=0.2<0.3: MISSING => Required system package ros-message-runtime>=0.4<0.5 : MISSING => Required system package ros-pluginlib>=1.10<1.11: MISSING => Required system package ros-robot-model>=1.11<1.12: MISSING => Required system package ros-ros>=1.11<1.12: MISSING => Required system package ros-std-msgs>=0.5 : MISSING => Required system package ros-urdf-geometry-parser>=0.0.1 : MISSING => Required system package ros-xacro>=1.9<1.10: MISSING => Dependency tnftp-20130505~ssl already installed ERROR: ====================================================================== ERROR: Missing system packages required for prf-ros-controllers-0.3.5r3: ERROR: ERROR: ros-actionlib>=1.11<1.12 (Ubuntu package ros-indigo-actionlib) ERROR: ros-catkin>=0.6<0.7 (Ubuntu package ros-indigo-catkin) ERROR: ros-comm>=1.11<1.12 (Ubuntu package ros-indigo-comm) ERROR: ros-common-msgs>=1.11<1.12 (Ubuntu package ros-indigo-common-msgs) ERROR: ros-control-msgs>=1.3<1.4 (Ubuntu package ros-indigo-control-msgs) ERROR: ros-control-toolbox>=1.13<1.15 (Ubuntu package ros-indigo-control-toolbox) ERROR: ros-four-wheel-steering-msgs>=1 (Ubuntu package ros-indigo-four-wheel-steering-msgs) ERROR: ros-genmsg>=0.5<0.6 (Ubuntu package ros-indigo-genmsg) ERROR: ros-geometry>=1.11<1.12 (Ubuntu package ros-indigo-geometry) ERROR: ros-message-generation>=0.2<0.3 (Ubuntu package ros-indigo-message-generation) ERROR: ros-message-runtime>=0.4<0.5 (Ubuntu package ros-indigo-message-runtime) ERROR: ros-pluginlib>=1.10<1.11 (Ubuntu package ros-indigo-pluginlib) ERROR: ros-robot-model>=1.11<1.12 (Ubuntu package ros-indigo-robot-model) ERROR: ros-ros>=1.11<1.12 (Ubuntu package ros-indigo-ros) ERROR: ros-std-msgs>=0.5 (Ubuntu package ros-indigo-std-msgs) ERROR: ros-urdf-geometry-parser>=0.0.1 (Ubuntu package ros-indigo-urdf-geometry-parser) ERROR: ros-xacro>=1.9<1.10 (Ubuntu package ros-indigo-xacro) ERROR: ERROR: Please use the system package management tool to install these ERROR: dependencies. If a robotpkg version of a dependency is available, ERROR: you can configure robotpkg.conf to use this version instead. ERROR: ERROR: See /local/robotpkg/var/tmp/robotpkg/wip/prf-ros-controllers/work/sysdep.log for details. ERROR: ====================================================================== make[2]: *** [sys-depends] Error 2 ===> Logging bulk summary for prf-ros-controllers-0.3.5r3 => Checking leftover files => Creating bulk log files => Logging bulk metadata ===> Cleaning temporary files for prf-ros-controllers-0.3.5r3 ===> Done bulk for prf-ros-controllers-0.3.5r3 [54%] Processing wip/py-morse:py32-morse-1.4 ===> Bulk building for py32-morse-1.4 Binary package for py32-morse-1.4 is up-to-date. [55%] Processing wip/py-morse:py34-morse-1.4 ===> Bulk building for py34-morse-1.4 Binary package for py34-morse-1.4 is up-to-date. [55%] Processing wip/py-morse:py35-morse-1.4 ===> Bulk building for py35-morse-1.4 Binary package for py35-morse-1.4 is up-to-date. [56%] Processing wip/py-morse:py36-morse-1.4 ===> Bulk building for py36-morse-1.4 Binary package for py36-morse-1.4 is up-to-date. [56%] Processing wip/simple-humanoid-description:simple-humanoid-description-1.0.1 ===> Bulk building for simple-humanoid-description-1.0.1 Binary package for simple-humanoid-description-1.0.1 is up-to-date. [56%] Processing wip/infuse-envire:infuse-envire-0.1 ===> Cleaning temporary files for infuse-envire-0.1 ===> Bulk building for infuse-envire-0.1 => Checking for clear installation => Installing /opt/robotpkg/var/lib/robotpkg/packages/bsd/Ubuntu-18.04-x86_64/All/digest-20080510.tgz => Installing /opt/robotpkg/var/lib/robotpkg/packages/bsd/Ubuntu-18.04-x86_64/All/tnftp-20130505~ssl.tgz => Required robotpkg package digest>=20080510: digest-20080510 found => Required robotpkg package tnftp>=20091122: tnftp-20130505~ssl found => Required system package gnupg>=1: gnupg-2.2.4 found => Required system package gzip: gzip-1.6 found => Required system package pax and tar archivers: pax found => Required system package pkg_install>=20110805.9: pkg_install-20110805.9 found => Required system package pkgrepo2deb>=1.3: pkgrepo2deb-1.3 found => Dependency digest-20080510 already installed => Dependency tnftp-20130505~ssl already installed => Building with no option. => Use the GNU C++ compiler: c++-compiler provided by g++>=3 => Use the GNU C compiler: c-compiler provided by gcc>=3 => Required system package cmake>=2.6: cmake-3.10.2 found => Required system package eigen3>=3.0.0: eigen3-3.3.4 found => Required system package g++>=3: g++-7 found => Required system package gcc>=3: gcc-7 found => Required system package libstdc++: libstdc++ found => Required system package pkg-config>=0.22: pkg-config-0.29.1 found => SHA1 checksums OK => RMD160 checksums OK => Adding run-time search paths to pkg-config files => Registering installation for infuse-envire-0.1 => Linking package in /opt/robotpkg/var/lib/robotpkg/wip/packages/bsd/Ubuntu-18.04-x86_64/pub => Updating debian binary packages ===> Logging bulk summary for infuse-envire-0.1 => Checking leftover files WARNING: 46 files leftover. => Creating bulk log files => Logging bulk metadata ===> Cleaning temporary files for infuse-envire-0.1 ===> Done bulk for infuse-envire-0.1 [57%] Processing wip/soth:soth-2.0.2 ===> Cleaning temporary files for soth-2.0.2 ===> Bulk building for soth-2.0.2 => Checking for clear installation => Installing /opt/robotpkg/var/lib/robotpkg/packages/bsd/Ubuntu-18.04-x86_64/All/digest-20080510.tgz => Installing /opt/robotpkg/var/lib/robotpkg/packages/bsd/Ubuntu-18.04-x86_64/All/tnftp-20130505~ssl.tgz => Required robotpkg package digest>=20080510: digest-20080510 found => Required robotpkg package tnftp>=20091122: tnftp-20130505~ssl found => Required system package gnupg>=1: gnupg-2.2.4 found => Required system package gzip: gzip-1.6 found => Required system package pax and tar archivers: pax found => Required system package pkg_install>=20110805.9: pkg_install-20110805.9 found => Required system package pkgrepo2deb>=1.3: pkgrepo2deb-1.3 found => Dependency digest-20080510 already installed => Dependency tnftp-20130505~ssl already installed => Building with no option. => Use the GNU C++ compiler: c++-compiler provided by g++>=3 => Use the GNU C compiler: c-compiler provided by gcc>=3 => Required system package boost-headers>=1.34.1: boost-headers-1.65.1 found => Required system package boostlib-filesystem>=1.34.1: boost-libs-1.65.1 found => Required system package boostlib-iostreams>=1.34.1: boost-libs-1.65.1 found => Required system package boostlib-math>=1.34.1: boost-libs-1.65.1 found => Required system package boostlib-thread>=1.34.1: boost-libs-1.65.1 found => Required system package cmake>=2.6: cmake-3.10.2 found => Required system package doxygen>=1.5: doxygen-1.8.13 found => Required system package eigen3>=3.0.0: eigen3-3.3.4 found => Required system package g++>=3: g++-7 found => Required system package gcc>=3: gcc-7 found => Required system package libstdc++: libstdc++ found => Required system package pkg-config>=0.22: pkg-config-0.29.1 found => SHA1 checksums OK => RMD160 checksums OK An unexpected error occured. The last 10 log lines are shown below. | inline Scalar& coeffRef(Index row, Index col) | ^~~~~~~~ | src/CMakeFiles/soth.dir/build.make:233: recipe for target 'src/CMakeFiles/soth.dir/Stage.cpp.o' failed | make[2]: Leaving directory '/local/robotpkg/var/tmp/robotpkg/wip/soth/work/soth-2.0.2' | CMakeFiles/Makefile2:536: recipe for target 'src/CMakeFiles/soth.dir/all' failed | make[2]: *** [src/CMakeFiles/soth.dir/Stage.cpp.o] Error 1 | make[1]: Leaving directory '/local/robotpkg/var/tmp/robotpkg/wip/soth/work/soth-2.0.2' | Makefile:165: recipe for target 'all' failed | make[1]: *** [src/CMakeFiles/soth.dir/all] Error 2 | make: *** [all] Error 2 For details or bug reports, check the complete log file in: /local/robotpkg/var/tmp/robotpkg/wip/soth/work/build.log make[3]: *** [do-build] Error 2 make[2]: *** [pkg-check-installed] Error 2 => Marking soth-2.0.2 as broken ERROR: make: *** [package] Error 2 ===> Logging bulk summary for soth-2.0.2 => Checking leftover files => Creating bulk log files => Logging bulk metadata ===> Cleaning temporary files for soth-2.0.2 ===> Done bulk for soth-2.0.2 [57%] Processing wip/infuse-novatel-gps-driver-ros:infuse-novatel-gps-driver-ros-0.1.0 ===> Cleaning temporary files for infuse-novatel-gps-driver-ros-0.1.0 ===> Bulk building for infuse-novatel-gps-driver-ros-0.1.0 => Checking for clear installation => Installing /opt/robotpkg/var/lib/robotpkg/packages/bsd/Ubuntu-18.04-x86_64/All/digest-20080510.tgz => Installing /opt/robotpkg/var/lib/robotpkg/packages/bsd/Ubuntu-18.04-x86_64/All/tnftp-20130505~ssl.tgz => Required robotpkg package digest>=20080510: digest-20080510 found => Required robotpkg package tnftp>=20091122: tnftp-20130505~ssl found => Required system package gnupg>=1: gnupg-2.2.4 found => Required system package gzip: gzip-1.6 found => Required system package pax and tar archivers: pax found => Required system package pkg_install>=20110805.9: pkg_install-20110805.9 found => Required system package pkgrepo2deb>=1.3: pkgrepo2deb-1.3 found => Dependency digest-20080510 already installed WARNING: Cannot check installed version of libpcap => Required system package ros-gps-umd>=0.2.0: MISSING => Required system package ros-swri-math-util>=2.3.0: MISSING => Required system package ros-swri-nodelet>=2.3.0: MISSING => Required system package ros-swri-roscpp>=2.3.0: MISSING => Required system package ros-swri-serial-util>=2.3.0: MISSING => Required system package ros-swri-string-util>=2.3.0: MISSING => Dependency tnftp-20130505~ssl already installed ERROR: ====================================================================== ERROR: Missing system packages required for infuse-novatel-gps-driver-ros-0.1.0: ERROR: ERROR: ros-gps-umd>=0.2.0 (Ubuntu package ros-melodic-gps-umd) ERROR: ros-swri-math-util>=2.3.0 (Ubuntu package ros-melodic-swri-math-util) ERROR: ros-swri-nodelet>=2.3.0 (Ubuntu package ros-melodic-swri-nodelet) ERROR: ros-swri-roscpp>=2.3.0 (Ubuntu package ros-melodic-swri-roscpp) ERROR: ros-swri-serial-util>=2.3.0 (Ubuntu package ros-melodic-swri-serial-util) ERROR: ros-swri-string-util>=2.3.0 (Ubuntu package ros-melodic-swri-string-util) ERROR: ERROR: Please use the system package management tool to install these ERROR: dependencies. If a robotpkg version of a dependency is available, ERROR: you can configure robotpkg.conf to use this version instead. ERROR: ERROR: See /local/robotpkg/var/tmp/robotpkg/wip/infuse-novatel-gps-driver-ros/work/sysdep.log for details. ERROR: ====================================================================== make[2]: *** [sys-depends] Error 2 ===> Logging bulk summary for infuse-novatel-gps-driver-ros-0.1.0 => Checking leftover files => Creating bulk log files => Logging bulk metadata ===> Cleaning temporary files for infuse-novatel-gps-driver-ros-0.1.0 ===> Done bulk for infuse-novatel-gps-driver-ros-0.1.0 [58%] Processing wip/libmove3d-planners:libmove3d-planners-1.4.0 ===> Cleaning temporary files for libmove3d-planners-1.4.0 ===> Bulk building for libmove3d-planners-1.4.0 => Checking for clear installation => Installing /opt/robotpkg/var/lib/robotpkg/packages/bsd/Ubuntu-18.04-x86_64/All/digest-20080510.tgz => Installing /opt/robotpkg/var/lib/robotpkg/packages/bsd/Ubuntu-18.04-x86_64/All/tnftp-20130505~ssl.tgz => Required robotpkg package digest>=20080510: digest-20080510 found => Required robotpkg package tnftp>=20091122: tnftp-20130505~ssl found => Required system package gnupg>=1: gnupg-2.2.4 found => Required system package gzip: gzip-1.6 found => Required system package pax and tar archivers: pax found => Required system package pkg_install>=20110805.9: pkg_install-20110805.9 found => Required system package pkgrepo2deb>=1.3: pkgrepo2deb-1.3 found WARNING: Cannot check installed version of boost-lib-filesystem WARNING: Cannot check installed version of boost-lib-iostreams WARNING: Cannot check installed version of boost-lib-math WARNING: Cannot check installed version of boost-lib-thread => Dependency digest-20080510 already installed WARNING: Cannot check installed version of libXpm ERROR: Required robotpkg package libmove3d>=3.22.0: BROKEN ERROR: Required robotpkg package libmove3d-hri>=2.24: BROKEN => Dependency tnftp-20130505~ssl already installed WARNING: Cannot check installed version of boost-lib-filesystem WARNING: Cannot check installed version of boost-lib-iostreams WARNING: Cannot check installed version of boost-lib-math WARNING: Cannot check installed version of boost-lib-thread WARNING: Cannot check installed version of libXpm ===> Logging bulk summary for libmove3d-planners-1.4.0 => Checking leftover files => Creating bulk log files => Logging bulk metadata ===> Cleaning temporary files for libmove3d-planners-1.4.0 ===> Done bulk for libmove3d-planners-1.4.0 [58%] Processing wip/kukaFri-libs:kukaFri-libs-1.3 ===> Bulk building for kukaFri-libs-1.3 Binary package for kukaFri-libs-1.3 is up-to-date. [58%] Processing wip/infuse-idl:infuse-idl-0.1.1 ===> Bulk building for infuse-idl-0.1.1 Binary package for infuse-idl-0.1.1 is up-to-date. [59%] Processing wip/ros-swri-roscpp:ros-swri-roscpp-2.3.0 ===> Bulk building for ros-swri-roscpp-2.3.0 Binary package for ros-swri-roscpp-2.3.0 is up-to-date. [60%] Processing wip/play-motion:play-motion-0.4.5 ===> Cleaning temporary files for play-motion-0.4.5 ===> Bulk building for play-motion-0.4.5 => Checking for clear installation => Installing /opt/robotpkg/var/lib/robotpkg/packages/bsd/Ubuntu-18.04-x86_64/All/digest-20080510.tgz => Installing /opt/robotpkg/var/lib/robotpkg/packages/bsd/Ubuntu-18.04-x86_64/All/tnftp-20130505~ssl.tgz => Required robotpkg package digest>=20080510: digest-20080510 found => Required robotpkg package tnftp>=20130505~ssl: tnftp-20130505~ssl found => Required system package gnupg>=1: gnupg-2.2.4 found => Required system package gzip: gzip-1.6 found => Required system package pax and tar archivers: pax found => Required system package pkg_install>=20110805.9: pkg_install-20110805.9 found => Required system package pkgrepo2deb>=1.3: pkgrepo2deb-1.3 found => Dependency digest-20080510 already installed => Required robotpkg package prf-ros-control>=0.2: N/A => Dependency tnftp-20130505~ssl already installed ===> Logging bulk summary for play-motion-0.4.5 => Checking leftover files => Creating bulk log files => Logging bulk metadata ===> Cleaning temporary files for play-motion-0.4.5 ===> Done bulk for play-motion-0.4.5 [60%] Processing wip/tsid:tsid-1.0.2 ===> Bulk building for tsid-1.0.2 Binary package for tsid-1.0.2 is up-to-date. [61%] Processing wip/orocos-bfl:orocos-bfl-0.8.0 ===> Bulk building for orocos-bfl-0.8.0 Binary package for orocos-bfl-0.8.0 is up-to-date. [61%] Processing wip/laaswm-gui:laaswm-gui-1.4 ===> Bulk building for laaswm-gui-1.4 Binary package for laaswm-gui-1.4 is up-to-date. [61%] Processing wip/py-mraa:mraa-1.9.0 ===> Cleaning temporary files for mraa-1.9.0 ===> Bulk building for mraa-1.9.0 => Checking for clear installation => Installing /opt/robotpkg/var/lib/robotpkg/packages/bsd/Ubuntu-18.04-x86_64/All/digest-20080510.tgz => Installing /opt/robotpkg/var/lib/robotpkg/packages/bsd/Ubuntu-18.04-x86_64/All/tnftp-20130505~ssl.tgz => Required robotpkg package digest>=20080510: digest-20080510 found => Required robotpkg package tnftp>=20130505~ssl: tnftp-20130505~ssl found => Required system package gnupg>=1: gnupg-2.2.4 found => Required system package gzip: gzip-1.6 found => Required system package pax and tar archivers: pax found => Required system package pkg_install>=20110805.9: pkg_install-20110805.9 found => Required system package pkgrepo2deb>=1.3: pkgrepo2deb-1.3 found => Dependency digest-20080510 already installed => Required system package libjson-c>=0.10: MISSING => Dependency tnftp-20130505~ssl already installed ERROR: ====================================================================== ERROR: Missing system packages required for mraa-1.9.0: ERROR: ERROR: libjson-c>=0.10 ERROR: ERROR: Please use the system package management tool to install these ERROR: dependencies. If a robotpkg version of a dependency is available, ERROR: you can configure robotpkg.conf to use this version instead. ERROR: ERROR: See /local/robotpkg/var/tmp/robotpkg/wip/py-mraa/work/sysdep.log for details. ERROR: ====================================================================== make[2]: *** [sys-depends] Error 2 ===> Logging bulk summary for mraa-1.9.0 => Checking leftover files => Creating bulk log files => Logging bulk metadata ===> Cleaning temporary files for mraa-1.9.0 ===> Done bulk for mraa-1.9.0 [62%] Processing wip/osg-dae:osg-dae-3.2.1r1 ===> Bulk building for osg-dae-3.2.1r1 Binary package for osg-dae-3.2.1r1 is up-to-date. [62%] Processing wip/morse-pocolibs:morse-pocolibs-1.4 ===> Bulk building for morse-pocolibs-1.4 Binary package for morse-pocolibs-1.4 is up-to-date. [63%] Processing wip/py-jsbsim:py27-jsbsim-20150424r1 ===> Cleaning temporary files for py27-jsbsim-20150424r1 ===> Bulk building for py27-jsbsim-20150424r1 => Checking for clear installation => Installing /opt/robotpkg/var/lib/robotpkg/packages/bsd/Ubuntu-18.04-x86_64/All/digest-20080510.tgz => Installing /opt/robotpkg/var/lib/robotpkg/packages/bsd/Ubuntu-18.04-x86_64/All/tnftp-20130505~ssl.tgz => Required robotpkg package digest>=20080510: digest-20080510 found => Required robotpkg package tnftp>=20091122: tnftp-20130505~ssl found => Required system package cvs>=1: cvs-1.12.1325 found => Required system package gnupg>=1: gnupg-2.2.4 found => Required system package gzip: gzip-1.6 found => Required system package pax and tar archivers: pax found => Required system package pkg_install>=20110805.9: pkg_install-20110805.9 found => Required system package pkgrepo2deb>=1.3: pkgrepo2deb-1.3 found => Dependency digest-20080510 already installed => Installing /opt/robotpkg/var/lib/robotpkg/wip/packages/bsd/Ubuntu-18.04-x86_64/All/jsbsim-20150424.tgz => Dependency tnftp-20130505~ssl already installed => Building with no option. => Use the GNU C++ compiler: c++-compiler provided by g++>=3 => Use the GNU C compiler: c-compiler provided by gcc>=3 => Use python-2.7: python>=2.5<3.7 provided by python27>=2.7<2.8 => Required system package cmake>=2.6: cmake-3.10.2 found => Required system package g++>=3: g++-7 found => Required system package gcc>=3: gcc-7 found => Required system package libstdc++: libstdc++ found => Required system package python27>=2.7<2.8: python27-2.7.151 found => Required robotpkg package jsbsim>=1.0: jsbsim-20150424 found => SHA1 checksums OK => RMD160 checksums OK An unexpected error occured. The last 10 log lines are shown below. | Could NOT find Cython (missing: CYTHON_EXECUTABLE) | Call Stack (most recent call first): | /usr/share/cmake-3.10/Modules/FindPackageHandleStandardArgs.cmake:378 (_FPHSA_FAILURE_MESSAGE) | CMakeModules/FindCython.cmake:42 (FIND_PACKAGE_HANDLE_STANDARD_ARGS) | CMakeModules/UseCython.cmake:74 (find_package) | CMakeLists.txt:6 (include) | | | -- Configuring incomplete, errors occurred! | See also "/local/robotpkg/var/tmp/robotpkg/wip/py-jsbsim/work/jsbsim-20150424/tests/CMakeFiles/CMakeOutput.log". For details or bug reports, check the complete log file in: /local/robotpkg/var/tmp/robotpkg/wip/py-jsbsim/work/configure.log make[3]: *** [do-configure-cmake] Error 1 make[2]: *** [pkg-check-installed] Error 2 => Marking py27-jsbsim-20150424r1 as broken ERROR: make: *** [package] Error 2 ===> Logging bulk summary for py27-jsbsim-20150424r1 => Checking leftover files => Creating bulk log files => Logging bulk metadata ===> Cleaning temporary files for py27-jsbsim-20150424r1 ===> Done bulk for py27-jsbsim-20150424r1 [63%] Processing wip/py-jsbsim:py32-jsbsim-20150424r1 ===> Bulk building for py32-jsbsim-20150424r1 Binary package for py32-jsbsim-20150424r1 is up-to-date. [64%] Processing wip/py-jsbsim:py34-jsbsim-20150424r1 ===> Bulk building for py34-jsbsim-20150424r1 Binary package for py34-jsbsim-20150424r1 is up-to-date. [64%] Processing wip/py-jsbsim:py35-jsbsim-20150424r1 ===> Bulk building for py35-jsbsim-20150424r1 Binary package for py35-jsbsim-20150424r1 is up-to-date. [64%] Processing wip/py-jsbsim:py36-jsbsim-20150424r1 ===> Cleaning temporary files for py36-jsbsim-20150424r1 ===> Bulk building for py36-jsbsim-20150424r1 => Checking for clear installation => Installing /opt/robotpkg/var/lib/robotpkg/packages/bsd/Ubuntu-18.04-x86_64/All/digest-20080510.tgz => Installing /opt/robotpkg/var/lib/robotpkg/packages/bsd/Ubuntu-18.04-x86_64/All/tnftp-20130505~ssl.tgz => Required robotpkg package digest>=20080510: digest-20080510 found => Required robotpkg package tnftp>=20091122: tnftp-20130505~ssl found => Required system package cvs>=1: cvs-1.12.1325 found => Required system package gnupg>=1: gnupg-2.2.4 found => Required system package gzip: gzip-1.6 found => Required system package pax and tar archivers: pax found => Required system package pkg_install>=20110805.9: pkg_install-20110805.9 found => Required system package pkgrepo2deb>=1.3: pkgrepo2deb-1.3 found => Dependency digest-20080510 already installed => Installing /opt/robotpkg/var/lib/robotpkg/wip/packages/bsd/Ubuntu-18.04-x86_64/All/jsbsim-20150424.tgz => Dependency tnftp-20130505~ssl already installed => Building with no option. => Use the GNU C++ compiler: c++-compiler provided by g++>=3 => Use the GNU C compiler: c-compiler provided by gcc>=3 => Use python-3.6: python>=2.5<3.7 provided by python36>=3.6<3.7 => Required system package cmake>=2.6: cmake-3.10.2 found => Required system package g++>=3: g++-7 found => Required system package gcc>=3: gcc-7 found => Required system package libstdc++: libstdc++ found => Required system package python36>=3.6<3.7: python36-3.6.5 found => Required robotpkg package jsbsim>=1.0: jsbsim-20150424 found => SHA1 checksums OK => RMD160 checksums OK An unexpected error occured. The last 10 log lines are shown below. | Could NOT find Cython (missing: CYTHON_EXECUTABLE) | Call Stack (most recent call first): | /usr/share/cmake-3.10/Modules/FindPackageHandleStandardArgs.cmake:378 (_FPHSA_FAILURE_MESSAGE) | CMakeModules/FindCython.cmake:42 (FIND_PACKAGE_HANDLE_STANDARD_ARGS) | CMakeModules/UseCython.cmake:74 (find_package) | CMakeLists.txt:6 (include) | | | -- Configuring incomplete, errors occurred! | See also "/local/robotpkg/var/tmp/robotpkg/wip/py-jsbsim/work/jsbsim-20150424/tests/CMakeFiles/CMakeOutput.log". For details or bug reports, check the complete log file in: /local/robotpkg/var/tmp/robotpkg/wip/py-jsbsim/work/configure.log make[3]: *** [do-configure-cmake] Error 1 make[2]: *** [pkg-check-installed] Error 2 => Marking py36-jsbsim-20150424r1 as broken ERROR: make: *** [package] Error 2 ===> Logging bulk summary for py36-jsbsim-20150424r1 => Checking leftover files => Creating bulk log files => Logging bulk metadata ===> Cleaning temporary files for py36-jsbsim-20150424r1 ===> Done bulk for py36-jsbsim-20150424r1 [65%] Processing wip/msgconnector:msgconnector-2.13.0 ===> Bulk building for msgconnector-2.13.0~bridge-print+liboro+openprs+yarp Binary package for msgconnector-2.13.0~bridge-print+liboro+openprs+yarp is up-to-date. [65%] Processing wip/dynamic-introspection:dynamic-introspection-1.0.5 ===> Cleaning temporary files for dynamic-introspection-1.0.5 ===> Bulk building for dynamic-introspection-1.0.5 => Checking for clear installation => Installing /opt/robotpkg/var/lib/robotpkg/packages/bsd/Ubuntu-18.04-x86_64/All/digest-20080510.tgz => Installing /opt/robotpkg/var/lib/robotpkg/packages/bsd/Ubuntu-18.04-x86_64/All/tnftp-20130505~ssl.tgz => Required robotpkg package digest>=20080510: digest-20080510 found => Required robotpkg package tnftp>=20130505~ssl: tnftp-20130505~ssl found => Required system package gnupg>=1: gnupg-2.2.4 found => Required system package gzip: gzip-1.6 found => Required system package patch>=2.0: patch-2.7.6 found => Required system package pax and tar archivers: pax found => Required system package pkg_install>=20110805.9: pkg_install-20110805.9 found => Required system package pkgrepo2deb>=1.3: pkgrepo2deb-1.3 found ERROR: Required robotpkg package backward-ros>=0.1.4: BROKEN => Dependency digest-20080510 already installed => Dependency tnftp-20130505~ssl already installed ===> Logging bulk summary for dynamic-introspection-1.0.5 => Checking leftover files => Creating bulk log files => Logging bulk metadata ===> Cleaning temporary files for dynamic-introspection-1.0.5 ===> Done bulk for dynamic-introspection-1.0.5 [66%] Processing wip/gladys:gladys-0.2.8 ===> Bulk building for gladys-0.2.8~python Binary package for gladys-0.2.8~python is up-to-date. [66%] Processing wip/lua-rfsm:lua-rfsm-20131212.44fcec2db5r2 ===> Bulk building for lua-rfsm-20131212.44fcec2db5r2 Binary package for lua-rfsm-20131212.44fcec2db5r2 is up-to-date. [66%] Processing wip/roralink:roralink-0.1 ===> Bulk building for roralink-0.1 Binary package for roralink-0.1 is up-to-date. [67%] Processing wip/morse-mavlink:morse-mavlink-1.4 ===> Cleaning temporary files for morse-mavlink-1.4 ===> Bulk building for morse-mavlink-1.4 => Checking for clear installation => Installing /opt/robotpkg/var/lib/robotpkg/packages/bsd/Ubuntu-18.04-x86_64/All/digest-20080510.tgz => Installing /opt/robotpkg/var/lib/robotpkg/packages/bsd/Ubuntu-18.04-x86_64/All/tnftp-20130505~ssl.tgz => Required robotpkg package digest>=20080510: digest-20080510 found => Required robotpkg package tnftp>=20091122: tnftp-20130505~ssl found => Required system package gnupg>=1: gnupg-2.2.4 found => Required system package gzip: gzip-1.6 found => Required system package patch>=2.0: patch-2.7.6 found => Required system package pax and tar archivers: pax found => Required system package pkg_install>=20110805.9: pkg_install-20110805.9 found => Required system package pkgrepo2deb>=1.3: pkgrepo2deb-1.3 found => Dependency digest-20080510 already installed => Installing /opt/robotpkg/var/lib/robotpkg/wip/packages/bsd/Ubuntu-18.04-x86_64/All/mavlink-20150929.tgz => Installing /opt/robotpkg/var/lib/robotpkg/packages/bsd/Ubuntu-18.04-x86_64/All/morse-1.4~doc.tgz => Required robotpkg package py36-mavlink>=1.1.62: NOT found ERROR: Required robotpkg package py36-mavlink>=1.1.62: NOT found => Dependency tnftp-20130505~ssl already installed ===> Logging bulk summary for morse-mavlink-1.4 => Checking leftover files => Creating bulk log files => Logging bulk metadata ===> Cleaning temporary files for morse-mavlink-1.4 ===> Done bulk for morse-mavlink-1.4 [67%] Processing wip/antlr2:antlr2-2.7.7 ===> Bulk building for antlr2-2.7.7 Binary package for antlr2-2.7.7 is up-to-date. [68%] Processing wip/pal-msgs:pal-msgs-0.11.3 ===> Cleaning temporary files for pal-msgs-0.11.3 ===> Bulk building for pal-msgs-0.11.3 => Checking for clear installation => Installing /opt/robotpkg/var/lib/robotpkg/packages/bsd/Ubuntu-18.04-x86_64/All/digest-20080510.tgz => Installing /opt/robotpkg/var/lib/robotpkg/packages/bsd/Ubuntu-18.04-x86_64/All/tnftp-20130505~ssl.tgz => Required robotpkg package digest>=20080510: digest-20080510 found => Required robotpkg package tnftp>=20091122: tnftp-20130505~ssl found => Required system package gnupg>=1: gnupg-2.2.4 found => Required system package gzip: gzip-1.6 found => Required system package pax and tar archivers: pax found => Required system package pkg_install>=20110805.9: pkg_install-20110805.9 found => Required system package pkgrepo2deb>=1.3: pkgrepo2deb-1.3 found => Dependency digest-20080510 already installed WARNING: Cannot check installed version of py-rospkg => Required system package ros-pluginlib>=1.12<1.13: MISSING => Dependency tnftp-20130505~ssl already installed ERROR: ====================================================================== ERROR: Missing system packages required for pal-msgs-0.11.3: ERROR: ERROR: ros-pluginlib>=1.12<1.13 (Ubuntu package ros-melodic-pluginlib) ERROR: ERROR: Please use the system package management tool to install these ERROR: dependencies. If a robotpkg version of a dependency is available, ERROR: you can configure robotpkg.conf to use this version instead. ERROR: ERROR: See /local/robotpkg/var/tmp/robotpkg/wip/pal-msgs/work/sysdep.log for details. ERROR: ====================================================================== make[2]: *** [sys-depends] Error 2 ===> Logging bulk summary for pal-msgs-0.11.3 => Checking leftover files => Creating bulk log files => Logging bulk metadata ===> Cleaning temporary files for pal-msgs-0.11.3 ===> Done bulk for pal-msgs-0.11.3 [68%] Processing wip/parametric-curves:parametric-curves-1.1.1 ===> Bulk building for parametric-curves-1.1.1 Binary package for parametric-curves-1.1.1 is up-to-date. [69%] Processing wip/libfreenect:libfreenect-20110118.2ea3ebr1 ===> Cleaning temporary files for libfreenect-20110118.2ea3ebr1 ===> Bulk building for libfreenect-20110118.2ea3ebr1 => Checking for clear installation => Installing /opt/robotpkg/var/lib/robotpkg/packages/bsd/Ubuntu-18.04-x86_64/All/digest-20080510.tgz => Installing /opt/robotpkg/var/lib/robotpkg/packages/bsd/Ubuntu-18.04-x86_64/All/tnftp-20130505~ssl.tgz => Required robotpkg package digest>=20080510: digest-20080510 found => Required robotpkg package tnftp>=20091122: tnftp-20130505~ssl found => Required system package git>=1.6: git-2.17.1 found => Required system package gnupg>=1: gnupg-2.2.4 found => Required system package gzip: gzip-1.6 found => Required system package patch>=2.0: patch-2.7.6 found => Required system package pax and tar archivers: pax found => Required system package pkg_install>=20110805.9: pkg_install-20110805.9 found => Required system package pkgrepo2deb>=1.3: pkgrepo2deb-1.3 found => Dependency digest-20080510 already installed => Dependency tnftp-20130505~ssl already installed => Building with no option. => Use the GNU C++ compiler: c++-compiler provided by g++>=3 => Use the GNU C compiler: c-compiler provided by gcc>=3 => Required system package cmake>=2.6: cmake-3.10.2 found => Required system package g++>=3: g++-7 found => Required system package gcc>=3: gcc-7 found => Required system package A BSD-compatible install program: install-sh found => Required system package libXmu>=1: libXmu-1.1.2 found => Required system package libstdc++: libstdc++ found => SHA1 checksums OK => RMD160 checksums OK => Applying robotpkg patches for libfreenect-20110118.2ea3ebr1 An unexpected error occured. The last 10 log lines are shown below. | m_devices.insert(std::make_pair(_index, device)); | ~~~~~~~~~~~~~~~~~~~~~~~~~~~~~~~~~~~~^~~~~~~~~~~~~~~~ | wrappers/cpp/CMakeFiles/cppview.dir/build.make:65: recipe for target 'wrappers/cpp/CMakeFiles/cppview.dir/cppview.cpp.o' failed | make[2]: *** [wrappers/cpp/CMakeFiles/cppview.dir/cppview.cpp.o] Error 1 | make[1]: *** [wrappers/cpp/CMakeFiles/cppview.dir/all] Error 2 | make[2]: Leaving directory '/local/robotpkg/var/tmp/robotpkg/wip/libfreenect/work/libfreenect-20110118.2ea3eb' | CMakeFiles/Makefile2:537: recipe for target 'wrappers/cpp/CMakeFiles/cppview.dir/all' failed | make[1]: Leaving directory '/local/robotpkg/var/tmp/robotpkg/wip/libfreenect/work/libfreenect-20110118.2ea3eb' | make: *** [all] Error 2 | Makefile:132: recipe for target 'all' failed For details or bug reports, check the complete log file in: /local/robotpkg/var/tmp/robotpkg/wip/libfreenect/work/build.log make[3]: *** [do-build] Error 2 make[2]: *** [pkg-check-installed] Error 2 => Marking libfreenect-20110118.2ea3ebr1 as broken ERROR: make: *** [package] Error 2 ===> Logging bulk summary for libfreenect-20110118.2ea3ebr1 => Checking leftover files => Creating bulk log files => Logging bulk metadata ===> Cleaning temporary files for libfreenect-20110118.2ea3ebr1 ===> Done bulk for libfreenect-20110118.2ea3ebr1 [69%] Processing wip/example-adder:example-adder-1.0.0 ===> Bulk building for example-adder-1.0.0 Binary package for example-adder-1.0.0 is up-to-date. [69%] Processing wip/robotModelParser-libs:robotModelParser-libs-1.0 ===> Bulk building for robotModelParser-libs-1.0 Binary package for robotModelParser-libs-1.0 is up-to-date. [70%] Processing wip/talos-moveit-config:talos-moveit-config-0.2.6r1 ===> Cleaning temporary files for talos-moveit-config-0.2.6r1 ===> Bulk building for talos-moveit-config-0.2.6r1 => Checking for clear installation => Installing /opt/robotpkg/var/lib/robotpkg/packages/bsd/Ubuntu-18.04-x86_64/All/digest-20080510.tgz => Installing /opt/robotpkg/var/lib/robotpkg/packages/bsd/Ubuntu-18.04-x86_64/All/tnftp-20130505~ssl.tgz => Required robotpkg package digest>=20080510: digest-20080510 found => Required robotpkg package tnftp>=20130505~ssl: tnftp-20130505~ssl found => Required system package gnupg>=1: gnupg-2.2.4 found => Required system package gzip: gzip-1.6 found => Required system package pax and tar archivers: pax found => Required system package pkg_install>=20110805.9: pkg_install-20110805.9 found => Required system package pkgrepo2deb>=1.3: pkgrepo2deb-1.3 found => Dependency digest-20080510 already installed => Required system package ros-actionlib>=1.11<1.12: MISSING => Required system package ros-catkin>=0.6<0.7: MISSING => Required system package ros-comm>=1.11<1.12: MISSING => Required system package ros-common-msgs>=1.11<1.12: MISSING => Required system package ros-control-toolbox>=1.13<1.15: MISSING => Required system package ros-genmsg>=0.5<0.6: MISSING => Required system package ros-geometry>=1.11<1.12: MISSING => Required system package ros-message-generation>=0.2<0.3: MISSING => Required system package ros-message-runtime>=0.4<0.5 : MISSING => Required system package ros-pluginlib>=1.10<1.11: MISSING => Required system package ros-robot-model>=1.11<1.12: MISSING => Required system package ros-ros>=1.11<1.12: MISSING => Required system package ros-std-msgs>=0.5 : MISSING => Dependency tnftp-20130505~ssl already installed ERROR: ====================================================================== ERROR: Missing system packages required for talos-moveit-config-0.2.6r1: ERROR: ERROR: ros-actionlib>=1.11<1.12 (Ubuntu package ros-indigo-actionlib) ERROR: ros-catkin>=0.6<0.7 (Ubuntu package ros-indigo-catkin) ERROR: ros-comm>=1.11<1.12 (Ubuntu package ros-indigo-comm) ERROR: ros-common-msgs>=1.11<1.12 (Ubuntu package ros-indigo-common-msgs) ERROR: ros-control-toolbox>=1.13<1.15 (Ubuntu package ros-indigo-control-toolbox) ERROR: ros-genmsg>=0.5<0.6 (Ubuntu package ros-indigo-genmsg) ERROR: ros-geometry>=1.11<1.12 (Ubuntu package ros-indigo-geometry) ERROR: ros-message-generation>=0.2<0.3 (Ubuntu package ros-indigo-message-generation) ERROR: ros-message-runtime>=0.4<0.5 (Ubuntu package ros-indigo-message-runtime) ERROR: ros-pluginlib>=1.10<1.11 (Ubuntu package ros-indigo-pluginlib) ERROR: ros-robot-model>=1.11<1.12 (Ubuntu package ros-indigo-robot-model) ERROR: ros-ros>=1.11<1.12 (Ubuntu package ros-indigo-ros) ERROR: ros-std-msgs>=0.5 (Ubuntu package ros-indigo-std-msgs) ERROR: ERROR: Please use the system package management tool to install these ERROR: dependencies. If a robotpkg version of a dependency is available, ERROR: you can configure robotpkg.conf to use this version instead. ERROR: ERROR: See /local/robotpkg/var/tmp/robotpkg/wip/talos-moveit-config/work/sysdep.log for details. ERROR: ====================================================================== make[2]: *** [sys-depends] Error 2 ===> Logging bulk summary for talos-moveit-config-0.2.6r1 => Checking leftover files => Creating bulk log files => Logging bulk metadata ===> Cleaning temporary files for talos-moveit-config-0.2.6r1 ===> Done bulk for talos-moveit-config-0.2.6r1 [70%] Processing wip/atlaas:atlaas-0.1.6 ===> Bulk building for atlaas-0.1.6 Binary package for atlaas-0.1.6 is up-to-date. [71%] Processing wip/ur5-description:ur5-description-1.0.1 Warning: the LICENSE of wip/ur5-description is undefined. Warning: the LICENSE of wip/ur5-description is undefined. ===> Cleaning temporary files for ur5-description-1.0.1 ===> Bulk building for ur5-description-1.0.1 => Checking for clear installation Warning: the LICENSE of wip/ur5-description is undefined. => Installing /opt/robotpkg/var/lib/robotpkg/packages/bsd/Ubuntu-18.04-x86_64/All/digest-20080510.tgz => Installing /opt/robotpkg/var/lib/robotpkg/packages/bsd/Ubuntu-18.04-x86_64/All/tnftp-20130505~ssl.tgz Warning: the LICENSE of wip/ur5-description is undefined. => Required robotpkg package digest>=20080510: digest-20080510 found => Required robotpkg package tnftp>=20130505~ssl: tnftp-20130505~ssl found => Required system package gnupg>=1: gnupg-2.2.4 found => Required system package gzip: gzip-1.6 found => Required system package pax and tar archivers: pax found => Required system package pkg_install>=20110805.9: pkg_install-20110805.9 found => Required system package pkgrepo2deb>=1.3: pkgrepo2deb-1.3 found Warning: the LICENSE of wip/ur5-description is undefined. Warning: the LICENSE of wip/ur5-description is undefined. => Dependency digest-20080510 already installed => Dependency tnftp-20130505~ssl already installed Warning: the LICENSE of wip/ur5-description is undefined. => Building with no option. => Use the GNU C++ compiler: c++-compiler provided by g++>=3 => Use the GNU C compiler: c-compiler provided by gcc>=3 => Required system package cmake>=2.6: cmake-3.10.2 found => Required system package g++>=3: g++-7 found => Required system package gcc>=3: gcc-7 found => Required system package libstdc++: libstdc++ found => Required system package pkg-config>=0.22: pkg-config-0.29.1 found Warning: the LICENSE of wip/ur5-description is undefined. Warning: the LICENSE of wip/ur5-description is undefined. Warning: the LICENSE of wip/ur5-description is undefined. => SHA1 checksums OK => RMD160 checksums OK Warning: the LICENSE of wip/ur5-description is undefined. => Adding run-time search paths to pkg-config files robotpkg_create: can't stat `/opt/openrobots/share/doc/ur5_description/doxygen-html/arrowdown.png' robotpkg_create: can't stat `/opt/openrobots/share/doc/ur5_description/doxygen-html/arrowright.png' => Registering installation for ur5-description-1.0.1 robotpkg_admin: ur5-description-1.0.1: File `/opt/openrobots/share/doc/ur5_description/doxygen-html/arrowdown.png' is in +CONTENTS but not on filesystem! robotpkg_admin: ur5-description-1.0.1: File `/opt/openrobots/share/doc/ur5_description/doxygen-html/arrowright.png' is in +CONTENTS but not on filesystem! Warning: the LICENSE of wip/ur5-description is undefined. robotpkg_create: can't stat `/opt/openrobots/share/doc/ur5_description/doxygen-html/arrowdown.png' robotpkg_create: can't stat `/opt/openrobots/share/doc/ur5_description/doxygen-html/arrowright.png' robotpkg_create: lstat failed for file share/doc/ur5_description/doxygen-html/arrowdown.png: No such file or directory make[3]: *** [pkg-tarup] Error 2 Warning: the LICENSE of wip/ur5-description is undefined. => Unlinking package in /opt/robotpkg/var/lib/robotpkg/wip/packages/bsd/Ubuntu-18.04-x86_64/All => Unlinking package in /opt/robotpkg/var/lib/robotpkg/wip/packages/bsd/Ubuntu-18.04-x86_64/pub => Unlinking package in /opt/robotpkg/var/lib/robotpkg/wip/packages/bsd/Ubuntu-18.04-x86_64/jrl => Updating debian binary packages Warning: the LICENSE of wip/ur5-description is undefined. robotpkg_delete: Couldn't remove /opt/openrobots/share/doc/ur5_description/doxygen-html/arrowdown.png robotpkg_delete: Couldn't remove /opt/openrobots/share/doc/ur5_description/doxygen-html/arrowright.png ===> Logging bulk summary for ur5-description-1.0.1 => Checking leftover files WARNING: 2 files leftover. => Creating bulk log files => Logging bulk metadata Warning: the LICENSE of wip/ur5-description is undefined. Warning: the LICENSE of wip/ur5-description is undefined. Warning: the LICENSE of wip/ur5-description is undefined. ===> Cleaning temporary files for ur5-description-1.0.1 ===> Done bulk for ur5-description-1.0.1 [71%] Processing wip/orocos-yarp_transport:orocos-yarp_transport-20150316 ===> Cleaning temporary files for orocos-yarp_transport-20150316~doc ===> Bulk building for orocos-yarp_transport-20150316~doc => Checking for clear installation => Installing /opt/robotpkg/var/lib/robotpkg/packages/bsd/Ubuntu-18.04-x86_64/All/digest-20080510.tgz => Installing /opt/robotpkg/var/lib/robotpkg/packages/bsd/Ubuntu-18.04-x86_64/All/tnftp-20130505~ssl.tgz => Required robotpkg package digest>=20080510: digest-20080510 found => Required robotpkg package tnftp>=20091122: tnftp-20130505~ssl found => Required system package git>=1.6: git-2.17.1 found => Required system package gnupg>=1: gnupg-2.2.4 found => Required system package gzip: gzip-1.6 found => Required system package pax and tar archivers: pax found => Required system package pkg_install>=20110805.9: pkg_install-20110805.9 found => Required system package pkgrepo2deb>=1.3: pkgrepo2deb-1.3 found => Dependency digest-20080510 already installed WARNING: Cannot check installed version of docbook => Installing /opt/robotpkg/var/lib/robotpkg/packages/bsd/Ubuntu-18.04-x86_64/All/orocos-rtt-2.9.0rc1.tgz => Dependency tnftp-20130505~ssl already installed => Installing /opt/robotpkg/var/lib/robotpkg/packages/bsd/Ubuntu-18.04-x86_64/All/yarp-2.3.64r3~gui.tgz => Building with the following options: => Use the GNU C++ compiler: c++-compiler provided by g++>=3 => Use the GNU C compiler: c-compiler provided by gcc>=3 => Required system package ace>=5.6: ace-6.4.5 found => Required system package cmake>=2.6: cmake-3.10.2 found => Required system package docbook>=0.6: docbook found => Required system package g++>=3: g++-7 found => Required system package gcc>=3: gcc-7 found => Required system package libstdc++: libstdc++ found WARNING: Cannot check installed version of docbook => Required robotpkg package orocos-rtt>=2.5: orocos-rtt-2.9.0rc1 found => Required robotpkg package yarp>=2.2: yarp-2.3.64r3~gui found => SHA1 checksums OK => RMD160 checksums OK An unexpected error occured. The last 10 log lines are shown below. | make[2]: Leaving directory '/local/robotpkg/var/tmp/robotpkg/wip/orocos-yarp_transport/work/orocos-yarp_transport-20150316' | CMakeFiles/Makefile2:107: recipe for target 'CMakeFiles/yarp-transport.dir/all' failed | [ 75%] Linking CXX shared library orocos/gnulinux/yarp/plugins/libyarp-service-gnulinux.so | /usr/bin/cmake -E cmake_link_script CMakeFiles/yarp-service.dir/link.txt --verbose=1 | /usr/bin/g++ -fPIC -pipe -O3 -DNDEBUG -Wl,-z,defs -shared -Wl,-soname,libyarp-service-gnulinux.so -o orocos/gnulinux/yarp/plugins/libyarp-service-gnulinux.so CMakeFiles/yarp-service.dir/service/Yarp-service.cpp.o -Wl,-rpath,/opt/openrobots/lib::::::::::::::::::::::::::::::::::::::::::::::::::::::::::::::::::::::::::::::::::::::::::::::::::::::::::::::::::::::::::::::::::::::::::::::::::::::::::::::::::::::::::::::::::::::::::::::::::::::::::::::::::::::::::::::::::::::::::::::::::::::::::::::::::: /opt/openrobots/lib/liborocos-rtt-gnulinux.so.2.9.0 -lboost_filesystem -lboost_system -lboost_serialization -lxerces-c -lpthread -lrt -ldl | make[2]: Leaving directory '/local/robotpkg/var/tmp/robotpkg/wip/orocos-yarp_transport/work/orocos-yarp_transport-20150316' | [ 75%] Built target yarp-service | make[1]: Leaving directory '/local/robotpkg/var/tmp/robotpkg/wip/orocos-yarp_transport/work/orocos-yarp_transport-20150316' | make: *** [all] Error 2 | Makefile:132: recipe for target 'all' failed For details or bug reports, check the complete log file in: /local/robotpkg/var/tmp/robotpkg/wip/orocos-yarp_transport/work/build.log make[3]: *** [do-build] Error 2 make[2]: *** [pkg-check-installed] Error 2 => Marking orocos-yarp_transport-20150316~doc as broken ERROR: make: *** [package] Error 2 ===> Logging bulk summary for orocos-yarp_transport-20150316~doc => Checking leftover files => Creating bulk log files => Logging bulk metadata ===> Cleaning temporary files for orocos-yarp_transport-20150316~doc ===> Done bulk for orocos-yarp_transport-20150316~doc [71%] Processing wip/infuse-asn1-conversions:infuse-asn1-conversions-0.2 ===> Cleaning temporary files for infuse-asn1-conversions-0.2 ===> Bulk building for infuse-asn1-conversions-0.2 => Checking for clear installation => Installing /opt/robotpkg/var/lib/robotpkg/packages/bsd/Ubuntu-18.04-x86_64/All/digest-20080510.tgz => Installing /opt/robotpkg/var/lib/robotpkg/packages/bsd/Ubuntu-18.04-x86_64/All/tnftp-20130505~ssl.tgz => Required robotpkg package digest>=20080510: digest-20080510 found => Required robotpkg package tnftp>=20091122: tnftp-20130505~ssl found => Required system package gnupg>=1: gnupg-2.2.4 found => Required system package gzip: gzip-1.6 found => Required system package pax and tar archivers: pax found => Required system package pkg_install>=20110805.9: pkg_install-20110805.9 found => Required system package pkgrepo2deb>=1.3: pkgrepo2deb-1.3 found => Dependency digest-20080510 already installed => Required robotpkg package infuse-asn1-types>=0.2: N/A => Dependency tnftp-20130505~ssl already installed ===> Logging bulk summary for infuse-asn1-conversions-0.2 => Checking leftover files => Creating bulk log files => Logging bulk metadata ===> Cleaning temporary files for infuse-asn1-conversions-0.2 ===> Done bulk for infuse-asn1-conversions-0.2 [72%] Processing wip/infuse-msgs-ros:infuse-msgs-ros-0.1.0 ===> Bulk building for infuse-msgs-ros-0.1.0 Binary package for infuse-msgs-ros-0.1.0 is up-to-date. [72%] Processing wip/talos-robot:talos-robot-1.0.2 ===> Cleaning temporary files for talos-robot-1.0.2 ===> Bulk building for talos-robot-1.0.2 => Checking for clear installation => Installing /opt/robotpkg/var/lib/robotpkg/packages/bsd/Ubuntu-18.04-x86_64/All/digest-20080510.tgz => Installing /opt/robotpkg/var/lib/robotpkg/packages/bsd/Ubuntu-18.04-x86_64/All/tnftp-20130505~ssl.tgz => Required robotpkg package digest>=20080510: digest-20080510 found => Required robotpkg package tnftp>=20130505~ssl: tnftp-20130505~ssl found => Required system package gnupg>=1: gnupg-2.2.4 found => Required system package gzip: gzip-1.6 found => Required system package pax and tar archivers: pax found => Required system package pkg_install>=20110805.9: pkg_install-20110805.9 found => Required system package pkgrepo2deb>=1.3: pkgrepo2deb-1.3 found => Dependency digest-20080510 already installed => Installing /opt/robotpkg/var/lib/robotpkg/wip/packages/bsd/Ubuntu-18.04-x86_64/All/head-action-0.0.1r1.tgz => Required system package ros-actionlib>=1.11<1.12: MISSING => Required system package ros-catkin>=0.6<0.7: MISSING => Required system package ros-comm>=1.11<1.12: MISSING => Required system package ros-common-msgs>=1.11<1.12: MISSING => Required system package ros-control-toolbox>=1.13<1.15: MISSING => Required system package ros-genmsg>=0.5<0.6: MISSING => Required system package ros-geometry>=1.11<1.12: MISSING => Required system package ros-message-generation>=0.2<0.3: MISSING => Required system package ros-message-runtime>=0.4<0.5 : MISSING => Required system package ros-pluginlib>=1.10<1.11: MISSING => Required system package ros-robot-model>=1.11<1.12: MISSING => Required system package ros-ros>=1.11<1.12: MISSING => Required system package ros-std-msgs>=0.5 : MISSING => Installing /opt/robotpkg/var/lib/robotpkg/wip/packages/bsd/Ubuntu-18.04-x86_64/All/tf-lookup-0.0.1r1.tgz => Dependency tnftp-20130505~ssl already installed ERROR: ====================================================================== ERROR: Missing system packages required for talos-robot-1.0.2: ERROR: ERROR: ros-actionlib>=1.11<1.12 (Ubuntu package ros-indigo-actionlib) ERROR: ros-catkin>=0.6<0.7 (Ubuntu package ros-indigo-catkin) ERROR: ros-comm>=1.11<1.12 (Ubuntu package ros-indigo-comm) ERROR: ros-common-msgs>=1.11<1.12 (Ubuntu package ros-indigo-common-msgs) ERROR: ros-control-toolbox>=1.13<1.15 (Ubuntu package ros-indigo-control-toolbox) ERROR: ros-genmsg>=0.5<0.6 (Ubuntu package ros-indigo-genmsg) ERROR: ros-geometry>=1.11<1.12 (Ubuntu package ros-indigo-geometry) ERROR: ros-message-generation>=0.2<0.3 (Ubuntu package ros-indigo-message-generation) ERROR: ros-message-runtime>=0.4<0.5 (Ubuntu package ros-indigo-message-runtime) ERROR: ros-pluginlib>=1.10<1.11 (Ubuntu package ros-indigo-pluginlib) ERROR: ros-robot-model>=1.11<1.12 (Ubuntu package ros-indigo-robot-model) ERROR: ros-ros>=1.11<1.12 (Ubuntu package ros-indigo-ros) ERROR: ros-std-msgs>=0.5 (Ubuntu package ros-indigo-std-msgs) ERROR: ERROR: Please use the system package management tool to install these ERROR: dependencies. If a robotpkg version of a dependency is available, ERROR: you can configure robotpkg.conf to use this version instead. ERROR: ERROR: See /local/robotpkg/var/tmp/robotpkg/wip/talos-robot/work/sysdep.log for details. ERROR: ====================================================================== make[2]: *** [sys-depends] Error 2 ===> Logging bulk summary for talos-robot-1.0.2 => Checking leftover files => Creating bulk log files => Logging bulk metadata ===> Cleaning temporary files for talos-robot-1.0.2 ===> Done bulk for talos-robot-1.0.2 [73%] Processing wip/tiago-robot:tiago-robot-0.0.35os1 ===> Cleaning temporary files for tiago-robot-0.0.35os1 ===> Bulk building for tiago-robot-0.0.35os1 => Checking for clear installation => Installing /opt/robotpkg/var/lib/robotpkg/packages/bsd/Ubuntu-18.04-x86_64/All/digest-20080510.tgz => Installing /opt/robotpkg/var/lib/robotpkg/packages/bsd/Ubuntu-18.04-x86_64/All/tnftp-20130505~ssl.tgz => Required robotpkg package digest>=20080510: digest-20080510 found => Required robotpkg package tnftp>=20130505~ssl: tnftp-20130505~ssl found => Required system package gnupg>=1: gnupg-2.2.4 found => Required system package gzip: gzip-1.6 found => Required system package pax and tar archivers: pax found => Required system package pkg_install>=20110805.9: pkg_install-20110805.9 found => Required system package pkgrepo2deb>=1.3: pkgrepo2deb-1.3 found => Dependency digest-20080510 already installed => Installing /opt/robotpkg/var/lib/robotpkg/wip/packages/bsd/Ubuntu-18.04-x86_64/All/head-action-0.0.1r1.tgz => Required robotpkg package pal-gripper>=0.0.13: NOT found ERROR: Required robotpkg package pal-gripper>=0.0.13: NOT found => Required robotpkg package pmb2-robot>=1.1.8: NOT found ERROR: Required robotpkg package pmb2-robot>=1.1.8: NOT found => Installing /opt/robotpkg/var/lib/robotpkg/wip/packages/bsd/Ubuntu-18.04-x86_64/All/tf-lookup-0.0.1r1.tgz => Dependency tnftp-20130505~ssl already installed ===> Logging bulk summary for tiago-robot-0.0.35os1 => Checking leftover files => Creating bulk log files => Logging bulk metadata ===> Cleaning temporary files for tiago-robot-0.0.35os1 ===> Done bulk for tiago-robot-0.0.35os1 [73%] Processing wip/pal-gazebo-worlds:pal-gazebo-worlds-2.0.8r2 ===> Cleaning temporary files for pal-gazebo-worlds-2.0.8r2 ===> Bulk building for pal-gazebo-worlds-2.0.8r2 => Checking for clear installation => Installing /opt/robotpkg/var/lib/robotpkg/packages/bsd/Ubuntu-18.04-x86_64/All/digest-20080510.tgz => Installing /opt/robotpkg/var/lib/robotpkg/packages/bsd/Ubuntu-18.04-x86_64/All/tnftp-20130505~ssl.tgz => Required robotpkg package digest>=20080510: digest-20080510 found => Required robotpkg package tnftp>=20130505~ssl: tnftp-20130505~ssl found => Required system package gnupg>=1: gnupg-2.2.4 found => Required system package gzip: gzip-1.6 found => Required system package pax and tar archivers: pax found => Required system package pkg_install>=20110805.9: pkg_install-20110805.9 found => Required system package pkgrepo2deb>=1.3: pkgrepo2deb-1.3 found => Dependency digest-20080510 already installed => Required robotpkg package prf-gazebo-ros-pkgs>=2.6.5: N/A => Dependency tnftp-20130505~ssl already installed ===> Logging bulk summary for pal-gazebo-worlds-2.0.8r2 => Checking leftover files => Creating bulk log files => Logging bulk metadata ===> Cleaning temporary files for pal-gazebo-worlds-2.0.8r2 ===> Done bulk for pal-gazebo-worlds-2.0.8r2 [74%] Processing wip/prf-roboticsgroup-gazebo-plugins:prf-roboticsgroup-gazebo-plugins-0.1.0 ===> Cleaning temporary files for prf-roboticsgroup-gazebo-plugins-0.1.0 ===> Bulk building for prf-roboticsgroup-gazebo-plugins-0.1.0 => Checking for clear installation => Installing /opt/robotpkg/var/lib/robotpkg/packages/bsd/Ubuntu-18.04-x86_64/All/digest-20080510.tgz => Installing /opt/robotpkg/var/lib/robotpkg/packages/bsd/Ubuntu-18.04-x86_64/All/tnftp-20130505~ssl.tgz => Required robotpkg package digest>=20080510: digest-20080510 found => Required robotpkg package tnftp>=20130505~ssl: tnftp-20130505~ssl found => Required system package gnupg>=1: gnupg-2.2.4 found => Required system package gzip: gzip-1.6 found => Required system package pax and tar archivers: pax found => Required system package pkg_install>=20110805.9: pkg_install-20110805.9 found => Required system package pkgrepo2deb>=1.3: pkgrepo2deb-1.3 found => Dependency digest-20080510 already installed => Required robotpkg package pal-hardware-interfaces>=0.0.3: N/A => Required robotpkg package prf-gazebo-ros-pkgs>=2.6.5: N/A => Required system package ros-actionlib>=1.11<1.12: MISSING => Required system package ros-catkin>=0.6<0.7: MISSING => Required system package ros-comm>=1.11<1.12: MISSING => Required system package ros-common-msgs>=1.11<1.12: MISSING => Required system package ros-control-toolbox>=1.13<1.15: MISSING => Required system package ros-genmsg>=0.5<0.6: MISSING => Required system package ros-geometry>=1.11<1.12: MISSING => Required system package ros-message-generation>=0.2<0.3: MISSING => Required system package ros-message-runtime>=0.4<0.5 : MISSING => Required system package ros-pluginlib>=1.10<1.11: MISSING => Required system package ros-robot-model>=1.11<1.12: MISSING => Required system package ros-ros>=1.11<1.12: MISSING => Required system package ros-std-msgs>=0.5 : MISSING => Dependency tnftp-20130505~ssl already installed ERROR: ====================================================================== ERROR: Missing system packages required for prf-roboticsgroup-gazebo-plugins-0.1.0: ERROR: ERROR: ros-actionlib>=1.11<1.12 (Ubuntu package ros-indigo-actionlib) ERROR: ros-catkin>=0.6<0.7 (Ubuntu package ros-indigo-catkin) ERROR: ros-comm>=1.11<1.12 (Ubuntu package ros-indigo-comm) ERROR: ros-common-msgs>=1.11<1.12 (Ubuntu package ros-indigo-common-msgs) ERROR: ros-control-toolbox>=1.13<1.15 (Ubuntu package ros-indigo-control-toolbox) ERROR: ros-genmsg>=0.5<0.6 (Ubuntu package ros-indigo-genmsg) ERROR: ros-geometry>=1.11<1.12 (Ubuntu package ros-indigo-geometry) ERROR: ros-message-generation>=0.2<0.3 (Ubuntu package ros-indigo-message-generation) ERROR: ros-message-runtime>=0.4<0.5 (Ubuntu package ros-indigo-message-runtime) ERROR: ros-pluginlib>=1.10<1.11 (Ubuntu package ros-indigo-pluginlib) ERROR: ros-robot-model>=1.11<1.12 (Ubuntu package ros-indigo-robot-model) ERROR: ros-ros>=1.11<1.12 (Ubuntu package ros-indigo-ros) ERROR: ros-std-msgs>=0.5 (Ubuntu package ros-indigo-std-msgs) ERROR: ERROR: Please use the system package management tool to install these ERROR: dependencies. If a robotpkg version of a dependency is available, ERROR: you can configure robotpkg.conf to use this version instead. ERROR: ERROR: See /local/robotpkg/var/tmp/robotpkg/wip/prf-roboticsgroup-gazebo-plugins/work/sysdep.log for details. ERROR: ====================================================================== make[2]: *** [sys-depends] Error 2 ===> Logging bulk summary for prf-roboticsgroup-gazebo-plugins-0.1.0 => Checking leftover files => Creating bulk log files => Logging bulk metadata ===> Cleaning temporary files for prf-roboticsgroup-gazebo-plugins-0.1.0 ===> Done bulk for prf-roboticsgroup-gazebo-plugins-0.1.0 [74%] Processing wip/dynamic-graph-tutorial:dynamic-graph-tutorial-1.1.1 ===> Bulk building for dynamic-graph-tutorial-1.1.1 Binary package for dynamic-graph-tutorial-1.1.1 is up-to-date. [74%] Processing wip/libnabo:libnabo-1.0.4 ===> Bulk building for libnabo-1.0.4 Binary package for libnabo-1.0.4 is up-to-date. [75%] Processing wip/py-dynamic-graph-v3:py27-dynamic-graph-v3-3.0.2 ===> Bulk building for py27-dynamic-graph-v3-3.0.2 Binary package for py27-dynamic-graph-v3-3.0.2 is up-to-date. [75%] Processing wip/py-dynamic-graph-v3:py36-dynamic-graph-v3>=3.0 ===> Bulk building for py36-dynamic-graph-v3-3.0.2 Binary package for py36-dynamic-graph-v3-3.0.2 is up-to-date. [76%] Processing wip/py-dynamic-graph-v3:py35-dynamic-graph-v3>=3.0 ===> Bulk building for py35-dynamic-graph-v3-3.0.2 Binary package for py35-dynamic-graph-v3-3.0.2 is up-to-date. [76%] Processing wip/py-dynamic-graph-v3:py34-dynamic-graph-v3>=3.0 ===> Bulk building for py34-dynamic-graph-v3-3.0.2 Binary package for py34-dynamic-graph-v3-3.0.2 is up-to-date. [76%] Processing wip/py-dynamic-graph-v3:py32-dynamic-graph-v3>=3.0 ===> Bulk building for py32-dynamic-graph-v3-3.0.2 Binary package for py32-dynamic-graph-v3-3.0.2 is up-to-date. [77%] Processing wip/hatponboard-lib:hatponboard-lib-3.4.0 ===> Bulk building for hatponboard-lib-3.4.0~enable-goal Binary package for hatponboard-lib-3.4.0~enable-goal is up-to-date. [77%] Processing wip/orocos-dot_service:orocos-dot_service-20120308 ===> Cleaning temporary files for orocos-dot_service-20120308 ===> Bulk building for orocos-dot_service-20120308 => Checking for clear installation => Installing /opt/robotpkg/var/lib/robotpkg/packages/bsd/Ubuntu-18.04-x86_64/All/digest-20080510.tgz => Installing /opt/robotpkg/var/lib/robotpkg/packages/bsd/Ubuntu-18.04-x86_64/All/tnftp-20130505~ssl.tgz => Required robotpkg package digest>=20080510: digest-20080510 found => Required robotpkg package tnftp>=20130505~ssl: tnftp-20130505~ssl found => Required system package gnupg>=1: gnupg-2.2.4 found => Required system package gzip: gzip-1.6 found => Required system package pax and tar archivers: pax found => Required system package pkg_install>=20110805.9: pkg_install-20110805.9 found => Required system package pkgrepo2deb>=1.3: pkgrepo2deb-1.3 found => Dependency digest-20080510 already installed => Installing /opt/robotpkg/var/lib/robotpkg/packages/bsd/Ubuntu-18.04-x86_64/All/orocos-rtt-2.9.0rc1.tgz => Dependency tnftp-20130505~ssl already installed => Building with no option. => Use the GNU C++ compiler: c++-compiler provided by g++>=3 => Use the GNU C compiler: c-compiler provided by gcc>=3 => Required system package boost-headers>=1.46.1: boost-headers-1.65.1 found => Required system package boostlib-filesystem>=1.46.1: boost-libs-1.65.1 found => Required system package boostlib-iostreams>=1.46.1: boost-libs-1.65.1 found => Required system package boostlib-math>=1.46.1: boost-libs-1.65.1 found => Required system package boostlib-thread>=1.46.1: boost-libs-1.65.1 found => Required system package cmake>=2.6: cmake-3.10.2 found => Required system package g++>=3: g++-7 found => Required system package gcc>=3: gcc-7 found => Required system package graphviz>=2: graphviz-2.40.1 found => Required system package libstdc++: libstdc++ found => Required robotpkg package orocos-rtt>=2: orocos-rtt-2.9.0rc1 found => SHA1 checksums OK => RMD160 checksums OK An unexpected error occured. The last 10 log lines are shown below. | ^~~~~~~~~~~ | getConnections | make[2]: *** [CMakeFiles/rtt_dot_service.dir/src/rtt_dot_service.cpp.o] Error 1 | CMakeFiles/rtt_dot_service.dir/build.make:65: recipe for target 'CMakeFiles/rtt_dot_service.dir/src/rtt_dot_service.cpp.o' failed | make[1]: *** [CMakeFiles/rtt_dot_service.dir/all] Error 2 | make: *** [all] Error 2 | make[2]: Leaving directory '/local/robotpkg/var/tmp/robotpkg/wip/orocos-dot_service/work/rtt_dot_service-rtt_dot_service' | CMakeFiles/Makefile2:102: recipe for target 'CMakeFiles/rtt_dot_service.dir/all' failed | make[1]: Leaving directory '/local/robotpkg/var/tmp/robotpkg/wip/orocos-dot_service/work/rtt_dot_service-rtt_dot_service' | Makefile:132: recipe for target 'all' failed For details or bug reports, check the complete log file in: /local/robotpkg/var/tmp/robotpkg/wip/orocos-dot_service/work/build.log make[3]: *** [do-build] Error 2 => Marking orocos-dot_service-20120308 as broken make[2]: *** [pkg-check-installed] Error 2 ERROR: make: *** [package] Error 2 ===> Logging bulk summary for orocos-dot_service-20120308 => Checking leftover files => Creating bulk log files => Logging bulk metadata ===> Cleaning temporary files for orocos-dot_service-20120308 ===> Done bulk for orocos-dot_service-20120308 [78%] Processing wip/pal-gazebo-plugins:pal-gazebo-plugins-1.1.7 ===> Cleaning temporary files for pal-gazebo-plugins-1.1.7 ===> Bulk building for pal-gazebo-plugins-1.1.7 => Checking for clear installation => Installing /opt/robotpkg/var/lib/robotpkg/packages/bsd/Ubuntu-18.04-x86_64/All/digest-20080510.tgz => Installing /opt/robotpkg/var/lib/robotpkg/packages/bsd/Ubuntu-18.04-x86_64/All/tnftp-20130505~ssl.tgz => Required robotpkg package digest>=20080510: digest-20080510 found => Required robotpkg package tnftp>=20130505~ssl: tnftp-20130505~ssl found => Required system package gnupg>=1: gnupg-2.2.4 found => Required system package gzip: gzip-1.6 found => Required system package pax and tar archivers: pax found => Required system package pkg_install>=20110805.9: pkg_install-20110805.9 found => Required system package pkgrepo2deb>=1.3: pkgrepo2deb-1.3 found => Dependency digest-20080510 already installed => Required robotpkg package pal-msgs>=0.11.3: N/A => Required system package ros-actionlib>=1.11<1.12: MISSING => Required system package ros-catkin>=0.6<0.7: MISSING => Required system package ros-comm>=1.11<1.12: MISSING => Required system package ros-common-msgs>=1.11<1.12: MISSING => Required system package ros-control-toolbox>=1.13<1.15: MISSING => Required system package ros-genmsg>=0.5<0.6: MISSING => Required system package ros-geometry>=1.11<1.12: MISSING => Required system package ros-message-generation>=0.2<0.3: MISSING => Required system package ros-message-runtime>=0.4<0.5 : MISSING => Required system package ros-pluginlib>=1.10<1.11: MISSING => Required system package ros-robot-model>=1.11<1.12: MISSING => Required system package ros-ros>=1.11<1.12: MISSING => Required system package ros-std-msgs>=0.5 : MISSING => Dependency tnftp-20130505~ssl already installed ERROR: ====================================================================== ERROR: Missing system packages required for pal-gazebo-plugins-1.1.7: ERROR: ERROR: ros-actionlib>=1.11<1.12 (Ubuntu package ros-indigo-actionlib) ERROR: ros-catkin>=0.6<0.7 (Ubuntu package ros-indigo-catkin) ERROR: ros-comm>=1.11<1.12 (Ubuntu package ros-indigo-comm) ERROR: ros-common-msgs>=1.11<1.12 (Ubuntu package ros-indigo-common-msgs) ERROR: ros-control-toolbox>=1.13<1.15 (Ubuntu package ros-indigo-control-toolbox) ERROR: ros-genmsg>=0.5<0.6 (Ubuntu package ros-indigo-genmsg) ERROR: ros-geometry>=1.11<1.12 (Ubuntu package ros-indigo-geometry) ERROR: ros-message-generation>=0.2<0.3 (Ubuntu package ros-indigo-message-generation) ERROR: ros-message-runtime>=0.4<0.5 (Ubuntu package ros-indigo-message-runtime) ERROR: ros-pluginlib>=1.10<1.11 (Ubuntu package ros-indigo-pluginlib) ERROR: ros-robot-model>=1.11<1.12 (Ubuntu package ros-indigo-robot-model) ERROR: ros-ros>=1.11<1.12 (Ubuntu package ros-indigo-ros) ERROR: ros-std-msgs>=0.5 (Ubuntu package ros-indigo-std-msgs) ERROR: ERROR: Please use the system package management tool to install these ERROR: dependencies. If a robotpkg version of a dependency is available, ERROR: you can configure robotpkg.conf to use this version instead. ERROR: ERROR: See /local/robotpkg/var/tmp/robotpkg/wip/pal-gazebo-plugins/work/sysdep.log for details. ERROR: ====================================================================== make[2]: *** [sys-depends] Error 2 ===> Logging bulk summary for pal-gazebo-plugins-1.1.7 => Checking leftover files => Creating bulk log files => Logging bulk metadata ===> Cleaning temporary files for pal-gazebo-plugins-1.1.7 ===> Done bulk for pal-gazebo-plugins-1.1.7 [78%] Processing wip/sot-dyninv:sot-dyninv-2.0.0r1 ===> Cleaning temporary files for sot-dyninv-2.0.0r1 ===> Bulk building for sot-dyninv-2.0.0r1 => Checking for clear installation => Installing /opt/robotpkg/var/lib/robotpkg/packages/bsd/Ubuntu-18.04-x86_64/All/digest-20080510.tgz => Installing /opt/robotpkg/var/lib/robotpkg/packages/bsd/Ubuntu-18.04-x86_64/All/tnftp-20130505~ssl.tgz => Required robotpkg package digest>=20080510: digest-20080510 found => Required robotpkg package tnftp>=20091122: tnftp-20130505~ssl found => Required system package gnupg>=1: gnupg-2.2.4 found => Required system package gzip: gzip-1.6 found => Required system package pax and tar archivers: pax found => Required system package pkg_install>=20110805.9: pkg_install-20110805.9 found => Required system package pkgrepo2deb>=1.3: pkgrepo2deb-1.3 found => Dependency digest-20080510 already installed => Installing /opt/robotpkg/var/lib/robotpkg/packages/bsd/Ubuntu-18.04-x86_64/All/jrl-mal-1.19.6r1~jrl-mathtools.tgz => Installing /opt/robotpkg/var/lib/robotpkg/packages/bsd/Ubuntu-18.04-x86_64/All/py27-dynamic-graph-2.5.6r1.tgz => Installing /opt/robotpkg/var/lib/robotpkg/packages/bsd/Ubuntu-18.04-x86_64/All/sot-core-2.9.10.tgz ERROR: Required robotpkg package soth>=2.0.0: BROKEN => Dependency tnftp-20130505~ssl already installed ===> Logging bulk summary for sot-dyninv-2.0.0r1 => Checking leftover files => Creating bulk log files => Logging bulk metadata ===> Cleaning temporary files for sot-dyninv-2.0.0r1 ===> Done bulk for sot-dyninv-2.0.0r1 [79%] Processing wip/pal-hardware-gazebo:pal-hardware-gazebo-0.1.1r2 ===> Cleaning temporary files for pal-hardware-gazebo-0.1.1r2 ===> Bulk building for pal-hardware-gazebo-0.1.1r2 => Checking for clear installation => Installing /opt/robotpkg/var/lib/robotpkg/packages/bsd/Ubuntu-18.04-x86_64/All/digest-20080510.tgz => Installing /opt/robotpkg/var/lib/robotpkg/packages/bsd/Ubuntu-18.04-x86_64/All/tnftp-20130505~ssl.tgz => Required robotpkg package digest>=20080510: digest-20080510 found => Required robotpkg package tnftp>=20130505~ssl: tnftp-20130505~ssl found => Required system package gnupg>=1: gnupg-2.2.4 found => Required system package gzip: gzip-1.6 found => Required system package patch>=2.0: patch-2.7.6 found => Required system package pax and tar archivers: pax found => Required system package pkg_install>=20110805.9: pkg_install-20110805.9 found => Required system package pkgrepo2deb>=1.3: pkgrepo2deb-1.3 found => Dependency digest-20080510 already installed ERROR: Required robotpkg package dynamic-introspection>=1.0.5: BROKEN => Required robotpkg package pal-hardware-interfaces>=0.0.3: N/A => Required robotpkg package prf-gazebo-ros-pkgs>=2.6.5: N/A => Required robotpkg package prf-ros-control>=0.2: N/A => Dependency tnftp-20130505~ssl already installed ===> Logging bulk summary for pal-hardware-gazebo-0.1.1r2 => Checking leftover files => Creating bulk log files => Logging bulk metadata ===> Cleaning temporary files for pal-hardware-gazebo-0.1.1r2 ===> Done bulk for pal-hardware-gazebo-0.1.1r2 [79%] Processing wip/mhp-genom:mhp-genom-3.15 ===> Cleaning temporary files for mhp-genom-3.15~openprs+pr2+spark+tcl+tclserv_client ===> Bulk building for mhp-genom-3.15~openprs+pr2+spark+tcl+tclserv_client => Checking for clear installation => Installing /opt/robotpkg/var/lib/robotpkg/packages/bsd/Ubuntu-18.04-x86_64/All/digest-20080510.tgz => Installing /opt/robotpkg/var/lib/robotpkg/packages/bsd/Ubuntu-18.04-x86_64/All/tnftp-20130505~ssl.tgz => Required robotpkg package digest>=20080510: digest-20080510 found => Required robotpkg package tnftp>=20091122: tnftp-20130505~ssl found => Required system package gnupg>=1: gnupg-2.2.4 found => Required system package gzip: gzip-1.6 found => Required system package pax and tar archivers: pax found => Required system package pkg_install>=20110805.9: pkg_install-20110805.9 found => Required system package pkgrepo2deb>=1.3: pkgrepo2deb-1.3 found => Dependency digest-20080510 already installed => Installing /opt/robotpkg/var/lib/robotpkg/packages/bsd/Ubuntu-18.04-x86_64/All/gbM-0.11~tcl.tgz => Installing /opt/robotpkg/var/lib/robotpkg/packages/bsd/Ubuntu-18.04-x86_64/All/genManip-genom-0.9~openprs+tcl+tclserv_client.tgz => Dependency genom-2.12~doc already installed ERROR: Required robotpkg package libmove3d>=3.22.0: BROKEN ERROR: Required robotpkg package libmove3d-hri>=2.24: BROKEN => Installing /opt/robotpkg/var/lib/robotpkg/packages/bsd/Ubuntu-18.04-x86_64/All/libt3d-2.6~doc.tgz => Dependency libtclserv_client-0.5r1 already installed => Installing /opt/robotpkg/var/lib/robotpkg/packages/bsd/Ubuntu-18.04-x86_64/All/mkdep-2.7r1.tgz => Dependency pocolibs-2.16 already installed => Installing /opt/robotpkg/var/lib/robotpkg/packages/bsd/Ubuntu-18.04-x86_64/All/pom-genom-0.7~openprs+tcl+tclserv_client.tgz ERROR: Required robotpkg package spark-genom>=3.9: BROKEN => Dependency tclserv-2.8.1 already installed => Dependency tnftp-20130505~ssl already installed => Dependency transgen-1.1b1 already installed ===> Logging bulk summary for mhp-genom-3.15~openprs+pr2+spark+tcl+tclserv_client => Checking leftover files => Creating bulk log files => Logging bulk metadata ===> Cleaning temporary files for mhp-genom-3.15~openprs+pr2+spark+tcl+tclserv_client ===> Done bulk for mhp-genom-3.15~openprs+pr2+spark+tcl+tclserv_client [79%] Processing wip/hatpconsole:hatpconsole-2.0.0 ===> Bulk building for hatpconsole-2.0.0 Binary package for hatpconsole-2.0.0 is up-to-date. [80%] Processing wip/jrl-walkgen-v3:jrl-walkgen-v3-4.0.2r2 ===> Bulk building for jrl-walkgen-v3-4.0.2r2 Binary package for jrl-walkgen-v3-4.0.2r2 is up-to-date. [80%] Processing wip/py-example-adder:py27-example-adder-1.0.0 ===> Bulk building for py27-example-adder-1.0.0 Binary package for py27-example-adder-1.0.0 is up-to-date. [81%] Processing wip/py-example-adder:py32-example-adder-1.0.0 ===> Bulk building for py32-example-adder-1.0.0 Binary package for py32-example-adder-1.0.0 is up-to-date. [81%] Processing wip/py-example-adder:py34-example-adder-1.0.0 ===> Bulk building for py34-example-adder-1.0.0 Binary package for py34-example-adder-1.0.0 is up-to-date. [82%] Processing wip/py-example-adder:py35-example-adder-1.0.0 ===> Bulk building for py35-example-adder-1.0.0 Binary package for py35-example-adder-1.0.0 is up-to-date. [82%] Processing wip/py-example-adder:py36-example-adder-1.0.0 ===> Bulk building for py36-example-adder-1.0.0 Binary package for py36-example-adder-1.0.0 is up-to-date. [82%] Processing wip/move3d-studio:move3d-studio-1.4r3 ===> Cleaning temporary files for move3d-studio-1.4r3~qtstudio ===> Bulk building for move3d-studio-1.4r3~qtstudio => Checking for clear installation => Installing /opt/robotpkg/var/lib/robotpkg/packages/bsd/Ubuntu-18.04-x86_64/All/digest-20080510.tgz => Installing /opt/robotpkg/var/lib/robotpkg/packages/bsd/Ubuntu-18.04-x86_64/All/tnftp-20130505~ssl.tgz => Required robotpkg package digest>=20080510: digest-20080510 found => Required robotpkg package tnftp>=20091122: tnftp-20130505~ssl found => Required system package gnupg>=1: gnupg-2.2.4 found => Required system package gzip: gzip-1.6 found => Required system package pax and tar archivers: pax found => Required system package pkg_install>=20110805.9: pkg_install-20110805.9 found => Required system package pkgrepo2deb>=1.3: pkgrepo2deb-1.3 found => Dependency digest-20080510 already installed => Installing /opt/robotpkg/var/lib/robotpkg/packages/bsd/Ubuntu-18.04-x86_64/All/gbM-0.11~tcl.tgz WARNING: Cannot check installed version of glpk WARNING: Cannot check installed version of libXpm ERROR: Required robotpkg package libmove3d>=3.22.0: BROKEN ERROR: Required robotpkg package libmove3d-hri>=2.24: BROKEN ERROR: Required robotpkg package libmove3d-planners>=1.4.0: BROKEN => Installing /opt/robotpkg/var/lib/robotpkg/packages/bsd/Ubuntu-18.04-x86_64/All/softMotion-libs-3.12~tcl.tgz => Dependency tnftp-20130505~ssl already installed WARNING: Cannot check installed version of glpk WARNING: Cannot check installed version of libXpm ===> Logging bulk summary for move3d-studio-1.4r3~qtstudio => Checking leftover files => Creating bulk log files => Logging bulk metadata ===> Cleaning temporary files for move3d-studio-1.4r3~qtstudio ===> Done bulk for move3d-studio-1.4r3~qtstudio [83%] Processing wip/hyper-genom-plugin:hyper-genom-plugin-0.12 ===> Cleaning temporary files for hyper-genom-plugin-0.12 ===> Bulk building for hyper-genom-plugin-0.12 => Checking for clear installation => Installing /opt/robotpkg/var/lib/robotpkg/packages/bsd/Ubuntu-18.04-x86_64/All/digest-20080510.tgz => Installing /opt/robotpkg/var/lib/robotpkg/packages/bsd/Ubuntu-18.04-x86_64/All/tnftp-20130505~ssl.tgz => Required robotpkg package digest>=20080510: digest-20080510 found => Required robotpkg package tnftp>=20091122: tnftp-20130505~ssl found => Required system package gnupg>=1: gnupg-2.2.4 found => Required system package gzip: gzip-1.6 found => Required system package pax and tar archivers: pax found => Required system package pkg_install>=20110805.9: pkg_install-20110805.9 found => Required system package pkgrepo2deb>=1.3: pkgrepo2deb-1.3 found => Dependency digest-20080510 already installed ERROR: Required robotpkg package hyper>=0.12: BROKEN => Dependency tnftp-20130505~ssl already installed ===> Logging bulk summary for hyper-genom-plugin-0.12 => Checking leftover files => Creating bulk log files => Logging bulk metadata ===> Cleaning temporary files for hyper-genom-plugin-0.12 ===> Done bulk for hyper-genom-plugin-0.12 [83%] Processing wip/hyper-viewer:hyper-viewer-0.1r1 ===> Cleaning temporary files for hyper-viewer-0.1r1 ===> Bulk building for hyper-viewer-0.1r1 => Checking for clear installation => Installing /opt/robotpkg/var/lib/robotpkg/packages/bsd/Ubuntu-18.04-x86_64/All/digest-20080510.tgz => Installing /opt/robotpkg/var/lib/robotpkg/packages/bsd/Ubuntu-18.04-x86_64/All/tnftp-20130505~ssl.tgz => Required robotpkg package digest>=20080510: digest-20080510 found => Required robotpkg package tnftp>=20091122: tnftp-20130505~ssl found => Required system package gnupg>=1: gnupg-2.2.4 found => Required system package gzip: gzip-1.6 found => Required system package patch>=2.0: patch-2.7.6 found => Required system package pax and tar archivers: pax found => Required system package pkg_install>=20110805.9: pkg_install-20110805.9 found => Required system package pkgrepo2deb>=1.3: pkgrepo2deb-1.3 found => Dependency digest-20080510 already installed ERROR: Required robotpkg package hyper>=0.12: BROKEN => Dependency tnftp-20130505~ssl already installed ===> Logging bulk summary for hyper-viewer-0.1r1 => Checking leftover files => Creating bulk log files => Logging bulk metadata ===> Cleaning temporary files for hyper-viewer-0.1r1 ===> Done bulk for hyper-viewer-0.1r1 [84%] Processing wip/hatptester:hatptester-1.5.3 ===> Bulk building for hatptester-1.5.3 Binary package for hatptester-1.5.3 is up-to-date. [84%] Processing wip/py-dynamic-graph-tutorial:py27-dynamic-graph-tutorial-1.1.1 ===> Bulk building for py27-dynamic-graph-tutorial-1.1.1 Binary package for py27-dynamic-graph-tutorial-1.1.1 is up-to-date. [84%] Processing wip/py-dynamic-graph-tutorial:py32-dynamic-graph-tutorial-1.1.1 ===> Bulk building for py32-dynamic-graph-tutorial-1.1.1 Binary package for py32-dynamic-graph-tutorial-1.1.1 is up-to-date. [85%] Processing wip/py-dynamic-graph-tutorial:py34-dynamic-graph-tutorial-1.1.1 ===> Bulk building for py34-dynamic-graph-tutorial-1.1.1 Binary package for py34-dynamic-graph-tutorial-1.1.1 is up-to-date. [85%] Processing wip/py-dynamic-graph-tutorial:py35-dynamic-graph-tutorial-1.1.1 ===> Bulk building for py35-dynamic-graph-tutorial-1.1.1 Binary package for py35-dynamic-graph-tutorial-1.1.1 is up-to-date. [86%] Processing wip/py-dynamic-graph-tutorial:py36-dynamic-graph-tutorial-1.1.1 ===> Bulk building for py36-dynamic-graph-tutorial-1.1.1 Binary package for py36-dynamic-graph-tutorial-1.1.1 is up-to-date. [86%] Processing wip/talos-simulation:talos-simulation-0.1.4r2 ===> Cleaning temporary files for talos-simulation-0.1.4r2 ===> Bulk building for talos-simulation-0.1.4r2 => Checking for clear installation => Installing /opt/robotpkg/var/lib/robotpkg/packages/bsd/Ubuntu-18.04-x86_64/All/digest-20080510.tgz => Installing /opt/robotpkg/var/lib/robotpkg/packages/bsd/Ubuntu-18.04-x86_64/All/tnftp-20130505~ssl.tgz => Required robotpkg package digest>=20080510: digest-20080510 found => Required robotpkg package tnftp>=20130505~ssl: tnftp-20130505~ssl found => Required system package gnupg>=1: gnupg-2.2.4 found => Required system package gzip: gzip-1.6 found => Required system package pax and tar archivers: pax found => Required system package pkg_install>=20110805.9: pkg_install-20110805.9 found => Required system package pkgrepo2deb>=1.3: pkgrepo2deb-1.3 found => Dependency digest-20080510 already installed => Installing /opt/robotpkg/var/lib/robotpkg/wip/packages/bsd/Ubuntu-18.04-x86_64/All/head-action-0.0.1r1.tgz => Required robotpkg package pal-gazebo-plugins>=1.1.5: N/A => Required robotpkg package pal-gazebo-worlds>=2.0.0: N/A => Required robotpkg package pal-hardware-gazebo>=0.0.9: N/A => Required robotpkg package prf-roboticsgroup-gazebo-plugins>=0.0.3: N/A => Required robotpkg package prf-ros-controllers>=0.2.8: N/A => Required system package ros-actionlib>=1.11<1.12: MISSING => Required system package ros-catkin>=0.6<0.7: MISSING => Required system package ros-comm>=1.11<1.12: MISSING => Required system package ros-common-msgs>=1.11<1.12: MISSING => Required system package ros-control-toolbox>=1.13<1.15: MISSING => Required system package ros-genmsg>=0.5<0.6: MISSING => Required system package ros-geometry>=1.11<1.12: MISSING => Required system package ros-message-generation>=0.2<0.3: MISSING => Required system package ros-message-runtime>=0.4<0.5 : MISSING => Required system package ros-pluginlib>=1.10<1.11: MISSING => Required system package ros-robot-model>=1.11<1.12: MISSING => Required system package ros-ros>=1.11<1.12: MISSING => Required system package ros-std-msgs>=0.5 : MISSING => Required robotpkg package talos-moveit-config>=0.2.3: N/A => Required robotpkg package talos-robot>=0.0.14: N/A => Dependency tnftp-20130505~ssl already installed ERROR: ====================================================================== ERROR: Missing system packages required for talos-simulation-0.1.4r2: ERROR: ERROR: ros-actionlib>=1.11<1.12 (Ubuntu package ros-indigo-actionlib) ERROR: ros-catkin>=0.6<0.7 (Ubuntu package ros-indigo-catkin) ERROR: ros-comm>=1.11<1.12 (Ubuntu package ros-indigo-comm) ERROR: ros-common-msgs>=1.11<1.12 (Ubuntu package ros-indigo-common-msgs) ERROR: ros-control-toolbox>=1.13<1.15 (Ubuntu package ros-indigo-control-toolbox) ERROR: ros-genmsg>=0.5<0.6 (Ubuntu package ros-indigo-genmsg) ERROR: ros-geometry>=1.11<1.12 (Ubuntu package ros-indigo-geometry) ERROR: ros-message-generation>=0.2<0.3 (Ubuntu package ros-indigo-message-generation) ERROR: ros-message-runtime>=0.4<0.5 (Ubuntu package ros-indigo-message-runtime) ERROR: ros-pluginlib>=1.10<1.11 (Ubuntu package ros-indigo-pluginlib) ERROR: ros-robot-model>=1.11<1.12 (Ubuntu package ros-indigo-robot-model) ERROR: ros-ros>=1.11<1.12 (Ubuntu package ros-indigo-ros) ERROR: ros-std-msgs>=0.5 (Ubuntu package ros-indigo-std-msgs) ERROR: ERROR: Please use the system package management tool to install these ERROR: dependencies. If a robotpkg version of a dependency is available, ERROR: you can configure robotpkg.conf to use this version instead. ERROR: ERROR: See /local/robotpkg/var/tmp/robotpkg/wip/talos-simulation/work/sysdep.log for details. ERROR: ====================================================================== make[2]: *** [sys-depends] Error 2 ===> Logging bulk summary for talos-simulation-0.1.4r2 => Checking leftover files => Creating bulk log files => Logging bulk metadata ===> Cleaning temporary files for talos-simulation-0.1.4r2 ===> Done bulk for talos-simulation-0.1.4r2 [87%] Processing wip/atlaas-genom:atlaas-genom-0.1.6 ===> Cleaning temporary files for atlaas-genom-0.1.6~openprs+tcl+tclserv_client ===> Bulk building for atlaas-genom-0.1.6~openprs+tcl+tclserv_client => Checking for clear installation => Installing /opt/robotpkg/var/lib/robotpkg/packages/bsd/Ubuntu-18.04-x86_64/All/digest-20080510.tgz => Installing /opt/robotpkg/var/lib/robotpkg/packages/bsd/Ubuntu-18.04-x86_64/All/tnftp-20130505~ssl.tgz => Required robotpkg package digest>=20080510: digest-20080510 found => Required robotpkg package tnftp>=20091122: tnftp-20130505~ssl found => Required system package gnupg>=1: gnupg-2.2.4 found => Required system package gzip: gzip-1.6 found => Required system package pax and tar archivers: pax found => Required system package pkg_install>=20110805.9: pkg_install-20110805.9 found => Required system package pkgrepo2deb>=1.3: pkgrepo2deb-1.3 found => Installing /opt/robotpkg/var/lib/robotpkg/wip/packages/bsd/Ubuntu-18.04-x86_64/All/atlaas-0.1.6.tgz => Dependency digest-20080510 already installed => Dependency gdalwrap-0.1.10 already installed => Installing /opt/robotpkg/var/lib/robotpkg/packages/bsd/Ubuntu-18.04-x86_64/All/genBasic-genom-0.4r1~openprs+tcl+tclserv_client.tgz => Installing /opt/robotpkg/var/lib/robotpkg/packages/bsd/Ubuntu-18.04-x86_64/All/genPos-genom-0.3r1~openprs+tcl+tclserv_client.tgz => Dependency genom-2.12~doc already installed => Installing /opt/robotpkg/var/lib/robotpkg/packages/bsd/Ubuntu-18.04-x86_64/All/libimages3d-3.4r3.tgz => Dependency libt3d-2.6~doc already installed => Dependency libtclserv_client-0.5r1 already installed => Installing /opt/robotpkg/var/lib/robotpkg/packages/bsd/Ubuntu-18.04-x86_64/All/mkdep-2.7r1.tgz => Dependency pocolibs-2.16 already installed => Installing /opt/robotpkg/var/lib/robotpkg/packages/bsd/Ubuntu-18.04-x86_64/All/pom-genom-0.7~openprs+tcl+tclserv_client.tgz => Dependency tclserv-2.8.1 already installed => Dependency tnftp-20130505~ssl already installed => Dependency transgen-1.1b1 already installed => Required robotpkg package velodyne-genom>=1.6: NOT found ERROR: Required robotpkg package velodyne-genom>=1.6: NOT found ===> Logging bulk summary for atlaas-genom-0.1.6~openprs+tcl+tclserv_client => Checking leftover files => Creating bulk log files => Logging bulk metadata ===> Cleaning temporary files for atlaas-genom-0.1.6~openprs+tcl+tclserv_client ===> Done bulk for atlaas-genom-0.1.6~openprs+tcl+tclserv_client [87%] Processing wip/sot-hrprtc-hrp2:sot-hrprtc-hrp2-1.2.2 ===> Cleaning temporary files for sot-hrprtc-hrp2-1.2.2 ===> Bulk building for sot-hrprtc-hrp2-1.2.2 => Checking for clear installation => Installing /opt/robotpkg/var/lib/robotpkg/packages/bsd/Ubuntu-18.04-x86_64/All/digest-20080510.tgz => Installing /opt/robotpkg/var/lib/robotpkg/packages/bsd/Ubuntu-18.04-x86_64/All/tnftp-20130505~ssl.tgz => Required robotpkg package digest>=20080510: digest-20080510 found => Required robotpkg package tnftp>=20091122: tnftp-20130505~ssl found => Required system package gnupg>=1: gnupg-2.2.4 found => Required system package gzip: gzip-1.6 found => Required system package pax and tar archivers: pax found => Required system package pkg_install>=20110805.9: pkg_install-20110805.9 found => Required system package pkgrepo2deb>=1.3: pkgrepo2deb-1.3 found => Dependency digest-20080510 already installed => Installing /opt/robotpkg/var/lib/robotpkg/packages/bsd/Ubuntu-18.04-x86_64/All/dynamic-graph-2.5.7.tgz => Required robotpkg package dynamic-graph-bridge>=1.0.0: NOT found ERROR: Required robotpkg package dynamic-graph-bridge>=1.0.0: NOT found => Installing /opt/robotpkg/var/lib/robotpkg/packages/bsd/Ubuntu-18.04-x86_64/All/dynamic-graph-bridge-msgs-0.2.0.tgz => Installing /opt/robotpkg/var/lib/robotpkg/packages/bsd/Ubuntu-18.04-x86_64/All/hrp2-14-1.9.3.tgz => Installing /opt/robotpkg/var/lib/robotpkg/wip/packages/bsd/Ubuntu-18.04-x86_64/All/hrp2-14-description-1.0.5.tgz => Installing /opt/robotpkg/var/lib/robotpkg/wip/packages/bsd/Ubuntu-18.04-x86_64/All/hrp2-bringup-1.0.6.tgz => Dependency hrp2-computer-monitor-1.0.2 already installed => Installing /opt/robotpkg/var/lib/robotpkg/packages/bsd/Ubuntu-18.04-x86_64/All/hrp2-dynamics-1.5.3.tgz => Dependency hrp2-machine-1.0.2 already installed => Dependency jrl-mal-1.19.6r1~jrl-mathtools already installed => Required system package openrtm-aist>=1 : MISSING => Installing /opt/robotpkg/var/lib/robotpkg/packages/bsd/Ubuntu-18.04-x86_64/All/py27-dynamic-graph-2.5.6r1.tgz => Installing /opt/robotpkg/var/lib/robotpkg/packages/bsd/Ubuntu-18.04-x86_64/All/py27-sot-application-1.0.0r3.tgz => Dependency py27-sot-tools-1.0.1 already installed => Dependency sot-core-2.9.10 already installed => Dependency sot-dynamic-2.9.2 already installed ERROR: Required robotpkg package sot-dyninv>=2.0.0: BROKEN => Required robotpkg package sot-pattern-generator>=2.7: NOT found ERROR: Required robotpkg package sot-pattern-generator>=2.7: NOT found => Dependency tnftp-20130505~ssl already installed ERROR: ====================================================================== ERROR: Missing system packages required for sot-hrprtc-hrp2-1.2.2: ERROR: ERROR: openrtm-aist>=1 (Ubuntu package ros-melodic-openrtm-aist) ERROR: ERROR: Please use the system package management tool to install these ERROR: dependencies. If a robotpkg version of a dependency is available, ERROR: you can configure robotpkg.conf to use this version instead. ERROR: ERROR: See /local/robotpkg/var/tmp/robotpkg/wip/sot-hrprtc-hrp2/work/sysdep.log for details. ERROR: ====================================================================== make[2]: *** [sys-depends] Error 2 ===> Logging bulk summary for sot-hrprtc-hrp2-1.2.2 => Checking leftover files => Creating bulk log files => Logging bulk metadata ===> Cleaning temporary files for sot-hrprtc-hrp2-1.2.2 ===> Done bulk for sot-hrprtc-hrp2-1.2.2 [87%] Processing wip/py-parametric-curves:py27-parametric-curves-1.1.1 ===> Bulk building for py27-parametric-curves-1.1.1 Binary package for py27-parametric-curves-1.1.1 is up-to-date. [88%] Processing wip/py-parametric-curves:py32-parametric-curves-1.1.1 ===> Bulk building for py32-parametric-curves-1.1.1 Binary package for py32-parametric-curves-1.1.1 is up-to-date. [88%] Processing wip/py-parametric-curves:py34-parametric-curves-1.1.1 ===> Bulk building for py34-parametric-curves-1.1.1 Binary package for py34-parametric-curves-1.1.1 is up-to-date. [89%] Processing wip/py-parametric-curves:py35-parametric-curves-1.1.1 ===> Bulk building for py35-parametric-curves-1.1.1 Binary package for py35-parametric-curves-1.1.1 is up-to-date. [89%] Processing wip/py-parametric-curves:py36-parametric-curves-1.1.1 ===> Bulk building for py36-parametric-curves-1.1.1 Binary package for py36-parametric-curves-1.1.1 is up-to-date. [89%] Processing wip/sot-hrp2:sot-hrp2-1.1.2 ===> Cleaning temporary files for sot-hrp2-1.1.2 ===> Bulk building for sot-hrp2-1.1.2 => Checking for clear installation => Installing /opt/robotpkg/var/lib/robotpkg/packages/bsd/Ubuntu-18.04-x86_64/All/digest-20080510.tgz => Installing /opt/robotpkg/var/lib/robotpkg/packages/bsd/Ubuntu-18.04-x86_64/All/tnftp-20130505~ssl.tgz => Required robotpkg package digest>=20080510: digest-20080510 found => Required robotpkg package tnftp>=20091122: tnftp-20130505~ssl found => Required system package gnupg>=1: gnupg-2.2.4 found => Required system package gzip: gzip-1.6 found => Required system package pax and tar archivers: pax found => Required system package pkg_install>=20110805.9: pkg_install-20110805.9 found => Required system package pkgrepo2deb>=1.3: pkgrepo2deb-1.3 found => Dependency digest-20080510 already installed => Installing /opt/robotpkg/var/lib/robotpkg/packages/bsd/Ubuntu-18.04-x86_64/All/dynamic-graph-2.5.7.tgz => Required robotpkg package dynamic-graph-bridge>=1.0.0: NOT found ERROR: Required robotpkg package dynamic-graph-bridge>=1.0.0: NOT found => Installing /opt/robotpkg/var/lib/robotpkg/packages/bsd/Ubuntu-18.04-x86_64/All/dynamic-graph-bridge-msgs-0.2.0.tgz => Installing /opt/robotpkg/var/lib/robotpkg/packages/bsd/Ubuntu-18.04-x86_64/All/hrp2-14-1.9.3.tgz => Installing /opt/robotpkg/var/lib/robotpkg/wip/packages/bsd/Ubuntu-18.04-x86_64/All/hrp2-14-description-1.0.5.tgz => Installing /opt/robotpkg/var/lib/robotpkg/wip/packages/bsd/Ubuntu-18.04-x86_64/All/hrp2-bringup-1.0.6.tgz => Dependency hrp2-computer-monitor-1.0.2 already installed => Installing /opt/robotpkg/var/lib/robotpkg/packages/bsd/Ubuntu-18.04-x86_64/All/hrp2-dynamics-1.5.3.tgz => Dependency hrp2-machine-1.0.2 already installed => Dependency jrl-mal-1.19.6r1~jrl-mathtools already installed => Installing /opt/robotpkg/var/lib/robotpkg/packages/bsd/Ubuntu-18.04-x86_64/All/py27-dynamic-graph-2.5.6r1.tgz => Installing /opt/robotpkg/var/lib/robotpkg/packages/bsd/Ubuntu-18.04-x86_64/All/py27-sot-application-1.0.0r3.tgz => Dependency py27-sot-tools-1.0.1 already installed => Dependency sot-core-2.9.10 already installed => Dependency sot-dynamic-2.9.2 already installed ERROR: Required robotpkg package sot-dyninv>=2.0.0: BROKEN => Required robotpkg package sot-pattern-generator>=2.7: NOT found ERROR: Required robotpkg package sot-pattern-generator>=2.7: NOT found => Dependency tnftp-20130505~ssl already installed ===> Logging bulk summary for sot-hrp2-1.1.2 => Checking leftover files => Creating bulk log files => Logging bulk metadata ===> Cleaning temporary files for sot-hrp2-1.1.2 ===> Done bulk for sot-hrp2-1.1.2 [90%] Processing wip/sot-core-v3:sot-core-v3-3.1.9r1 ===> Bulk building for sot-core-v3-3.1.9r1 Binary package for sot-core-v3-3.1.9r1 is up-to-date. [90%] Processing wip/hri-simulation:hri-simulationr1 ===> Cleaning temporary files for hri-simulationr1 ===> Bulk building for hri-simulationr1 => Checking for clear installation => Installing /opt/robotpkg/var/lib/robotpkg/packages/bsd/Ubuntu-18.04-x86_64/All/digest-20080510.tgz => Installing /opt/robotpkg/var/lib/robotpkg/packages/bsd/Ubuntu-18.04-x86_64/All/tnftp-20130505~ssl.tgz => Required robotpkg package digest>=20080510: digest-20080510 found => Required robotpkg package tnftp>=20091122: tnftp-20130505~ssl found => Required system package gnupg>=1: gnupg-2.2.4 found => Required system package gzip: gzip-1.6 found => Required system package pax and tar archivers: pax found => Required system package pkg_install>=20110805.9: pkg_install-20110805.9 found => Required system package pkgrepo2deb>=1.3: pkgrepo2deb-1.3 found => Installing /opt/robotpkg/var/lib/robotpkg/packages/bsd/Ubuntu-18.04-x86_64/All/alog-0.5.tgz => Dependency digest-20080510 already installed => Installing /opt/robotpkg/var/lib/robotpkg/packages/bsd/Ubuntu-18.04-x86_64/All/genPos-genom-0.3r1~openprs+tcl+tclserv_client.tgz => Dependency genom-2.12~doc already installed => Installing /opt/robotpkg/var/lib/robotpkg/packages/bsd/Ubuntu-18.04-x86_64/All/libt3d-2.6~doc.tgz ERROR: Required robotpkg package mhp-genom>=3.15: BROKEN => Installing /opt/robotpkg/var/lib/robotpkg/wip/packages/bsd/Ubuntu-18.04-x86_64/All/morse-pocolibs-1.4.tgz => Installing /opt/robotpkg/var/lib/robotpkg/wip/packages/bsd/Ubuntu-18.04-x86_64/All/move3d-assets-20120125.tgz => Installing /opt/robotpkg/var/lib/robotpkg/packages/bsd/Ubuntu-18.04-x86_64/All/platine-genom-0.5~openprs+tcl+tclserv_client.tgz => Dependency pom-genom-0.7~openprs+tcl+tclserv_client already installed => Installing /opt/robotpkg/var/lib/robotpkg/packages/bsd/Ubuntu-18.04-x86_64/All/py27-poco-1.5.tgz ERROR: Required robotpkg package spark-genom>=3.9: BROKEN => Dependency tnftp-20130505~ssl already installed => Required robotpkg package viman-genom>=1.4: NOT found ERROR: Required robotpkg package viman-genom>=1.4: NOT found ===> Logging bulk summary for hri-simulationr1 => Checking leftover files => Creating bulk log files => Logging bulk metadata ===> Cleaning temporary files for hri-simulationr1 ===> Done bulk for hri-simulationr1 [91%] Processing wip/sot-torque-control:sot-torque-control-1.0.0r3 ===> Cleaning temporary files for sot-torque-control-1.0.0r3 ===> Bulk building for sot-torque-control-1.0.0r3 => Checking for clear installation => Installing /opt/robotpkg/var/lib/robotpkg/packages/bsd/Ubuntu-18.04-x86_64/All/digest-20080510.tgz => Installing /opt/robotpkg/var/lib/robotpkg/packages/bsd/Ubuntu-18.04-x86_64/All/tnftp-20130505~ssl.tgz => Required robotpkg package digest>=20080510: digest-20080510 found => Required robotpkg package tnftp>=20091122: tnftp-20130505~ssl found => Required system package gnupg>=1: gnupg-2.2.4 found => Required system package gzip: gzip-1.6 found => Required system package pax and tar archivers: pax found => Required system package pkg_install>=20110805.9: pkg_install-20110805.9 found => Required system package pkgrepo2deb>=1.3: pkgrepo2deb-1.3 found => Dependency digest-20080510 already installed => Installing /opt/robotpkg/var/lib/robotpkg/wip/packages/bsd/Ubuntu-18.04-x86_64/All/dynamic-graph-v3-3.0.1.tgz => Installing /opt/robotpkg/var/lib/robotpkg/packages/bsd/Ubuntu-18.04-x86_64/All/hpp-fcl-0.6.0.tgz => Installing /opt/robotpkg/var/lib/robotpkg/wip/packages/bsd/Ubuntu-18.04-x86_64/All/parametric-curves-1.1.1.tgz => Installing /opt/robotpkg/var/lib/robotpkg/packages/bsd/Ubuntu-18.04-x86_64/All/pinocchio-1.2.9r1.tgz => Installing /opt/robotpkg/var/lib/robotpkg/wip/packages/bsd/Ubuntu-18.04-x86_64/All/simple-humanoid-description-1.0.1.tgz => Installing /opt/robotpkg/var/lib/robotpkg/wip/packages/bsd/Ubuntu-18.04-x86_64/All/sot-core-v3-3.1.9r1.tgz => Dependency tnftp-20130505~ssl already installed => Installing /opt/robotpkg/var/lib/robotpkg/wip/packages/bsd/Ubuntu-18.04-x86_64/All/tsid-1.0.2.tgz => Dependency urdfdom-0.3.0r2 already installed => Building with no option. => Use the GNU C++ compiler: c++-compiler provided by g++>=3 => Use the GNU C compiler: c-compiler provided by gcc>=3 => Required system package boost-headers>=1.34.1: boost-headers-1.65.1 found => Required system package boostlib-filesystem>=1.34.1: boost-libs-1.65.1 found => Required system package boostlib-iostreams>=1.34.1: boost-libs-1.65.1 found => Required system package boostlib-math>=1.34.1: boost-libs-1.65.1 found => Required system package boostlib-thread>=1.34.1: boost-libs-1.65.1 found => Required system package cmake>=2.6: cmake-3.10.2 found => Required system package doxygen>=1.5: doxygen-1.8.13 found => Required system package eigen3>=3.0.0: eigen3-3.3.4 found => Required system package g++>=3: g++-7 found => Required system package gcc>=3: gcc-7 found => Required system package graphviz>=2: graphviz-2.40.1 found => Required system package libstdc++: libstdc++ found => Required system package pkg-config>=0.22: pkg-config-0.29.1 found => Required system package tinyxml>=2: tinyxml-2.6.2 found => Required robotpkg package dynamic-graph-v3>=3.0.0: dynamic-graph-v3-3.0.1 found => Required robotpkg package hpp-fcl>=0.5: hpp-fcl-0.6.0 found => Required robotpkg package parametric-curves>=1.0.0: parametric-curves-1.1.1 found => Required robotpkg package pinocchio>=1.2.8: pinocchio-1.2.9r1 found => Required robotpkg package simple-humanoid-description>=1.0.1: simple-humanoid-description-1.0.1 found => Required robotpkg package sot-core-v3>=3.0.0: sot-core-v3-3.1.9r1 found => Required robotpkg package tsid>=1.0.0: tsid-1.0.2 found => Required robotpkg package urdfdom>=0.2.8<1: urdfdom-0.3.0r2 found WARNING: Using urdfdom-0.3.0 in /opt/openrobots WARNING: The following packages may interfere with the build because they WARNING: are located in paths used by other dependencies: WARNING: urdfdom-1.0.0 in /usr => SHA1 checksums OK => RMD160 checksums OK An unexpected error occured. The last 10 log lines are shown below. | [ 23%] Built target current-controller | [ 24%] Linking CXX shared library device-torque-ctrl.so | cd /local/robotpkg/var/tmp/robotpkg/wip/sot-torque-control/work/sot-torque-control-1.0.0/src && /usr/bin/cmake -E cmake_link_script CMakeFiles/device-torque-ctrl.dir/link.txt --verbose=1 | /usr/bin/g++ -fPIC -pedantic -Wno-long-long -Wall -Wextra -Wcast-align -Wcast-qual -Wformat -Wwrite-strings -Wconversion -pipe -O3 -DNDEBUG -L/opt/openrobots/lib -Wl,-rpath,/opt/openrobots/lib -ldynamic-graph -L/opt/openrobots/lib -Wl,-rpath,/opt/openrobots/lib -lsot-core -Wl,-rpath,/opt/openrobots/lib -ldynamic-graph-python -Wl,-rpath,/usr/lib/x86_64-linux-gnu -Wl,-rpath,/opt/openrobots/lib -ldynamic-graph -L/opt/openrobots/lib -Wl,-rpath,/opt/openrobots/lib -lpinocchio -Wl,-rpath,/usr/lib/x86_64-linux-gnu -lboost_filesystem -lboost_system -lurdfdom_sensor -lurdfdom_model_state -lurdfdom_model -lurdfdom_world -lconsole_bridge -Wl,-rpath,/opt/openrobots/lib -lhpp-fcl -lboost_thread -lboost_date_time -lboost_filesystem -lboost_system -loctomap -loctomath -lassimp -shared -Wl,-soname,device-torque-ctrl.so.1.0.0 -o device-torque-ctrl.so.1.0.0 CMakeFiles/device-torque-ctrl.dir/device-torque-ctrl.cpp.o -L/opt/openrobots/lib -Wl,-rpath,/opt/openrobots/lib:/local/robotpkg/var/tmp/robotpkg/wip/sot-torque-control/work/sot-torque-control-1.0.0: ../libsot-torque-control.so.1.0.0 -lboost_thread -lboost_filesystem -lboost_program_options -lboost_unit_test_framework -lboost_system -lboost_regex -lboost_chrono -lboost_date_time -lboost_atomic -lpthread -ldl -ldl -lpthread -L/opt/openrobots/lib -Wl,-rpath,/opt/openrobots/lib -ldynamic-graph -Wl,-rpath,/opt/openrobots/lib -L/opt/openrobots/lib -Wl,-rpath,/opt/openrobots/lib -lsot-core -Wl,-rpath,/opt/openrobots/lib -ldynamic-graph-python -Wl,-rpath,/usr/lib/x86_64-linux-gnu -Wl,-rpath,/opt/openrobots/lib -ldynamic-graph -Wl,-rpath,/opt/openrobots/lib -Wl,-rpath,/usr/lib/x86_64-linux-gnu -Wl,-rpath,/opt/openrobots/lib -L/opt/openrobots/lib -Wl,-rpath,/opt/openrobots/lib -lpinocchio -Wl,-rpath,/usr/lib/x86_64-linux-gnu -lboost_filesystem -lboost_system -lurdfdom_sensor -lurdfdom_model_state -lurdfdom_model -lurdfdom_world -lconsole_bridge -Wl,-rpath,/opt/openrobots/lib -lhpp-fcl -lboost_thread -lboost_date_time -lboost_filesystem -lboost_system -loctomap -loctomath -lassimp -Wl,-rpath,/opt/openrobots/lib -Wl,-rpath,/usr/lib/x86_64-linux-gnu -Wl,-rpath,/opt/openrobots/lib -lsot-core -ldynamic-graph-python -ltsid -lpinocchio -lboost_filesystem -lboost_system -lurdfdom_sensor -lurdfdom_model_state -lurdfdom_model -lurdfdom_world -lconsole_bridge -lhpp-fcl -lboost_thread -lboost_date_time -lboost_filesystem -lboost_system -lurdfdom_sensor -lurdfdom_model_state -lurdfdom_model -lurdfdom_world -lconsole_bridge -lhpp-fcl -lboost_thread -lboost_date_time -loctomap -loctomath -lassimp -lboost_serialization -lboost_thread -lboost_filesystem -lboost_program_options -lboost_unit_test_framework -lboost_system -lboost_regex -lboost_chrono -lboost_date_time -lboost_atomic -lpthread -ldl -lpthread | cd /local/robotpkg/var/tmp/robotpkg/wip/sot-torque-control/work/sot-torque-control-1.0.0/src && /usr/bin/cmake -E cmake_symlink_library device-torque-ctrl.so.1.0.0 device-torque-ctrl.so.1.0.0 device-torque-ctrl.so | make[2]: Leaving directory '/local/robotpkg/var/tmp/robotpkg/wip/sot-torque-control/work/sot-torque-control-1.0.0' | [ 24%] Built target device-torque-ctrl | make: *** [all] Error 2 | make[1]: Leaving directory '/local/robotpkg/var/tmp/robotpkg/wip/sot-torque-control/work/sot-torque-control-1.0.0' | Makefile:165: recipe for target 'all' failed For details or bug reports, check the complete log file in: /local/robotpkg/var/tmp/robotpkg/wip/sot-torque-control/work/build.log make[3]: *** [do-build] Error 2 make[2]: *** [pkg-check-installed] Error 2 => Marking sot-torque-control-1.0.0r3 as broken ERROR: make: *** [package] Error 2 ===> Logging bulk summary for sot-torque-control-1.0.0r3 => Checking leftover files => Creating bulk log files => Logging bulk metadata ===> Cleaning temporary files for sot-torque-control-1.0.0r3 ===> Done bulk for sot-torque-control-1.0.0r3 [91%] Processing wip/sot-tools-v3:sot-tools-v3-2.0.3 ===> Bulk building for sot-tools-v3-2.0.3 Binary package for sot-tools-v3-2.0.3 is up-to-date. [92%] Processing wip/sot-dyninv-v3:sot-dyninv-v3-3.0.0r1 ===> Cleaning temporary files for sot-dyninv-v3-3.0.0r1 ===> Bulk building for sot-dyninv-v3-3.0.0r1 => Checking for clear installation => Installing /opt/robotpkg/var/lib/robotpkg/packages/bsd/Ubuntu-18.04-x86_64/All/digest-20080510.tgz => Installing /opt/robotpkg/var/lib/robotpkg/packages/bsd/Ubuntu-18.04-x86_64/All/tnftp-20130505~ssl.tgz => Required robotpkg package digest>=20080510: digest-20080510 found => Required robotpkg package tnftp>=20091122: tnftp-20130505~ssl found => Required system package gnupg>=1: gnupg-2.2.4 found => Required system package gzip: gzip-1.6 found => Required system package pax and tar archivers: pax found => Required system package pkg_install>=20110805.9: pkg_install-20110805.9 found => Required system package pkgrepo2deb>=1.3: pkgrepo2deb-1.3 found => Dependency digest-20080510 already installed => Installing /opt/robotpkg/var/lib/robotpkg/wip/packages/bsd/Ubuntu-18.04-x86_64/All/py27-dynamic-graph-v3-3.0.2.tgz => Installing /opt/robotpkg/var/lib/robotpkg/wip/packages/bsd/Ubuntu-18.04-x86_64/All/sot-core-v3-3.1.9r1.tgz ERROR: Required robotpkg package soth>=2.0.0: BROKEN => Dependency tnftp-20130505~ssl already installed ===> Logging bulk summary for sot-dyninv-v3-3.0.0r1 => Checking leftover files => Creating bulk log files => Logging bulk metadata ===> Cleaning temporary files for sot-dyninv-v3-3.0.0r1 ===> Done bulk for sot-dyninv-v3-3.0.0r1 [92%] Processing wip/py-sot-torque-control:py27-sot-torque-control-1.0.0r3 ===> Cleaning temporary files for py27-sot-torque-control-1.0.0r3 ===> Bulk building for py27-sot-torque-control-1.0.0r3 => Checking for clear installation => Installing /opt/robotpkg/var/lib/robotpkg/packages/bsd/Ubuntu-18.04-x86_64/All/digest-20080510.tgz => Installing /opt/robotpkg/var/lib/robotpkg/packages/bsd/Ubuntu-18.04-x86_64/All/tnftp-20130505~ssl.tgz => Required robotpkg package digest>=20080510: digest-20080510 found => Required robotpkg package tnftp>=20091122: tnftp-20130505~ssl found => Required system package gnupg>=1: gnupg-2.2.4 found => Required system package gzip: gzip-1.6 found => Required system package pax and tar archivers: pax found => Required system package pkg_install>=20110805.9: pkg_install-20110805.9 found => Required system package pkgrepo2deb>=1.3: pkgrepo2deb-1.3 found => Dependency digest-20080510 already installed => Installing /opt/robotpkg/var/lib/robotpkg/wip/packages/bsd/Ubuntu-18.04-x86_64/All/dynamic-graph-v3-3.0.1.tgz => Installing /opt/robotpkg/var/lib/robotpkg/packages/bsd/Ubuntu-18.04-x86_64/All/hpp-fcl-0.6.0.tgz => Installing /opt/robotpkg/var/lib/robotpkg/wip/packages/bsd/Ubuntu-18.04-x86_64/All/parametric-curves-1.1.1.tgz => Installing /opt/robotpkg/var/lib/robotpkg/packages/bsd/Ubuntu-18.04-x86_64/All/pinocchio-1.2.9r1.tgz => Installing /opt/robotpkg/var/lib/robotpkg/wip/packages/bsd/Ubuntu-18.04-x86_64/All/py27-dynamic-graph-v3-3.0.2.tgz => Installing /opt/robotpkg/var/lib/robotpkg/wip/packages/bsd/Ubuntu-18.04-x86_64/All/py27-parametric-curves-1.1.1.tgz => Installing /opt/robotpkg/var/lib/robotpkg/wip/packages/bsd/Ubuntu-18.04-x86_64/All/simple-humanoid-description-1.0.1.tgz => Installing /opt/robotpkg/var/lib/robotpkg/wip/packages/bsd/Ubuntu-18.04-x86_64/All/sot-core-v3-3.1.9r1.tgz => Dependency tnftp-20130505~ssl already installed => Installing /opt/robotpkg/var/lib/robotpkg/wip/packages/bsd/Ubuntu-18.04-x86_64/All/tsid-1.0.2.tgz => Dependency urdfdom-0.3.0r2 already installed => Building with no option. => Use the GNU C++ compiler: c++-compiler provided by g++>=3 => Use the GNU C compiler: c-compiler provided by gcc>=3 => Use python-2.7: python>=2.5<3.7 provided by python27>=2.7<2.8 => Required system package boost-headers>=1.34.1: boost-headers-1.65.1 found => Required system package boostlib-filesystem>=1.34.1: boost-libs-1.65.1 found => Required system package boostlib-iostreams>=1.34.1: boost-libs-1.65.1 found => Required system package boostlib-math>=1.34.1: boost-libs-1.65.1 found => Required system package boostlib-thread>=1.34.1: boost-libs-1.65.1 found => Required system package cmake>=2.6: cmake-3.10.2 found => Required system package doxygen>=1.5: doxygen-1.8.13 found => Required system package eigen3>=3.0.0: eigen3-3.3.4 found => Required system package g++>=3: g++-7 found => Required system package gcc>=3: gcc-7 found => Required system package graphviz>=2: graphviz-2.40.1 found => Required system package libstdc++: libstdc++ found => Required system package pkg-config>=0.22: pkg-config-0.29.1 found => Required system package py-sphinx>=1.1: py-sphinx-1.6.7 found => Required system package python27>=2.7<2.8: python27-2.7.151 found => Required system package tinyxml>=2: tinyxml-2.6.2 found => Required robotpkg package dynamic-graph-v3>=3.0.0: dynamic-graph-v3-3.0.1 found => Required robotpkg package hpp-fcl>=0.5: hpp-fcl-0.6.0 found => Required robotpkg package parametric-curves>=1.0.0: parametric-curves-1.1.1 found => Required robotpkg package pinocchio>=1.2.8: pinocchio-1.2.9r1 found => Required robotpkg package py27-dynamic-graph-v3>=3.0: py27-dynamic-graph-v3-3.0.2 found => Required robotpkg package py27-parametric-curves>=1.0.0: py27-parametric-curves-1.1.1 found => Required robotpkg package simple-humanoid-description>=1.0.1: simple-humanoid-description-1.0.1 found => Required robotpkg package sot-core-v3>=3.0.0: sot-core-v3-3.1.9r1 found => Required robotpkg package tsid>=1.0.0: tsid-1.0.2 found => Required robotpkg package urdfdom>=0.2.8<1: urdfdom-0.3.0r2 found WARNING: Using urdfdom-0.3.0 in /opt/openrobots WARNING: The following packages may interfere with the build because they WARNING: are located in paths used by other dependencies: WARNING: urdfdom-1.0.0 in /usr => SHA1 checksums OK => RMD160 checksums OK An unexpected error occured. The last 10 log lines are shown below. | [ 23%] Built target current-controller | [ 24%] Linking CXX shared library device-torque-ctrl.so | cd /local/robotpkg/var/tmp/robotpkg/wip/py-sot-torque-control/work/sot-torque-control-1.0.0/src && /usr/bin/cmake -E cmake_link_script CMakeFiles/device-torque-ctrl.dir/link.txt --verbose=1 | /usr/bin/g++ -fPIC -pedantic -Wno-long-long -Wall -Wextra -Wcast-align -Wcast-qual -Wformat -Wwrite-strings -Wconversion -pipe -O3 -DNDEBUG -L/opt/openrobots/lib -Wl,-rpath,/opt/openrobots/lib -ldynamic-graph -L/opt/openrobots/lib -Wl,-rpath,/opt/openrobots/lib -lsot-core -Wl,-rpath,/opt/openrobots/lib -ldynamic-graph-python -Wl,-rpath,/usr/lib/x86_64-linux-gnu -Wl,-rpath,/opt/openrobots/lib -ldynamic-graph -L/opt/openrobots/lib -Wl,-rpath,/opt/openrobots/lib -lpinocchio -Wl,-rpath,/usr/lib/x86_64-linux-gnu -lboost_filesystem -lboost_system -lurdfdom_sensor -lurdfdom_model_state -lurdfdom_model -lurdfdom_world -lconsole_bridge -Wl,-rpath,/opt/openrobots/lib -lhpp-fcl -lboost_thread -lboost_date_time -lboost_filesystem -lboost_system -loctomap -loctomath -lassimp -shared -Wl,-soname,device-torque-ctrl.so.1.0.0 -o device-torque-ctrl.so.1.0.0 CMakeFiles/device-torque-ctrl.dir/device-torque-ctrl.cpp.o -L/opt/openrobots/lib -Wl,-rpath,/opt/openrobots/lib:/local/robotpkg/var/tmp/robotpkg/wip/py-sot-torque-control/work/sot-torque-control-1.0.0: ../libsot-torque-control.so.1.0.0 -lboost_thread -lboost_filesystem -lboost_program_options -lboost_unit_test_framework -lboost_system -lboost_regex -lboost_chrono -lboost_date_time -lboost_atomic -lpthread -ldl -ldl -lpthread -L/opt/openrobots/lib -Wl,-rpath,/opt/openrobots/lib -ldynamic-graph -Wl,-rpath,/opt/openrobots/lib -L/opt/openrobots/lib -Wl,-rpath,/opt/openrobots/lib -lsot-core -Wl,-rpath,/opt/openrobots/lib -ldynamic-graph-python -Wl,-rpath,/usr/lib/x86_64-linux-gnu -Wl,-rpath,/opt/openrobots/lib -ldynamic-graph -Wl,-rpath,/opt/openrobots/lib -Wl,-rpath,/usr/lib/x86_64-linux-gnu -Wl,-rpath,/opt/openrobots/lib -L/opt/openrobots/lib -Wl,-rpath,/opt/openrobots/lib -lpinocchio -Wl,-rpath,/usr/lib/x86_64-linux-gnu -lboost_filesystem -lboost_system -lurdfdom_sensor -lurdfdom_model_state -lurdfdom_model -lurdfdom_world -lconsole_bridge -Wl,-rpath,/opt/openrobots/lib -lhpp-fcl -lboost_thread -lboost_date_time -lboost_filesystem -lboost_system -loctomap -loctomath -lassimp -Wl,-rpath,/opt/openrobots/lib -Wl,-rpath,/usr/lib/x86_64-linux-gnu -Wl,-rpath,/opt/openrobots/lib -lsot-core -ldynamic-graph-python -ltsid -lpinocchio -lboost_filesystem -lboost_system -lurdfdom_sensor -lurdfdom_model_state -lurdfdom_model -lurdfdom_world -lconsole_bridge -lhpp-fcl -lboost_thread -lboost_date_time -lboost_filesystem -lboost_system -lurdfdom_sensor -lurdfdom_model_state -lurdfdom_model -lurdfdom_world -lconsole_bridge -lhpp-fcl -lboost_thread -lboost_date_time -loctomap -loctomath -lassimp -lboost_serialization -lboost_thread -lboost_filesystem -lboost_program_options -lboost_unit_test_framework -lboost_system -lboost_regex -lboost_chrono -lboost_date_time -lboost_atomic -lpthread -ldl -lpthread | cd /local/robotpkg/var/tmp/robotpkg/wip/py-sot-torque-control/work/sot-torque-control-1.0.0/src && /usr/bin/cmake -E cmake_symlink_library device-torque-ctrl.so.1.0.0 device-torque-ctrl.so.1.0.0 device-torque-ctrl.so | make[2]: Leaving directory '/local/robotpkg/var/tmp/robotpkg/wip/py-sot-torque-control/work/sot-torque-control-1.0.0' | [ 24%] Built target device-torque-ctrl | make[1]: Leaving directory '/local/robotpkg/var/tmp/robotpkg/wip/py-sot-torque-control/work/sot-torque-control-1.0.0' | make: *** [all] Error 2 | Makefile:165: recipe for target 'all' failed For details or bug reports, check the complete log file in: /local/robotpkg/var/tmp/robotpkg/wip/py-sot-torque-control/work/build.log make[3]: *** [do-build] Error 2 make[2]: *** [pkg-check-installed] Error 2 => Marking py27-sot-torque-control-1.0.0r3 as broken ERROR: make: *** [package] Error 2 ===> Logging bulk summary for py27-sot-torque-control-1.0.0r3 => Checking leftover files => Creating bulk log files => Logging bulk metadata ===> Cleaning temporary files for py27-sot-torque-control-1.0.0r3 ===> Done bulk for py27-sot-torque-control-1.0.0r3 [92%] Processing wip/py-sot-torque-control:py32-sot-torque-control-1.0.0r3 ===> Bulk building for py32-sot-torque-control-1.0.0r3 Binary package for py32-sot-torque-control-1.0.0r3 is up-to-date. [93%] Processing wip/py-sot-torque-control:py34-sot-torque-control-1.0.0r3 ===> Bulk building for py34-sot-torque-control-1.0.0r3 Binary package for py34-sot-torque-control-1.0.0r3 is up-to-date. [93%] Processing wip/py-sot-torque-control:py35-sot-torque-control-1.0.0r3 ===> Bulk building for py35-sot-torque-control-1.0.0r3 Binary package for py35-sot-torque-control-1.0.0r3 is up-to-date. [94%] Processing wip/py-sot-torque-control:py36-sot-torque-control-1.0.0r3 ===> Bulk building for py36-sot-torque-control-1.0.0r3 Binary package for py36-sot-torque-control-1.0.0r3 is up-to-date. [94%] Processing wip/py-sot-tools-v3:py27-sot-tools-v3-2.0.3 ===> Bulk building for py27-sot-tools-v3-2.0.3 Binary package for py27-sot-tools-v3-2.0.3 is up-to-date. [94%] Processing wip/sot-dynamic-pinocchio-v3:sot-dynamic-pinocchio-v3-3.1.8 ===> Bulk building for sot-dynamic-pinocchio-v3-3.1.8 Binary package for sot-dynamic-pinocchio-v3-3.1.8 is up-to-date. [95%] Processing wip/sot-application-v3:sot-application-v3-1.1.3r1 ===> Cleaning temporary files for sot-application-v3-1.1.3r1 ===> Bulk building for sot-application-v3-1.1.3r1 => Checking for clear installation => Installing /opt/robotpkg/var/lib/robotpkg/packages/bsd/Ubuntu-18.04-x86_64/All/digest-20080510.tgz => Installing /opt/robotpkg/var/lib/robotpkg/packages/bsd/Ubuntu-18.04-x86_64/All/tnftp-20130505~ssl.tgz => Required robotpkg package digest>=20080510: digest-20080510 found => Required robotpkg package tnftp>=20091122: tnftp-20130505~ssl found => Required system package gnupg>=1: gnupg-2.2.4 found => Required system package gzip: gzip-1.6 found => Required system package pax and tar archivers: pax found => Required system package pkg_install>=20110805.9: pkg_install-20110805.9 found => Required system package pkgrepo2deb>=1.3: pkgrepo2deb-1.3 found => Dependency digest-20080510 already installed => Installing /opt/robotpkg/var/lib/robotpkg/wip/packages/bsd/Ubuntu-18.04-x86_64/All/sot-dynamic-pinocchio-v3-3.1.8.tgz ERROR: Required robotpkg package sot-dyninv-v3>=3.0.0: BROKEN => Dependency tnftp-20130505~ssl already installed ===> Logging bulk summary for sot-application-v3-1.1.3r1 => Checking leftover files => Creating bulk log files => Logging bulk metadata ===> Cleaning temporary files for sot-application-v3-1.1.3r1 ===> Done bulk for sot-application-v3-1.1.3r1 [95%] Processing wip/dynamic-graph-bridge-v3:dynamic-graph-bridge-v3-3.0.10r3 ===> Bulk building for dynamic-graph-bridge-v3-3.0.10r3 Binary package for dynamic-graph-bridge-v3-3.0.10r3 is up-to-date. [96%] Processing wip/sot-pattern-generator-v3:sot-pattern-generator-v3-3.0.1 ===> Cleaning temporary files for sot-pattern-generator-v3-3.0.1 ===> Bulk building for sot-pattern-generator-v3-3.0.1 => Checking for clear installation => Installing /opt/robotpkg/var/lib/robotpkg/packages/bsd/Ubuntu-18.04-x86_64/All/digest-20080510.tgz => Installing /opt/robotpkg/var/lib/robotpkg/packages/bsd/Ubuntu-18.04-x86_64/All/tnftp-20130505~ssl.tgz => Required robotpkg package digest>=20080510: digest-20080510 found => Required robotpkg package tnftp>=20091122: tnftp-20130505~ssl found => Required system package gnupg>=1: gnupg-2.2.4 found => Required system package gzip: gzip-1.6 found => Required system package pax and tar archivers: pax found => Required system package pkg_install>=20110805.9: pkg_install-20110805.9 found => Required system package pkgrepo2deb>=1.3: pkgrepo2deb-1.3 found => Dependency digest-20080510 already installed => Installing /opt/robotpkg/var/lib/robotpkg/packages/bsd/Ubuntu-18.04-x86_64/All/hpp-fcl-0.6.0.tgz => Installing /opt/robotpkg/var/lib/robotpkg/wip/packages/bsd/Ubuntu-18.04-x86_64/All/jrl-walkgen-v3-4.0.2r2.tgz => Dependency pinocchio-1.2.9r1 already installed ERROR: Required robotpkg package sot-application-v3>=1.1.0: BROKEN => Installing /opt/robotpkg/var/lib/robotpkg/wip/packages/bsd/Ubuntu-18.04-x86_64/All/sot-core-v3-3.1.9r1.tgz => Dependency tnftp-20130505~ssl already installed => Dependency urdfdom-0.3.0r2 already installed ===> Logging bulk summary for sot-pattern-generator-v3-3.0.1 => Checking leftover files => Creating bulk log files => Logging bulk metadata ===> Cleaning temporary files for sot-pattern-generator-v3-3.0.1 ===> Done bulk for sot-pattern-generator-v3-3.0.1 [96%] Processing wip/sot-talos:sot-talos-0.0.6 ===> Cleaning temporary files for sot-talos-0.0.6 ===> Bulk building for sot-talos-0.0.6 => Checking for clear installation => Installing /opt/robotpkg/var/lib/robotpkg/packages/bsd/Ubuntu-18.04-x86_64/All/digest-20080510.tgz => Installing /opt/robotpkg/var/lib/robotpkg/packages/bsd/Ubuntu-18.04-x86_64/All/tnftp-20130505~ssl.tgz => Required robotpkg package digest>=20080510: digest-20080510 found => Required robotpkg package tnftp>=20130505~ssl: tnftp-20130505~ssl found => Required system package gnupg>=1: gnupg-2.2.4 found => Required system package gzip: gzip-1.6 found => Required system package pax and tar archivers: pax found => Required system package pkg_install>=20110805.9: pkg_install-20110805.9 found => Required system package pkgrepo2deb>=1.3: pkgrepo2deb-1.3 found => Dependency digest-20080510 already installed => Installing /opt/robotpkg/var/lib/robotpkg/packages/bsd/Ubuntu-18.04-x86_64/All/dynamic-graph-bridge-msgs-0.2.0.tgz => Installing /opt/robotpkg/var/lib/robotpkg/wip/packages/bsd/Ubuntu-18.04-x86_64/All/dynamic-graph-bridge-v3-3.0.10r3.tgz => Dependency dynamic-graph-v3-3.0.1 already installed => Dependency py27-dynamic-graph-v3-3.0.2 already installed => Dependency py27-sot-tools-v3-2.0.3 already installed ERROR: Required robotpkg package sot-application-v3>=1.1.0: BROKEN => Dependency sot-core-v3-3.1.9r1 already installed => Dependency sot-dynamic-pinocchio-v3-3.1.8 already installed ERROR: Required robotpkg package sot-dyninv-v3>=3.0.0: BROKEN => Installing /opt/robotpkg/var/lib/robotpkg/wip/packages/bsd/Ubuntu-18.04-x86_64/All/talos-data-0.0.17r5.tgz => Dependency tnftp-20130505~ssl already installed ===> Logging bulk summary for sot-talos-0.0.6 => Checking leftover files => Creating bulk log files => Logging bulk metadata ===> Cleaning temporary files for sot-talos-0.0.6 ===> Done bulk for sot-talos-0.0.6 [97%] Processing wip/sot-hrp2-v3:sot-hrp2-v3-2.1.0 ===> Bulk building for sot-hrp2-v3-2.1.0 Binary package for sot-hrp2-v3-2.1.0 is up-to-date. [97%] Processing wip/talos-metapkg-ros-control-sot:talos-metapkg-ros-control-sot-0.0.11 ===> Cleaning temporary files for talos-metapkg-ros-control-sot-0.0.11 ===> Bulk building for talos-metapkg-ros-control-sot-0.0.11 => Checking for clear installation => Installing /opt/robotpkg/var/lib/robotpkg/packages/bsd/Ubuntu-18.04-x86_64/All/digest-20080510.tgz => Installing /opt/robotpkg/var/lib/robotpkg/packages/bsd/Ubuntu-18.04-x86_64/All/tnftp-20130505~ssl.tgz => Required robotpkg package digest>=20080510: digest-20080510 found => Required robotpkg package tnftp>=20130505~ssl: tnftp-20130505~ssl found => Required system package gnupg>=1: gnupg-2.2.4 found => Required system package gzip: gzip-1.6 found => Required system package pax and tar archivers: pax found => Required system package pkg_install>=20110805.9: pkg_install-20110805.9 found => Required system package pkgrepo2deb>=1.3: pkgrepo2deb-1.3 found => Dependency digest-20080510 already installed => Installing /opt/robotpkg/var/lib/robotpkg/wip/packages/bsd/Ubuntu-18.04-x86_64/All/dynamic-graph-bridge-v3-3.0.10r3.tgz => Required robotpkg package pal-hardware-interfaces>=0.0.3: N/A => Required robotpkg package prf-ros-controllers>=0.2.8: N/A => Required system package ros-actionlib>=1.11<1.12: MISSING => Required system package ros-catkin>=0.6<0.7: MISSING => Required system package ros-comm>=1.11<1.12: MISSING => Required system package ros-common-msgs>=1.11<1.12: MISSING => Required system package ros-control-toolbox>=1.13<1.15: MISSING => Required system package ros-genmsg>=0.5<0.6: MISSING => Required system package ros-geometry>=1.11<1.12: MISSING => Required system package ros-message-generation>=0.2<0.3: MISSING => Required system package ros-message-runtime>=0.4<0.5 : MISSING => Required system package ros-pluginlib>=1.10<1.11: MISSING => Required system package ros-robot-model>=1.11<1.12: MISSING => Required system package ros-ros>=1.11<1.12: MISSING => Required system package ros-std-msgs>=0.5 : MISSING => Dependency tnftp-20130505~ssl already installed ERROR: ====================================================================== ERROR: Missing system packages required for talos-metapkg-ros-control-sot-0.0.11: ERROR: ERROR: ros-actionlib>=1.11<1.12 (Ubuntu package ros-indigo-actionlib) ERROR: ros-catkin>=0.6<0.7 (Ubuntu package ros-indigo-catkin) ERROR: ros-comm>=1.11<1.12 (Ubuntu package ros-indigo-comm) ERROR: ros-common-msgs>=1.11<1.12 (Ubuntu package ros-indigo-common-msgs) ERROR: ros-control-toolbox>=1.13<1.15 (Ubuntu package ros-indigo-control-toolbox) ERROR: ros-genmsg>=0.5<0.6 (Ubuntu package ros-indigo-genmsg) ERROR: ros-geometry>=1.11<1.12 (Ubuntu package ros-indigo-geometry) ERROR: ros-message-generation>=0.2<0.3 (Ubuntu package ros-indigo-message-generation) ERROR: ros-message-runtime>=0.4<0.5 (Ubuntu package ros-indigo-message-runtime) ERROR: ros-pluginlib>=1.10<1.11 (Ubuntu package ros-indigo-pluginlib) ERROR: ros-robot-model>=1.11<1.12 (Ubuntu package ros-indigo-robot-model) ERROR: ros-ros>=1.11<1.12 (Ubuntu package ros-indigo-ros) ERROR: ros-std-msgs>=0.5 (Ubuntu package ros-indigo-std-msgs) ERROR: ERROR: Please use the system package management tool to install these ERROR: dependencies. If a robotpkg version of a dependency is available, ERROR: you can configure robotpkg.conf to use this version instead. ERROR: ERROR: See /local/robotpkg/var/tmp/robotpkg/wip/talos-metapkg-ros-control-sot/work/sysdep.log for details. ERROR: ====================================================================== make[2]: *** [sys-depends] Error 2 ===> Logging bulk summary for talos-metapkg-ros-control-sot-0.0.11 => Checking leftover files => Creating bulk log files => Logging bulk metadata ===> Cleaning temporary files for talos-metapkg-ros-control-sot-0.0.11 ===> Done bulk for talos-metapkg-ros-control-sot-0.0.11 [97%] Processing wip/openhrp3-hrp2:openhrp3-hrp2-1.2.0 ===> Cleaning temporary files for openhrp3-hrp2-1.2.0 ===> Bulk building for openhrp3-hrp2-1.2.0 => Checking for clear installation => Installing /opt/robotpkg/var/lib/robotpkg/packages/bsd/Ubuntu-18.04-x86_64/All/digest-20080510.tgz => Installing /opt/robotpkg/var/lib/robotpkg/packages/bsd/Ubuntu-18.04-x86_64/All/tnftp-20130505~ssl.tgz => Required robotpkg package digest>=20080510: digest-20080510 found => Required robotpkg package tnftp>=20091122: tnftp-20130505~ssl found => Required system package gnupg>=1: gnupg-2.2.4 found => Required system package gzip: gzip-1.6 found => Required system package pax and tar archivers: pax found => Required system package pkg_install>=20110805.9: pkg_install-20110805.9 found => Required system package pkgrepo2deb>=1.3: pkgrepo2deb-1.3 found => Dependency digest-20080510 already installed => Installing /opt/robotpkg/var/lib/robotpkg/wip/packages/bsd/Ubuntu-18.04-x86_64/All/dynamic-graph-bridge-v3-3.0.10r3.tgz => Installing /opt/robotpkg/var/lib/robotpkg/packages/bsd/Ubuntu-18.04-x86_64/All/hrp2-14-1.9.3.tgz ERROR: Required robotpkg package openhrp3-simulator-wo-rtm>=1.0.0: BROKEN => Installing /opt/robotpkg/var/lib/robotpkg/wip/packages/bsd/Ubuntu-18.04-x86_64/All/sot-hrp2-v3-2.1.0.tgz => Dependency tnftp-20130505~ssl already installed => Dependency urdfdom-0.3.0r2 already installed ===> Logging bulk summary for openhrp3-hrp2-1.2.0 => Checking leftover files => Creating bulk log files => Logging bulk metadata ===> Cleaning temporary files for openhrp3-hrp2-1.2.0 ===> Done bulk for openhrp3-hrp2-1.2.0 [98%] Processing wip/roscontrol-sot:roscontrol-sot-0.0.3 ===> Cleaning temporary files for roscontrol-sot-0.0.3 ===> Bulk building for roscontrol-sot-0.0.3 => Checking for clear installation => Installing /opt/robotpkg/var/lib/robotpkg/packages/bsd/Ubuntu-18.04-x86_64/All/digest-20080510.tgz => Installing /opt/robotpkg/var/lib/robotpkg/packages/bsd/Ubuntu-18.04-x86_64/All/tnftp-20130505~ssl.tgz => Required robotpkg package digest>=20080510: digest-20080510 found => Required robotpkg package tnftp>=20130505~ssl: tnftp-20130505~ssl found => Required system package gnupg>=1: gnupg-2.2.4 found => Required system package gzip: gzip-1.6 found => Required system package pax and tar archivers: pax found => Required system package pkg_install>=20110805.9: pkg_install-20110805.9 found => Required system package pkgrepo2deb>=1.3: pkgrepo2deb-1.3 found => Dependency digest-20080510 already installed => Installing /opt/robotpkg/var/lib/robotpkg/packages/bsd/Ubuntu-18.04-x86_64/All/dynamic-graph-bridge-msgs-0.2.0.tgz => Installing /opt/robotpkg/var/lib/robotpkg/wip/packages/bsd/Ubuntu-18.04-x86_64/All/dynamic-graph-bridge-v3-3.0.10r3.tgz => Dependency dynamic-graph-v3-3.0.1 already installed => Required robotpkg package pal-hardware-interfaces>=0.0.3: N/A => Required robotpkg package prf-ros-control>=0.2: N/A => Dependency py27-dynamic-graph-v3-3.0.2 already installed => Dependency sot-core-v3-3.1.9r1 already installed => Dependency sot-dynamic-pinocchio-v3-3.1.8 already installed => Dependency tnftp-20130505~ssl already installed ===> Logging bulk summary for roscontrol-sot-0.0.3 => Checking leftover files => Creating bulk log files => Logging bulk metadata ===> Cleaning temporary files for roscontrol-sot-0.0.3 ===> Done bulk for roscontrol-sot-0.0.3 [98%] Processing wip/talos-dev:talos-dev-20171009 ===> Cleaning temporary files for talos-dev-20171009 ===> Bulk building for talos-dev-20171009 => Checking for clear installation => Required system package gnupg>=1: gnupg-2.2.4 found => Required system package gzip: gzip-1.6 found => Required system package pkg_install>=20110805.9: pkg_install-20110805.9 found => Required system package pkgrepo2deb>=1.3: pkgrepo2deb-1.3 found => Required robotpkg package prf-gazebo-ros-pkgs>=2.6.5: N/A ERROR: Required robotpkg package sot-talos>=0.0.1: BROKEN => Required robotpkg package talos-metapkg-ros-control-sot>=0.0.1: N/A => Required robotpkg package talos-simulation>=0.0.13: N/A ===> Logging bulk summary for talos-dev-20171009 => Checking leftover files => Creating bulk log files => Logging bulk metadata ===> Cleaning temporary files for talos-dev-20171009 ===> Done bulk for talos-dev-20171009 [99%] Processing wip/sot-romeo-v3:sot-romeo-v3-2.0.1 ===> Cleaning temporary files for sot-romeo-v3-2.0.1 ===> Bulk building for sot-romeo-v3-2.0.1 => Checking for clear installation => Installing /opt/robotpkg/var/lib/robotpkg/packages/bsd/Ubuntu-18.04-x86_64/All/digest-20080510.tgz => Installing /opt/robotpkg/var/lib/robotpkg/packages/bsd/Ubuntu-18.04-x86_64/All/tnftp-20130505~ssl.tgz => Required robotpkg package digest>=20080510: digest-20080510 found => Required robotpkg package tnftp>=20091122: tnftp-20130505~ssl found => Required system package gnupg>=1: gnupg-2.2.4 found => Required system package gzip: gzip-1.6 found => Required system package pax and tar archivers: pax found => Required system package pkg_install>=20110805.9: pkg_install-20110805.9 found => Required system package pkgrepo2deb>=1.3: pkgrepo2deb-1.3 found => Dependency digest-20080510 already installed => Installing /opt/robotpkg/var/lib/robotpkg/packages/bsd/Ubuntu-18.04-x86_64/All/dynamic-graph-bridge-msgs-0.2.0.tgz => Installing /opt/robotpkg/var/lib/robotpkg/wip/packages/bsd/Ubuntu-18.04-x86_64/All/dynamic-graph-bridge-v3-3.0.10r3.tgz => Dependency dynamic-graph-v3-3.0.1 already installed => Dependency py27-dynamic-graph-v3-3.0.2 already installed => Dependency py27-sot-tools-v3-2.0.3 already installed => Dependency sot-core-v3-3.1.9r1 already installed => Dependency sot-dynamic-pinocchio-v3-3.1.8 already installed => Dependency tnftp-20130505~ssl already installed => Building with no option. => Use the GNU C++ compiler: c++-compiler provided by g++>=3 => Use the GNU C compiler: c-compiler provided by gcc>=3 => Use python-2.7: python>=2.5<3.7 provided by python27>=2.7<2.8 => Use ros melodic: ros>=groovy provided by ros-melodic => Required system package boost-headers>=1.34.1: boost-headers-1.65.1 found => Required system package boostlib-filesystem>=1.34.1: boost-libs-1.65.1 found => Required system package boostlib-iostreams>=1.34.1: boost-libs-1.65.1 found => Required system package boostlib-math>=1.34.1: boost-libs-1.65.1 found => Required system package boostlib-thread>=1.34.1: boost-libs-1.65.1 found => Required system package cmake>=2.6: cmake-3.10.2 found => Required system package console-bridge>=0.1: console-bridge-0.4.0 found => Required system package doxygen>=1.5: doxygen-1.8.13 found => Required system package g++>=3: g++-7 found => Required system package gcc>=3: gcc-7 found => Required system package graphviz>=2: graphviz-2.40.1 found => Required system package libstdc++: libstdc++ found => Required system package pdflatex: pdflatex found => Required system package pkg-config>=0.22: pkg-config-0.29.1 found => Required system package python27>=2.7<2.8: python27-2.7.151 found => Required system package ros-comm>=1.13<1.15: ros-comm-1.14.2 found => Required system package ros-message-runtime>=0.4<0.5 : ros-message-runtime-0.4.12 found => Required system package ros-rospack>=2.5<2.6: ros-rospack-2.5.1 found => Required system package ros-std-msgs>=0.5 : ros-std-msgs-0.5.11 found => Required robotpkg package dynamic-graph-bridge-msgs>=0.2.0: dynamic-graph-bridge-msgs-0.2.0 found => Required robotpkg package dynamic-graph-bridge-v3>=3.0.0: dynamic-graph-bridge-v3-3.0.10r3 found => Required robotpkg package dynamic-graph-v3>=3.0.0: dynamic-graph-v3-3.0.1 found => Required robotpkg package py27-dynamic-graph-v3>=3.0: py27-dynamic-graph-v3-3.0.2 found => Required robotpkg package py27-sot-tools-v3>=2.0: py27-sot-tools-v3-2.0.3 found => Required robotpkg package sot-core-v3>=3.0.0: sot-core-v3-3.1.9r1 found => Required robotpkg package sot-dynamic-pinocchio-v3>=3.1.1: sot-dynamic-pinocchio-v3-3.1.8 found => SHA1 checksums OK => RMD160 checksums OK An unexpected error occured. The last 10 log lines are shown below. | ^~~~~~~~~~~~~~~~ | src/CMakeFiles/sot-romeo-controller.dir/build.make:65: recipe for target 'src/CMakeFiles/sot-romeo-controller.dir/sot-romeo-controller.cpp.o' failed | make[2]: *** [src/CMakeFiles/sot-romeo-controller.dir/sot-romeo-controller.cpp.o] Error 1 | make[2]: *** Waiting for unfinished jobs.... | make[1]: *** [src/CMakeFiles/sot-romeo-controller.dir/all] Error 2 | make: *** [all] Error 2 | make[2]: Leaving directory '/local/robotpkg/var/tmp/robotpkg/wip/sot-romeo-v3/work/sot-romeo-v3-2.0.1' | CMakeFiles/Makefile2:586: recipe for target 'src/CMakeFiles/sot-romeo-controller.dir/all' failed | make[1]: Leaving directory '/local/robotpkg/var/tmp/robotpkg/wip/sot-romeo-v3/work/sot-romeo-v3-2.0.1' | Makefile:165: recipe for target 'all' failed For details or bug reports, check the complete log file in: /local/robotpkg/var/tmp/robotpkg/wip/sot-romeo-v3/work/build.log make[3]: *** [do-build] Error 2 make[2]: *** [pkg-check-installed] Error 2 => Marking sot-romeo-v3-2.0.1 as broken ERROR: make: *** [package] Error 2 ===> Logging bulk summary for sot-romeo-v3-2.0.1 => Checking leftover files => Creating bulk log files => Logging bulk metadata ===> Cleaning temporary files for sot-romeo-v3-2.0.1 ===> Done bulk for sot-romeo-v3-2.0.1 [99%] Processing wip/hrp2-dev:hrp2-dev-20171009 ===> Cleaning temporary files for hrp2-dev-20171009 ===> Bulk building for hrp2-dev-20171009 => Checking for clear installation => Required system package gnupg>=1: gnupg-2.2.4 found => Required system package gzip: gzip-1.6 found => Required system package pkg_install>=20110805.9: pkg_install-20110805.9 found => Required system package pkgrepo2deb>=1.3: pkgrepo2deb-1.3 found => Installing /opt/robotpkg/var/lib/robotpkg/wip/packages/bsd/Ubuntu-18.04-x86_64/All/hrp2-14-description-1.0.5.tgz ERROR: Required robotpkg package openhrp3-hrp2>=1.0.0: BROKEN ===> Logging bulk summary for hrp2-dev-20171009 => Checking leftover files => Creating bulk log files => Logging bulk metadata ===> Cleaning temporary files for hrp2-dev-20171009 ===> Done bulk for hrp2-dev-20171009 ===> Done bulk for rbulk wip set 1468.11user 204.92system 19:26.69elapsed 143%CPU (0avgtext+0avgdata 2000688maxresident)k 1845344inputs+7292760outputs (1681major+35220007minor)pagefaults 0swaps --- Updating bulk database --------------------------------------- Collecting session logs in /local/robotpkg/var/log/bulk updated roscontrol-sot-0.0.3 updated spark-genom-3.9~mightability+openprs+tcl+tclserv_client updated sot-dyninv-2.0.0r1 updated pal-gazebo-worlds-2.0.8r2 updated prf-roboticsgroup-gazebo-plugins-0.1.0 updated libmove3d-planners-1.4.0 updated hyper-genom-plugin-0.12 updated py36-rqt-dynamic-graph-1.0.0 updated talos-dev-20171009 updated hyper-viewer-0.1r1 updated head-action-0.0.1r3 updated libfreenect-20110118.2ea3ebr1 updated infuse-asn1-conversions-0.2 updated ros-swri-string-util-2.3.0 updated sot-pattern-generator-v3-3.0.1 updated soth-2.0.2 updated sot-dyninv-v3-3.0.0r1 updated pal-msgs-0.11.3 updated orocos-dot_service-20120308 updated py27-sot-torque-control-1.0.0r3 updated sot-hrprtc-hrp2-1.2.2 updated py36-hla-1.1.1r1 updated mhp-genom-3.15~openprs+pr2+spark+tcl+tclserv_client updated py36-mavlink-1.1.62 updated libmove3d-3.22.0r1 updated libmove3d-hri-2.24 updated talos-moveit-config-0.2.6r1 updated orocos-yarp_transport-20150316~doc updated morse-mavlink-1.4 updated pal-transmissions-0.2.2r2 updated move3d-studio-1.4r3~qtstudio updated pal-gazebo-plugins-1.1.7 updated prf-ros-control-0.2.6r3 updated pal-hardware-gazebo-0.1.1r2 updated sot-talos-0.0.6 updated certi-3.5.1 updated atlaas-genom-0.1.6~openprs+tcl+tclserv_client updated infuse-envire-0.1 updated hrp2-dev-20171009 updated chilitags-1.3.1 updated sot-hrp2-1.1.2 updated hri-simulationr1 updated talos-simulation-0.1.4r2 updated infuse-novatel-gps-driver-ros-0.1.0 updated morse-ros-1.4 updated backward-ros-0.1.4r3 updated tiago-robot-0.0.35os1 updated talos-robot-1.0.2 updated py36-jsbsim-20150424r1 updated sot-romeo-v3-2.0.1 updated mraa-1.9.0 updated sot-application-v3-1.1.3r1 updated hyper-0.13r1 updated dynamic-introspection-1.0.5 updated pal-hardware-interfaces-0.0.3 updated morse-hla-1.4 updated openhrp3-simulator-wo-rtm-1.2.0 updated py27-jsbsim-20150424r1 updated infuse-asn1-types-0.2 updated ur5-description-1.0.1 updated prf-ros-controllers-0.3.5r3 updated py27-hla-1.1.1r1 updated octoviz-1.6.1 updated metapod-1.0.10 updated openhrp3-hrp2-1.2.0 updated prf-gazebo-ros-pkgs-2.6.7r4 updated sot-torque-control-1.0.0r3 updated talos-metapkg-ros-control-sot-0.0.11 updated play-motion-0.4.5 processed 69 packages