robotpkg/sysutils/arduio-genom3 bulk build results

Log for arduio-genom3-1.2~codels+openprs+ros-client-c+ros-client-ros+ros-server on NetBSD-7.0.1-x86_64: build.log (Back)

--- Environment --- _overrides_supervision_transgen3_PKGREQD=transgen3>=1.0b2 transgen3>=1.0b2 transgen3>=1.0b2 _override_vars_pkgtools_pkg_config=PKGREQD PKGREQD PKGREQD PYTHON=/usr/pkg/bin/python2.7 _overrides_architecture_genom3_ros_PKGREQD=genom3-ros>=1.18 genom3-ros>=1.18 genom3-ros>=1.18 LC_MONETARY=C _overrides_devel_boost_headers_PKGREQD=boost-headers>=1.34.1 boost-headers>=1.34.1 boost-headers>=1.34.1 _override_vars_architecture_genom3=PKGREQD PKGREQD PKGREQD _overrides_pkgtools_pkg_install_PKGREQD=pkg_install>=20110805.7 pkg_install>=20110805.7 pkg_install>=20110805.7 CXX=/usr/bin/g++ ROS_PACKAGE_PATH=/opt/openrobots PAX=/bin/pax MFLAGS=--no-print-directory OS_KERNEL_VERSION=7.0.1 MAKEFLAGS= --no-print-directory -- PKGREQD.cmdline=arduio-genom3-1.2~codels+openprs+ros-client-c+ros-client-ros+ros-server+!* RECURSIVE_PKGPATH=sysutils/arduio-genom3\ tag=NetBSD-7.0.1-x86_64 BULK_LOGDIR=/local/robotpkg/var/log/bulk BULKBASE=/opt/openrobots LOCALBASE=/opt/openrobots PKG_DBDIR=/opt/openrobots/var/db/robotpkg EXPECT_TARGETS=fetch\ install\ package MAKEOVERRIDES=PKGREQD.cmdline=arduio-genom3-1.2~codels+openprs+ros-client-c+ros-client-ros+ros-server+!* RECURSIVE_PKGPATH=sysutils/arduio-genom3\ tag=NetBSD-7.0.1-x86_64 BULK_LOGDIR=/local/robotpkg/var/log/bulk BULKBASE=/opt/openrobots LOCALBASE=/opt/openrobots PKG_DBDIR=/opt/openrobots/var/db/robotpkg EXPECT_TARGETS=fetch\ install\ package TAR=/usr/bin/tar GXX=/usr/bin/g++ BULK_LOGDIR=/local/robotpkg/var/log/bulk PWD=/local/robotpkg/var/lib/robotpkg/sysutils/arduio-genom3 LANG=C GZIP_CMD=/usr/bin/gzip _override_vars_supervision_genom3_openprs=PKGREQD PKGREQD PKGREQD HOME=/ _override_vars_devel_boost_headers=PKGREQD PKGREQD PKGREQD _overrides_devel_ros_ros_PKGREQD=ros-ros>=1.11<1.12 ros-ros>=1.11<1.12 ros-ros>=1.11<1.12 PATH=/sbin:/bin:/usr/sbin:/usr/bin CXXCPP=/usr/bin/g++ -E _overrides_sysutils_ros_rospack_PKGREQD=ros-rospack>=2.2<2.3 ros-rospack>=2.2<2.3 ros-rospack>=2.2<2.3 LC_MESSAGES=C _overrides_archivers_pax_PKGREQD=pax pax PYTHON27_INCLUDE=/usr/pkg/include/python2.7/ _overrides_middleware_ros_actionlib_PKGREQD=ros-actionlib>=1.11<1.12 ros-actionlib>=1.11<1.12 ros-actionlib>=1.11<1.12 _override_vars_pkgtools_pkg_install=PKGREQD PKGREQD PKGREQD MAKELEVEL=4 _override_vars_pkgtools_tnftp=PKGREQD PKGREQD AUTOM4TE=/usr/pkg/bin/autom4te LOWER_OS_VERSION=7.0.1 hline="$bf======================================================================$rm" ZCAT=/usr/bin/zcat MACHINE_PLATFORM=NetBSD-7.0.1-x86_64 AUTORECONF=/usr/pkg/bin/autoreconf LIBTOOL=/usr/pkg/bin/libtool _override_vars_pkgtools_digest=PKGREQD PKGREQD PKGREQD AUTOCONF=/usr/pkg/bin/autoconf LC_NUMERIC=C _override_vars_architecture_genom3_ros=PKGREQD PKGREQD PKGREQD PYTHON27=/usr/pkg/bin/python2.7 AUTOMAKE=/usr/pkg/bin/automake OLDPWD=/local/robotpkg/var/lib/robotpkg/sysutils/arduio-genom3 CC=/usr/bin/gcc FC=false _overrides_architecture_genom3_PKGREQD=genom3>=2.99.30 genom3>=2.99.30 genom3>=2.99.30 _overrides_pkgtools_tnftp_PKGREQD=tnftp>=20091122 tnftp>=20091122 PKG_CONFIG=/usr/pkg/bin/pkg-config _overrides_sysutils_arduio_genom3_PKGREQD=arduio-genom3-1.2~codels+openprs+ros-client-c+ros-client-ros+ros-server+!* PYTHON_INCLUDE_CONFIG=/usr/pkg/include/python2.7/ tag=NetBSD-7.0.1-x86_64 OS_KERNEL=NetBSD ROBOTPKG_TRUSTED_ENV=robotpkg LC_CTYPE=C PYTHON27_LIB=/usr/pkg/lib/libpython2.7.so _override_vars_devel_boost_libs=PKGREQD PKGREQD PKGREQD PYTHONPATH=/opt/openrobots/lib/python2.7/site-packages _ROBOTPKG_NOW=0119142039 LOWER_ARCH=x86_64 _override_vars_sysutils_arduio_genom3=PKGREQD OWNER_GID=robots ROBOTPKG_BASE=/local/robotpkg _overrides_devel_boost_libs_PKGREQD=boost-libs>=1.34.1 boost-libs>=1.34.1 boost-libs>=1.34.1 NODENAME=fluffy64-netbsd7 bf= DIGEST=/opt/openrobots/sbin/robotpkg_digest ECHO_N=echo -n _override_vars_supervision_transgen3=PKGREQD PKGREQD PKGREQD OS_VERSION=7.0.1 EXPECT_TARGETS=fetch install package _override_vars_pkgtools_libtool=PKGREQD PKGREQD PKGREQD LC_COLLATE=C PYTHON_INCLUDE=/usr/pkg/include/python2.7/ rm= _overrides_pkgtools_digest_PKGREQD=digest>=20080510 digest>=20080510 digest>=20080510 OWNER_UID=rbulk _override_vars_middleware_ros_comm=PKGREQD PKGREQD PKGREQD ACLOCAL=/usr/pkg/bin/aclocal _override_vars_supervision_openprs=PKGREQD PKGREQD PKGREQD LIBTOOLIZE=/usr/pkg/bin/libtoolize _overrides_supervision_openprs_PKGREQD=openprs>=1.1b7 openprs>=1.1b7 openprs>=1.1b7 RECURSIVE_PKGPATH=sysutils/arduio-genom3 _overrides_pkgtools_libtool_PKGREQD=libtool>=1.5.22 libtool>=1.5.22 libtool>=1.5.22 GENOM3=/opt/openrobots/bin/genom3 MACHINE_ARCH=x86_64 _overrides_middleware_ros_comm_PKGREQD=ros-comm>=1.11<1.12 ros-comm>=1.11<1.12 ros-comm>=1.11<1.12 ROBOTPKG_DIR=/local/robotpkg/var/lib/robotpkg _overrides_supervision_genom3_openprs_PKGREQD=genom3-openprs>=1.0 genom3-openprs>=1.0 genom3-openprs>=1.0 _override_vars_archivers_pax=PKGREQD PKGREQD PYTHON_LIB=/usr/pkg/lib/libpython2.7.so LOWER_OPSYS=netbsd LC_TIME=C _override_vars_interfaces_ros_common_msgs=PKGREQD PKGREQD PKGREQD TNFTP=/opt/openrobots/sbin/tnftp OPSYS=NetBSD LOCALBASE=/opt/openrobots LOWER_OS_KERNEL=netbsd PKGTOOLS_VERSION=20110805.7 BULKBASE=/opt/openrobots _override_vars_middleware_ros_actionlib=PKGREQD PKGREQD PKGREQD PKG_CONFIG_LIBDIR=/usr/lib/pkgconfig MACHINE_KERNEL=NetBSD-7.0.1-x86_64 _overrides_pkgtools_pkg_config_PKGREQD=pkg-config>=0.22 pkg-config>=0.22 pkg-config>=0.22 PKG_CONFIG_PATH=/local/robotpkg/var/tmp/robotpkg/sysutils/arduio-genom3/work/arduio-genom3-1.2:/local/robotpkg/var/tmp/robotpkg/sysutils/arduio-genom3/work/templates/ros/client/c:/local/robotpkg/var/tmp/robotpkg/sysutils/arduio-genom3/work/templates/ros/client/ros:/local/robotpkg/var/tmp/robotpkg/sysutils/arduio-genom3/work/templates/ros/server:/local/robotpkg/var/tmp/robotpkg/sysutils/arduio-genom3/work/templates/openprs/client:/opt/openrobots/lib/pkgconfig GCC=/usr/bin/gcc PKG_DBDIR=/opt/openrobots/var/db/robotpkg _overrides_interfaces_ros_common_msgs_PKGREQD=ros-common-msgs>=1.11<1.12 ros-common-msgs>=1.11<1.12 ros-common-msgs>=1.11<1.12 _override_vars_devel_ros_ros=PKGREQD PKGREQD PKGREQD MAKECONF=/opt/robotpkg/etc/robotpkg.conf _override_vars_sysutils_ros_rospack=PKGREQD PKGREQD PKGREQD CPP=/usr/bin/gcc -E --- Running set -e; \ cd /local/robotpkg/var/tmp/robotpkg/sysutils/arduio-genom3/work/arduio-genom3-1.2 && cd /local/robotpkg/var/tmp/robotpkg/sysutils/arduio-genom3/work/arduio-genom3-1.2 && /usr/bin/env MAKELEVEL= MAKEOVERRIDES= MAKEFLAGS= MFLAGS= 'CPPFLAGS=' 'CFLAGS=-pipe -O3 -DNDEBUG' 'LDFLAGS=' 'CXXFLAGS=-pipe -O3 -DNDEBUG' PREFIX='/opt/openrobots' HOME=/local/robotpkg/var/tmp/robotpkg/sysutils/arduio-genom3/work PATH='/opt/openrobots/bin:/opt/openrobots/sbin:/sbin:/bin:/usr/sbin:/usr/bin' LD_LIBRARY_PATH='' LOCALBASE=/opt/openrobots PKGMANDIR=man /usr/pkg/bin/gmake -j4 -f Makefile all; cd /local/robotpkg/var/tmp/robotpkg/sysutils/arduio-genom3/work/arduio-genom3-1.2 && cd /local/robotpkg/var/tmp/robotpkg/sysutils/arduio-genom3/work/templates/ros/client/c && /usr/bin/env MAKELEVEL= MAKEOVERRIDES= MAKEFLAGS= MFLAGS= 'CPPFLAGS=' 'CFLAGS=-pipe -O3 -DNDEBUG' 'LDFLAGS=' 'CXXFLAGS=-pipe -O3 -DNDEBUG' PREFIX='/opt/openrobots' HOME=/local/robotpkg/var/tmp/robotpkg/sysutils/arduio-genom3/work PATH='/opt/openrobots/bin:/opt/openrobots/sbin:/sbin:/bin:/usr/sbin:/usr/bin' LD_LIBRARY_PATH='' LOCALBASE=/opt/openrobots PKGMANDIR=man /usr/pkg/bin/gmake -j4 -f Makefile all; cd /local/robotpkg/var/tmp/robotpkg/sysutils/arduio-genom3/work/arduio-genom3-1.2 && cd /local/robotpkg/var/tmp/robotpkg/sysutils/arduio-genom3/work/templates/ros/client/ros && /usr/bin/env MAKELEVEL= MAKEOVERRIDES= MAKEFLAGS= MFLAGS= 'CPPFLAGS=' 'CFLAGS=-pipe -O3 -DNDEBUG' 'LDFLAGS=' 'CXXFLAGS=-pipe -O3 -DNDEBUG' PREFIX='/opt/openrobots' HOME=/local/robotpkg/var/tmp/robotpkg/sysutils/arduio-genom3/work PATH='/opt/openrobots/bin:/opt/openrobots/sbin:/sbin:/bin:/usr/sbin:/usr/bin' LD_LIBRARY_PATH='' LOCALBASE=/opt/openrobots PKGMANDIR=man /usr/pkg/bin/gmake -j4 -f Makefile all; cd /local/robotpkg/var/tmp/robotpkg/sysutils/arduio-genom3/work/arduio-genom3-1.2 && cd /local/robotpkg/var/tmp/robotpkg/sysutils/arduio-genom3/work/templates/ros/server && /usr/bin/env MAKELEVEL= MAKEOVERRIDES= MAKEFLAGS= MFLAGS= 'CPPFLAGS=' 'CFLAGS=-pipe -O3 -DNDEBUG' 'LDFLAGS=' 'CXXFLAGS=-pipe -O3 -DNDEBUG' PREFIX='/opt/openrobots' HOME=/local/robotpkg/var/tmp/robotpkg/sysutils/arduio-genom3/work PATH='/opt/openrobots/bin:/opt/openrobots/sbin:/sbin:/bin:/usr/sbin:/usr/bin' LD_LIBRARY_PATH='' LOCALBASE=/opt/openrobots PKGMANDIR=man /usr/pkg/bin/gmake -j4 -f Makefile all; cd /local/robotpkg/var/tmp/robotpkg/sysutils/arduio-genom3/work/arduio-genom3-1.2 && cd /local/robotpkg/var/tmp/robotpkg/sysutils/arduio-genom3/work/templates/openprs/client && /usr/bin/env MAKELEVEL= MAKEOVERRIDES= MAKEFLAGS= MFLAGS= 'CPPFLAGS=' 'CFLAGS=-pipe -O3 -DNDEBUG' 'LDFLAGS=' 'CXXFLAGS=-pipe -O3 -DNDEBUG' PREFIX='/opt/openrobots' HOME=/local/robotpkg/var/tmp/robotpkg/sysutils/arduio-genom3/work PATH='/opt/openrobots/bin:/opt/openrobots/sbin:/sbin:/bin:/usr/sbin:/usr/bin' LD_LIBRARY_PATH='' LOCALBASE=/opt/openrobots PKGMANDIR=man /usr/pkg/bin/gmake -j4 -f Makefile all; Making all in codels gmake[1]: Entering directory '/local/robotpkg/var/tmp/robotpkg/sysutils/arduio-genom3/work/arduio-genom3-1.2/codels' /usr/pkg/bin/gmake all-am gmake[2]: Entering directory '/local/robotpkg/var/tmp/robotpkg/sysutils/arduio-genom3/work/arduio-genom3-1.2/codels' /bin/sh ../libtool --tag=CC --mode=compile /usr/bin/gcc -DHAVE_CONFIG_H -I. -I../autoconf -I/opt/openrobots/include -pipe -O3 -DNDEBUG -MT libarduio_codels_la-arduio_codels.lo -MD -MP -MF .deps/libarduio_codels_la-arduio_codels.Tpo -c -o libarduio_codels_la-arduio_codels.lo `test -f 'arduio_codels.c' || echo './'`arduio_codels.c /bin/sh ../libtool --tag=CC --mode=compile /usr/bin/gcc -DHAVE_CONFIG_H -I. -I../autoconf -I/opt/openrobots/include -pipe -O3 -DNDEBUG -MT libarduio_codels_la-arduio_comm_codels.lo -MD -MP -MF .deps/libarduio_codels_la-arduio_comm_codels.Tpo -c -o libarduio_codels_la-arduio_comm_codels.lo `test -f 'arduio_comm_codels.c' || echo './'`arduio_comm_codels.c /bin/sh ../libtool --tag=CC --mode=compile /usr/bin/gcc -DHAVE_CONFIG_H -I. -I../autoconf -I/opt/openrobots/include -pipe -O3 -DNDEBUG -MT libarduio_codels_la-arduio_main_codels.lo -MD -MP -MF .deps/libarduio_codels_la-arduio_main_codels.Tpo -c -o libarduio_codels_la-arduio_main_codels.lo `test -f 'arduio_main_codels.c' || echo './'`arduio_main_codels.c /bin/sh ../libtool --tag=CC --mode=compile /usr/bin/gcc -DHAVE_CONFIG_H -I. -I../autoconf -I/opt/openrobots/include -pipe -O3 -DNDEBUG -MT libarduio_codels_la-tty.lo -MD -MP -MF .deps/libarduio_codels_la-tty.Tpo -c -o libarduio_codels_la-tty.lo `test -f 'tty.c' || echo './'`tty.c libtool: compile: /usr/bin/gcc -DHAVE_CONFIG_H -I. -I../autoconf -I/opt/openrobots/include -pipe -O3 -DNDEBUG -MT libarduio_codels_la-arduio_main_codels.lo -MD -MP -MF .deps/libarduio_codels_la-arduio_main_codels.Tpo -c arduio_main_codels.c -fPIC -DPIC -o .libs/libarduio_codels_la-arduio_main_codels.o libtool: compile: /usr/bin/gcc -DHAVE_CONFIG_H -I. -I../autoconf -I/opt/openrobots/include -pipe -O3 -DNDEBUG -MT libarduio_codels_la-arduio_comm_codels.lo -MD -MP -MF .deps/libarduio_codels_la-arduio_comm_codels.Tpo -c arduio_comm_codels.c -fPIC -DPIC -o .libs/libarduio_codels_la-arduio_comm_codels.o libtool: compile: /usr/bin/gcc -DHAVE_CONFIG_H -I. -I../autoconf -I/opt/openrobots/include -pipe -O3 -DNDEBUG -MT libarduio_codels_la-tty.lo -MD -MP -MF .deps/libarduio_codels_la-tty.Tpo -c tty.c -fPIC -DPIC -o .libs/libarduio_codels_la-tty.o libtool: compile: /usr/bin/gcc -DHAVE_CONFIG_H -I. -I../autoconf -I/opt/openrobots/include -pipe -O3 -DNDEBUG -MT libarduio_codels_la-arduio_codels.lo -MD -MP -MF .deps/libarduio_codels_la-arduio_codels.Tpo -c arduio_codels.c -fPIC -DPIC -o .libs/libarduio_codels_la-arduio_codels.o tty.c: In function 'ario_open_tty': tty.c:57:10: error: 'B2000000' undeclared (first use in this function) baud = B2000000; ^ tty.c:57:10: note: each undeclared identifier is reported only once for each function it appears in libtool: compile: /usr/bin/gcc -DHAVE_CONFIG_H -I. -I../autoconf -I/opt/openrobots/include -pipe -O3 -DNDEBUG -MT libarduio_codels_la-arduio_main_codels.lo -MD -MP -MF .deps/libarduio_codels_la-arduio_main_codels.Tpo -c arduio_main_codels.c -o libarduio_codels_la-arduio_main_codels.o >/dev/null 2>&1 gmake[2]: *** [libarduio_codels_la-tty.lo] Error 1 gmake[2]: *** Waiting for unfinished jobs.... Makefile:500: recipe for target 'libarduio_codels_la-tty.lo' failed libtool: compile: /usr/bin/gcc -DHAVE_CONFIG_H -I. -I../autoconf -I/opt/openrobots/include -pipe -O3 -DNDEBUG -MT libarduio_codels_la-arduio_codels.lo -MD -MP -MF .deps/libarduio_codels_la-arduio_codels.Tpo -c arduio_codels.c -o libarduio_codels_la-arduio_codels.o >/dev/null 2>&1 libtool: compile: /usr/bin/gcc -DHAVE_CONFIG_H -I. -I../autoconf -I/opt/openrobots/include -pipe -O3 -DNDEBUG -MT libarduio_codels_la-arduio_comm_codels.lo -MD -MP -MF .deps/libarduio_codels_la-arduio_comm_codels.Tpo -c arduio_comm_codels.c -o libarduio_codels_la-arduio_comm_codels.o >/dev/null 2>&1 mv -f .deps/libarduio_codels_la-arduio_main_codels.Tpo .deps/libarduio_codels_la-arduio_main_codels.Plo mv -f .deps/libarduio_codels_la-arduio_codels.Tpo .deps/libarduio_codels_la-arduio_codels.Plo mv -f .deps/libarduio_codels_la-arduio_comm_codels.Tpo .deps/libarduio_codels_la-arduio_comm_codels.Plo gmake[2]: Leaving directory '/local/robotpkg/var/tmp/robotpkg/sysutils/arduio-genom3/work/arduio-genom3-1.2/codels' gmake[1]: *** [all] Error 2 gmake: *** [all-recursive] Error 1 Makefile:374: recipe for target 'all' failed gmake[1]: Leaving directory '/local/robotpkg/var/tmp/robotpkg/sysutils/arduio-genom3/work/arduio-genom3-1.2/codels' Makefile:557: recipe for target 'all-recursive' failed