robotpkg/sysutils/arduio-genom3 bulk build results

Log for arduio-genom3-1.2~codels+openprs+pocolibs-client-c+pocolibs-server on NetBSD-7.0.1-x86_64: bulk.log (Back)

=> Checking for clear installation ===> Installing bootstrap dependencies for arduio-genom3-1.2~codels+openprs+pocolibs-client-c+pocolibs-server => Installing digest-20080510.tgz => Installing tnftp-20130505~ssl.tgz ===> Checking bootstrap dependencies for arduio-genom3-1.2~codels+openprs+pocolibs-client-c+pocolibs-server => Required robotpkg package digest>=20080510: digest-20080510 found => Required robotpkg package tnftp>=20091122: tnftp-20130505~ssl found => Required system package gzip: gzip-20150113 found => Required system package pax and tar archivers: pax found => Required system package pkg_install>=20110805.7: pkg_install-20110805.7 found ===> Done bootstrap-depends for arduio-genom3-1.2~codels+openprs+pocolibs-client-c+pocolibs-server ===> Installing full dependencies for arduio-genom3-1.2~codels+openprs+pocolibs-client-c+pocolibs-server => Dependency digest-20080510 already installed => Installing genom3-2.99.30.tgz => Installing genom3-openprs-1.0.9r5.tgz => Installing genom3-pocolibs-1.10.tgz => Dependency openprs-1.1b10 already installed => Dependency pocolibs-2.16 already installed => Dependency tnftp-20130505~ssl already installed => Dependency transgen3-1.0b5 already installed ===> Checking build options for arduio-genom3-1.2~codels+openprs+pocolibs-client-c+pocolibs-server => Building with the following options: codels Build server codels openprs Build an OpenPRS client pocolibs-client-c Build a pocolibs C client pocolibs-server Build a pocolibs server ===> Checking alternatives for arduio-genom3-1.2~codels+openprs+pocolibs-client-c+pocolibs-server => Use the GNU C compiler: c-compiler provided by gcc>=3 ===> Checking dependencies for arduio-genom3-1.2~codels+openprs+pocolibs-client-c+pocolibs-server => Required system package autoconf>=2.59: autoconf-2.69 found => Required system package automake>=1.8: automake-3936. found => Required system package gcc>=3: gcc-4.8.4 found => Required system package libtool>=1.5.22: libtool-2.4.2 found => Required system package pkg-config>=0.22: pkg-config-0.29 found => Required robotpkg package genom3>=2.99.30: genom3-2.99.30 found => Required robotpkg package genom3-openprs>=1.0: genom3-openprs-1.0.9r5 found => Required robotpkg package genom3-pocolibs>=1.8: genom3-pocolibs-1.10 found => Required robotpkg package openprs>=1.1b7: openprs-1.1b10 found => Required robotpkg package pocolibs>=2.11: pocolibs-2.16 found => Required robotpkg package transgen3>=1.0b2: transgen3-1.0b5 found ===> Done depends for arduio-genom3-1.2~codels+openprs+pocolibs-client-c+pocolibs-server ===> Extracting for arduio-genom3-1.2~codels+openprs+pocolibs-client-c+pocolibs-server => SHA1 checksums OK => RMD160 checksums OK tar: tar vol 1, 35 files, 1525760 bytes read, 0 bytes written in 1 secs (1525760 bytes/sec) ===> Configuring for arduio-genom3-1.2~codels+openprs+pocolibs-client-c+pocolibs-server => Generating openprs/client encode_g3_...: unexpected type: octet decode_g3_: unexpected type: octet oprs_type: unexpected type: octet oprs_type: unexpected type: octet => Running autoreconf for openprs/client autoreconf: Entering directory `.' autoreconf: configure.ac: not using Gettext autoreconf: running: /usr/pkg/bin/aclocal --force -I autoconf autoreconf: configure.ac: tracing autoreconf: running: /usr/pkg/bin/libtoolize --copy --force autoreconf: running: /usr/pkg/bin/autoconf --force autoreconf: running: /usr/pkg/bin/autoheader --force autoreconf: running: /usr/pkg/bin/automake --add-missing --copy --force-missing Unescaped left brace in regex is deprecated, passed through in regex; marked by <-- HERE in m/${ <-- HERE ([^ t=:+{}]+)}/ at /usr/pkg/bin/automake line 3936. configure.ac:12: installing 'autoconf/compile' configure.ac:12: installing 'autoconf/config.guess' configure.ac:12: installing 'autoconf/config.sub' configure.ac:9: installing 'autoconf/install-sh' configure.ac:9: installing 'autoconf/missing' Makefile.am: installing 'autoconf/depcomp' autoreconf: Leaving directory `.' => Generating pocolibs/client/c => Running autoreconf for pocolibs/client/c autoreconf: Entering directory `.' autoreconf: configure.ac: not using Gettext autoreconf: running: /usr/pkg/bin/aclocal --force -I autoconf autoreconf: configure.ac: tracing autoreconf: running: /usr/pkg/bin/libtoolize --copy --force autoreconf: running: /usr/pkg/bin/autoconf --force autoreconf: running: /usr/pkg/bin/autoheader --force autoreconf: running: /usr/pkg/bin/automake --add-missing --copy --force-missing Unescaped left brace in regex is deprecated, passed through in regex; marked by <-- HERE in m/${ <-- HERE ([^ t=:+{}]+)}/ at /usr/pkg/bin/automake line 3936. configure.ac:12: installing 'autoconf/compile' configure.ac:12: installing 'autoconf/config.guess' configure.ac:12: installing 'autoconf/config.sub' configure.ac:9: installing 'autoconf/install-sh' configure.ac:9: installing 'autoconf/missing' Makefile.am: installing 'autoconf/depcomp' autoreconf: Leaving directory `.' => Generating pocolibs/server => Running autoreconf for pocolibs/server autoreconf: Entering directory `.' autoreconf: configure.ac: not using Gettext autoreconf: running: /usr/pkg/bin/aclocal --force -I autoconf autoreconf: configure.ac: tracing autoreconf: running: /usr/pkg/bin/libtoolize --copy --force autoreconf: running: /usr/pkg/bin/autoconf --force autoreconf: running: /usr/pkg/bin/autoheader --force autoreconf: running: /usr/pkg/bin/automake --add-missing --copy --force-missing Unescaped left brace in regex is deprecated, passed through in regex; marked by <-- HERE in m/${ <-- HERE ([^ t=:+{}]+)}/ at /usr/pkg/bin/automake line 3936. configure.ac:12: installing 'autoconf/compile' configure.ac:12: installing 'autoconf/config.guess' configure.ac:12: installing 'autoconf/config.sub' configure.ac:9: installing 'autoconf/install-sh' configure.ac:9: installing 'autoconf/missing' Makefile.am: installing 'autoconf/depcomp' autoreconf: Leaving directory `.' => Modifying GNU configure scripts to avoid --recheck => Disabling fatal errors with C++ preprocessor in GNU configure scripts ===> Building for arduio-genom3-1.2~codels+openprs+pocolibs-client-c+pocolibs-server tty.c: In function 'ario_open_tty': tty.c:57:10: error: 'B2000000' undeclared (first use in this function) baud = B2000000; ^ tty.c:57:10: note: each undeclared identifier is reported only once for each function it appears in gmake[2]: *** [libarduio_codels_la-tty.lo] Error 1 gmake[2]: *** Waiting for unfinished jobs.... gmake[1]: *** [all] Error 2 gmake: *** [all-recursive] Error 1 An unexpected error occured. The last 10 log lines are shown below. | libtool: compile: /usr/bin/gcc -DHAVE_CONFIG_H -I. -I../autoconf -I/opt/openrobots/include -pipe -O3 -DNDEBUG -MT libarduio_codels_la-arduio_codels.lo -MD -MP -MF .deps/libarduio_codels_la-arduio_codels.Tpo -c arduio_codels.c -o libarduio_codels_la-arduio_codels.o >/dev/null 2>&1 | libtool: compile: /usr/bin/gcc -DHAVE_CONFIG_H -I. -I../autoconf -I/opt/openrobots/include -pipe -O3 -DNDEBUG -MT libarduio_codels_la-arduio_comm_codels.lo -MD -MP -MF .deps/libarduio_codels_la-arduio_comm_codels.Tpo -c arduio_comm_codels.c -o libarduio_codels_la-arduio_comm_codels.o >/dev/null 2>&1 | mv -f .deps/libarduio_codels_la-arduio_codels.Tpo .deps/libarduio_codels_la-arduio_codels.Plo | mv -f .deps/libarduio_codels_la-arduio_comm_codels.Tpo .deps/libarduio_codels_la-arduio_comm_codels.Plo | gmake[2]: Leaving directory '/local/robotpkg/var/tmp/robotpkg/sysutils/arduio-genom3/work/arduio-genom3-1.2/codels' | Makefile:374: recipe for target 'all' failed | gmake[1]: Leaving directory '/local/robotpkg/var/tmp/robotpkg/sysutils/arduio-genom3/work/arduio-genom3-1.2/codels' | Makefile:557: recipe for target 'all-recursive' failed | gmake[1]: *** [all] Error 2 | gmake: *** [all-recursive] Error 1 For details or bug reports, check the complete log file in: /local/robotpkg/var/tmp/robotpkg/sysutils/arduio-genom3/work/build.log /local/robotpkg/var/lib/robotpkg/mk/build/build.mk:196: recipe for target 'do-build' failed /local/robotpkg/var/lib/robotpkg/mk/pkg/package.mk:42: recipe for target 'pkg-check-installed' failed => Marking arduio-genom3-1.2~codels+openprs+pocolibs-client-c+pocolibs-server as broken gmake[3]: *** [do-build] Error 2 gmake[2]: *** [pkg-check-installed] Error 2 ERROR: /usr/pkg/bin/gmake: *** [package] Error 2 ===> Deinstalling for arduio-genom3 Removed digest-20080510 Removing dependency eltclsh-1.16 Removing dependency Removing dependency genom3-pocolibs-1.10 Removing dependency transgen3-1.0b5 Removing dependency genom3-openprs-1.0.9r5 Removed genom3-2.99.30 Removed tnftp-20130505~ssl