robotpkg/simulation/mrsim-genom3 bulk build results

Log for mrsim-genom3-2.1~codels+openprs+ros-client-c+ros-client-ros+ros-server on NetBSD-8.0-x86_64: bulk.log (Back)

=> Checking for clear installation ===> Installing bootstrap dependencies for mrsim-genom3-2.1~codels+openprs+ros-client-c+ros-client-ros+ros-server => Installing /opt/robotpkg/var/lib/robotpkg/packages/bsd/NetBSD-8.0-x86_64/All/digest-20080510.tgz => Installing /opt/robotpkg/var/lib/robotpkg/packages/bsd/NetBSD-8.0-x86_64/All/tnftp-20130505~ssl.tgz ===> Checking bootstrap dependencies for mrsim-genom3-2.1~codels+openprs+ros-client-c+ros-client-ros+ros-server => Required robotpkg package digest>=20080510: digest-20080510 found => Required robotpkg package tnftp>=20091122: tnftp-20130505~ssl found => Required system package gzip: gzip-20150113 found => Required system package pax and tar archivers: pax found => Required system package pkg_install>=20110805.9: pkg_install-20110805.9 found ===> Done bootstrap-depends for mrsim-genom3-2.1~codels+openprs+ros-client-c+ros-client-ros+ros-server ===> Installing full dependencies for mrsim-genom3-2.1~codels+openprs+ros-client-c+ros-client-ros+ros-server => Dependency digest-20080510 already installed => Installing /opt/robotpkg/var/lib/robotpkg/packages/bsd/NetBSD-8.0-x86_64/All/genom3-2.99.33.tgz => Installing /opt/robotpkg/var/lib/robotpkg/packages/bsd/NetBSD-8.0-x86_64/All/genom3-openprs-1.0.9r5.tgz => Installing /opt/robotpkg/var/lib/robotpkg/packages/bsd/NetBSD-8.0-x86_64/All/genom3-ros-1.24.tgz To use ros, the following environment variables must contain those values: ROS_MASTER_URI http://localhost:11311 ROS_PACKAGE_PATH /opt/openrobots/share PYTHONPATH /opt/openrobots/lib/python2.7/site-packages PATH /opt/openrobots/bin As an alternative to the above configuration, commands can be executed by using the `env.sh' wrapper. For instance, roscore can be started like so: /opt/openrobots/etc/ros/env.sh roscore In Bourne shell scripts, the following file can be sourced instead: /opt/openrobots/etc/ros/setup.sh => Installing /opt/robotpkg/var/lib/robotpkg/packages/bsd/NetBSD-8.0-x86_64/All/libmrsim-1.0.tgz => Dependency openprs-1.1b10 already installed => Installing /opt/robotpkg/var/lib/robotpkg/packages/bsd/NetBSD-8.0-x86_64/All/openrobots2-idl-2.0.tgz => Dependency ros-actionlib-1.11.15 already installed => Dependency ros-comm-1.14.3r2 already installed => Dependency ros-common-msgs-1.12.6 already installed => Dependency ros-ros-1.14.4r1 already installed => Dependency ros-rospack-2.5.1 already installed => Dependency tnftp-20130505~ssl already installed => Dependency transgen3-1.0b5 already installed ===> Checking build options for mrsim-genom3-2.1~codels+openprs+ros-client-c+ros-client-ros+ros-server => Building with the following options: codels Build server codels openprs Build an OpenPRS client ros-client-c Build a ROS C client ros-client-ros Build a ROS client ros-server Build a ROS server ===> Checking alternatives for mrsim-genom3-2.1~codels+openprs+ros-client-c+ros-client-ros+ros-server => Use the GNU C++ compiler: c++-compiler provided by g++>=3 => Use the GNU C compiler: c-compiler provided by gcc>=3 => Use python-2.7: python>=2.5<3.8 provided by python27>=2.7<2.8 => Use ros melodic: ros>=groovy provided by ros-melodic ===> Checking dependencies for mrsim-genom3-2.1~codels+openprs+ros-client-c+ros-client-ros+ros-server => Required system package autoconf>=2.59: autoconf-2.69 found => Required system package automake>=1.8: automake-1.15.1 found => Required system package boost-headers>=1.34.1: boost-headers-1.67 found => Required system package boostlib-thread>=1.34.1: boost-libs-1.67.0 found => Required system package g++>=3: g++-5.5.0 found => Required system package gcc>=3: gcc-5.5.0 found => Required system package GNU m4>=1.4: gm4-1.4.18 found => Required system package libstdc++: libstdc++ found => Required system package libtool>=1.5.22: libtool-2.4.6 found => Required system package pkg-config>=0.22: pkg-config-1.4.1 found => Required system package python27>=2.7<2.8: python27-2.7.15 found => Required robotpkg package genom3>=2.99.33: genom3-2.99.33 found => Required robotpkg package genom3-openprs>=1.0: genom3-openprs-1.0.9r5 found => Required robotpkg package genom3-ros>=1.24: genom3-ros-1.24 found => Required robotpkg package libmrsim>=1.0: libmrsim-1.0 found => Required robotpkg package openprs>=1.1b7: openprs-1.1b10 found => Required robotpkg package openrobots2-idl>=2.0: openrobots2-idl-2.0 found => Required robotpkg package ros-actionlib>=1.11<1.13: ros-actionlib-1.11.15 found => Required robotpkg package ros-comm>=1.13<1.15: ros-comm-1.14.3r2 found => Required robotpkg package ros-common-msgs>=1.12<1.13: ros-common-msgs-1.12.6 found => Required robotpkg package ros-ros>=1.14<1.15: ros-ros-1.14.4r1 found => Required robotpkg package ros-rospack>=2.5<2.6: ros-rospack-2.5.1 found => Required robotpkg package transgen3>=1.0b2: transgen3-1.0b5 found ===> Done depends for mrsim-genom3-2.1~codels+openprs+ros-client-c+ros-client-ros+ros-server ===> Extracting for mrsim-genom3-2.1~codels+openprs+ros-client-c+ros-client-ros+ros-server => SHA1 checksums OK => RMD160 checksums OK tar: tar vol 1, 35 files, 1535488 bytes read, 0 bytes written in 1 secs (1535488 bytes/sec) ===> Configuring for mrsim-genom3-2.1~codels+openprs+ros-client-c+ros-client-ros+ros-server => Generating openprs/client => Running autoreconf for openprs/client autoreconf: Entering directory `.' autoreconf: configure.ac: not using Gettext autoreconf: running: /usr/pkg/bin/aclocal --force -I autoconf autoreconf: configure.ac: tracing autoreconf: running: /usr/pkg/bin/libtoolize --copy --force autoreconf: running: /usr/pkg/bin/autoconf --force autoreconf: running: /usr/pkg/bin/autoheader --force autoreconf: running: /usr/pkg/bin/automake --add-missing --copy --force-missing configure.ac:12: installing 'autoconf/compile' configure.ac:12: installing 'autoconf/config.guess' configure.ac:12: installing 'autoconf/config.sub' configure.ac:9: installing 'autoconf/install-sh' configure.ac:9: installing 'autoconf/missing' Makefile.am: installing 'autoconf/depcomp' autoreconf: Leaving directory `.' => Generating ros/client/c => Running autoreconf for ros/client/c autoreconf: Entering directory `.' autoreconf: configure.ac: not using Gettext autoreconf: running: /usr/pkg/bin/aclocal --force -I autoconf autoreconf: configure.ac: tracing autoreconf: running: /usr/pkg/bin/libtoolize --copy --force autoreconf: running: /usr/pkg/bin/autoconf --force autoreconf: running: /usr/pkg/bin/autoheader --force autoreconf: running: /usr/pkg/bin/automake --add-missing --copy --force-missing configure.ac:12: installing 'autoconf/compile' configure.ac:12: installing 'autoconf/config.guess' configure.ac:12: installing 'autoconf/config.sub' configure.ac:9: installing 'autoconf/install-sh' configure.ac:9: installing 'autoconf/missing' Makefile.am: installing 'autoconf/depcomp' autoreconf: Leaving directory `.' => Generating ros/client/ros => Running autoreconf for ros/client/ros autoreconf: Entering directory `.' autoreconf: configure.ac: not using Gettext autoreconf: running: /usr/pkg/bin/aclocal --force -I autoconf autoreconf: configure.ac: tracing autoreconf: configure.ac: not using Libtool autoreconf: running: /usr/pkg/bin/autoconf --force autoreconf: configure.ac: not using Autoheader autoreconf: running: /usr/pkg/bin/automake --add-missing --copy --force-missing configure.ac:8: installing './install-sh' configure.ac:8: installing './missing' autoreconf: Leaving directory `.' => Generating ros/server => Running autoreconf for ros/server autoreconf: Entering directory `.' autoreconf: configure.ac: not using Gettext autoreconf: running: /usr/pkg/bin/aclocal --force -I autoconf autoreconf: configure.ac: tracing autoreconf: running: /usr/pkg/bin/libtoolize --copy --force autoreconf: running: /usr/pkg/bin/autoconf --force autoreconf: running: /usr/pkg/bin/autoheader --force autoreconf: running: /usr/pkg/bin/automake --add-missing --copy --force-missing configure.ac:11: installing 'autoconf/compile' configure.ac:11: installing 'autoconf/config.guess' configure.ac:11: installing 'autoconf/config.sub' configure.ac:10: installing 'autoconf/install-sh' configure.ac:10: installing 'autoconf/missing' Makefile.am: installing 'autoconf/depcomp' autoreconf: Leaving directory `.' => Modifying GNU configure scripts to avoid --recheck configure: error: Package requirements ( eigen3 libmrsim ) were not met: Package 'eigen3', required by 'virtual:world', not found Consider adjusting the PKG_CONFIG_PATH environment variable if you installed software in a non-standard prefix. Alternatively, you may set the environment variables codels_requires_CFLAGS and codels_requires_LIBS to avoid the need to call pkg-config. See the pkg-config man page for more details. An unexpected error occured. The last 10 log lines are shown below. | ) were not met: | | Package 'eigen3', required by 'virtual:world', not found | | Consider adjusting the PKG_CONFIG_PATH environment variable if you | installed software in a non-standard prefix. | | Alternatively, you may set the environment variables codels_requires_CFLAGS | and codels_requires_LIBS to avoid the need to call pkg-config. | See the pkg-config man page for more details. For details or bug reports, check the complete log file in: /local/robotpkg/var/lib/robotpkg/mk/configure/configure.mk:250: recipe for target 'do-configure-script' failed /local/robotpkg/var/lib/robotpkg/mk/pkg/package.mk:42: recipe for target 'pkg-check-installed' failed => Marking mrsim-genom3-2.1~codels+openprs+ros-client-c+ros-client-ros+ros-server as broken /local/robotpkg/var/tmp/robotpkg/simulation/mrsim-genom3/work/configure.log gmake[3]: *** [do-configure-script] Error 1 gmake[2]: *** [pkg-check-installed] Error 2 ERROR: /usr/pkg/bin/gmake: *** [package] Error 2 ===> Deinstalling for mrsim-genom3 Removed digest-20080510 Removing dependency eltclsh-1.17 Removing dependency Removing dependency genom3-ros-1.24 Removing dependency transgen3-1.0b5 Removing dependency genom3-openprs-1.0.9r5 Removed genom3-2.99.33 Removed libmrsim-1.0 Removed openrobots2-idl-2.0 Removed tnftp-20130505~ssl