robotpkg/robots/rmp440-genom3 bulk build results

Log for rmp440-genom3-0.1r1~codels+openprs+ros-client-c+ros-client-ros+ros-server on OpenNao-2.1.0.19-i386: build.log (Back)

--- Environment --- _ROBOTPKG_NOW=0814191237 CXXCPP=/usr/bin/g++ -E LOCALBASE=/opt/openrobots LC_MONETARY=C _overrides_supervision_genom3_openprs_PKGREQD=genom3-openprs>=1.0 genom3-openprs>=1.0 genom3-openprs>=1.0 M4=/usr/bin/m4 AUTORECONF=/usr/bin/autoreconf _overrides_supervision_openprs_PKGREQD=openprs>=1.1b7 openprs>=1.1b7 openprs>=1.1b7 LOWER_OS_VERSION=2.1.0.19 GZIP_CMD=/bin/gzip TERM=linux ROBOTPKG_BASE=/local/robotpkg MAKEFLAGS= --no-print-directory -- PKGREQD.cmdline=rmp440-genom3-0.1r1~codels+openprs+ros-client-c+ros-client-ros+ros-server+!* BULKBASE=/opt/openrobots BULK_LOGDIR=/local/robotpkg/var/log/bulk tag=OpenNao-2.1.0.19-i386 RECURSIVE_PKGPATH=robots/rmp440-genom3\ LOCALBASE=/opt/openrobots PKG_DBDIR=/opt/openrobots/var/db/robotpkg EXPECT_TARGETS=fetch\ install\ package OS_KERNEL_VERSION=2.6.33.9-rt31-aldebaran-rt ACLOCAL=/usr/bin/aclocal ROS_PACKAGE_PATH=/opt/openrobots LC_NUMERIC=C LIBTOOLIZE=/usr/bin/libtoolize _overrides_interfaces_openrobots_idl_PKGREQD=openrobots-idl>=1.6 openrobots-idl>=1.6 openrobots-idl>=1.6 OWNER_UID=rbulk PYTHON27=/usr/bin/python2.7 _overrides_sysutils_ros_rospack_PKGREQD=ros-rospack>=2.2<2.3 ros-rospack>=2.2<2.3 ros-rospack>=2.2<2.3 MACHINE_PLATFORM=OpenNao-2.1.0.19-i386 _override_vars_middleware_ros_actionlib=PKGREQD PKGREQD PKGREQD _overrides_pkgtools_pkg_config_PKGREQD=pkg-config>=0.22 pkg-config>=0.22 pkg-config>=0.22 MAKEOVERRIDES=PKGREQD.cmdline=rmp440-genom3-0.1r1~codels+openprs+ros-client-c+ros-client-ros+ros-server+!* BULKBASE=/opt/openrobots BULK_LOGDIR=/local/robotpkg/var/log/bulk tag=OpenNao-2.1.0.19-i386 RECURSIVE_PKGPATH=robots/rmp440-genom3\ LOCALBASE=/opt/openrobots PKG_DBDIR=/opt/openrobots/var/db/robotpkg EXPECT_TARGETS=fetch\ install\ package _overrides_robots_mana_emergency_PKGREQD=mana-emergency>=0.2 mana-emergency>=0.2 mana-emergency>=0.2 _overrides_archivers_pax_PKGREQD=pax pax OS_KERNEL=Linux _overrides_pkgtools_digest_PKGREQD=digest>=20080510 digest>=20080510 BULKBASE=/opt/openrobots LIBTOOL=/usr/bin/libtool _overrides_pkgtools_tnftp_PKGREQD=tnftp>=20091122 tnftp>=20091122 TAR=/bin/tar LOWER_OPSYS=opennao _override_vars_hardware_gyro_libs=PKGREQD PKGREQD PKGREQD hline="$bf======================================================================$rm" _override_vars_robots_rmp440_genom3=PKGREQD MAKELEVEL=4 OWNER_GID=robots _override_vars_architecture_genom3=PKGREQD PKGREQD PKGREQD _override_vars_interfaces_openrobots_idl=PKGREQD PKGREQD PKGREQD ROBOTPKG_DIR=/local/robotpkg/var/lib/robotpkg MFLAGS=- --no-print-directory _override_vars_pkgtools_pkg_install=PKGREQD PKGREQD PKGREQD _override_vars_robots_rmp440_libs=PKGREQD PKGREQD PKGREQD CPP=/usr/bin/gcc -E rm= TNFTP=/opt/openrobots/sbin/tnftp _override_vars_hardware_libftdi=PKGREQD PKGREQD PKGREQD _override_vars_supervision_openprs=PKGREQD PKGREQD PKGREQD _override_vars_robots_mana_emergency=PKGREQD PKGREQD PKGREQD MACHINE_KERNEL=Linux-2.6.33.9-rt31-aldebaran-rt-i386 _override_vars_pkgtools_tnftp=PKGREQD PKGREQD PATH=/bin:/sbin:/bin:/sbin:/usr/bin:/usr/sbin:/usr/bin:/usr/sbin:/usr/local/bin:/usr/local/sbin LC_MESSAGES=C _overrides_interfaces_ros_common_msgs_PKGREQD=ros-common-msgs>=1.11<1.12 ros-common-msgs>=1.11<1.12 ros-common-msgs>=1.11<1.12 _overrides_hardware_gyro_libs_PKGREQD=gyro-libs>=2.99.0 gyro-libs>=2.99.0 gyro-libs>=2.99.0 _overrides_supervision_transgen3_PKGREQD=transgen3>=1.0b2 transgen3>=1.0b2 transgen3>=1.0b2 MAKECONF=/opt/robotpkg/etc/robotpkg.conf PKG_DBDIR=/opt/openrobots/var/db/robotpkg tag=OpenNao-2.1.0.19-i386 bf= LC_COLLATE=C PWD=/local/robotpkg/var/lib/robotpkg/robots/rmp440-genom3 PYTHON27_INCLUDE=/usr/include/python2.7/ PYTHON_LIB=/usr/lib/libpython2.7.so _overrides_robots_rmp440_libs_PKGREQD=rmp440-libs>=0.2 rmp440-libs>=0.2 rmp440-libs>=0.2 LANG=C PKG_CONFIG_LIBDIR=/usr/lib/pkgconfig:/usr/share/pkgconfig _overrides_architecture_genom3_ros_PKGREQD=genom3-ros>=1.20 genom3-ros>=1.20 genom3-ros>=1.20 GENOM3=/opt/openrobots/bin/genom3 _override_vars_supervision_transgen3=PKGREQD PKGREQD PKGREQD _override_vars_devel_boost_libs=PKGREQD PKGREQD PKGREQD _overrides_pkgtools_pkg_install_PKGREQD=pkg_install>=20110805.9 pkg_install>=20110805.9 pkg_install>=20110805.9 _overrides_pkgtools_libtool_PKGREQD=libtool>=1.5.22 libtool>=1.5.22 libtool>=1.5.22 _overrides_robots_rmp440_genom3_PKGREQD=rmp440-genom3-0.1r1~codels+openprs+ros-client-c+ros-client-ros+ros-server+!* RECURSIVE_PKGPATH=robots/rmp440-genom3 PATCH=/usr/bin/patch _override_vars_pkgtools_libtool=PKGREQD PKGREQD PKGREQD CXX=/usr/bin/g++ OS_VERSION=2.1.0.19 _overrides_middleware_ros_comm_PKGREQD=ros-comm>=1.11<1.12 ros-comm>=1.11<1.12 ros-comm>=1.11<1.12 SHLVL=4 _overrides_devel_boost_headers_PKGREQD=boost-headers>=1.34.1 boost-headers>=1.34.1 boost-headers>=1.34.1 HOME=/ _override_vars_architecture_genom3_ros=PKGREQD PKGREQD PKGREQD ROBOTPKG_TRUSTED_ENV=robotpkg PKGTOOLS_VERSION=20110805.9 _override_vars_interfaces_ros_common_msgs=PKGREQD PKGREQD PKGREQD EXPECT_TARGETS=fetch install package LOWER_OS_KERNEL=linux PYTHON_INCLUDE_CONFIG=/usr/include/python2.7/ FC=false _overrides_architecture_genom3_PKGREQD=genom3>=2.99.31 genom3>=2.99.31 genom3>=2.99.31 GCC=/usr/bin/gcc _override_vars_sysutils_ros_rospack=PKGREQD PKGREQD PKGREQD LOWER_ARCH=i386 MACHINE_ARCH=i386 AUTOCONF=/usr/bin/autoconf PYTHONPATH=/opt/openrobots/lib/python2.7/site-packages _override_vars_pkgtools_pkg_config=PKGREQD PKGREQD PKGREQD _override_vars_devel_boost_headers=PKGREQD PKGREQD PKGREQD ECHO_N=echo -n _override_vars_archivers_pax=PKGREQD PKGREQD _overrides_middleware_ros_actionlib_PKGREQD=ros-actionlib>=1.11<1.12 ros-actionlib>=1.11<1.12 ros-actionlib>=1.11<1.12 _override_vars_middleware_ros_comm=PKGREQD PKGREQD PKGREQD LC_CTYPE=C ZCAT=/bin/zcat _overrides_devel_ros_ros_PKGREQD=ros-ros>=1.11<1.12 ros-ros>=1.11<1.12 ros-ros>=1.11<1.12 AUTOMAKE=/usr/bin/automake PKG_CONFIG_PATH=/local/robotpkg/var/tmp/robotpkg/robots/rmp440-genom3/work/rmp440-genom3-0.1:/local/robotpkg/var/tmp/robotpkg/robots/rmp440-genom3/work/templates/ros/client/c:/local/robotpkg/var/tmp/robotpkg/robots/rmp440-genom3/work/templates/ros/client/ros:/local/robotpkg/var/tmp/robotpkg/robots/rmp440-genom3/work/templates/ros/server:/local/robotpkg/var/tmp/robotpkg/robots/rmp440-genom3/work/templates/openprs/client:/opt/openrobots/lib/pkgconfig PYTHON27_LIB=/usr/lib/libpython2.7.so PKG_CONFIG=/usr/bin/pkg-config _override_vars_pkgtools_digest=PKGREQD PKGREQD DIGEST=/opt/openrobots/sbin/robotpkg_digest CC=/usr/bin/gcc _override_vars_supervision_genom3_openprs=PKGREQD PKGREQD PKGREQD PAX=/usr/bin/pax _overrides_devel_boost_libs_PKGREQD=boost-libs>=1.34.1 boost-libs>=1.34.1 boost-libs>=1.34.1 AUTOM4TE=/usr/bin/autom4te OPSYS=OpenNao BULK_LOGDIR=/local/robotpkg/var/log/bulk NODENAME=fluffy32-opennao21 LC_TIME=C _overrides_hardware_libftdi_PKGREQD=libftdi>=0.14 libftdi>=0.14 libftdi>=0.14 PYTHON=/usr/bin/python2.7 _override_vars_devel_ros_ros=PKGREQD PKGREQD PKGREQD PYTHON_INCLUDE=/usr/include/python2.7/ GXX=/usr/bin/g++ _=/usr/bin/env --- Running set -e; \ cd /local/robotpkg/var/tmp/robotpkg/robots/rmp440-genom3/work/rmp440-genom3-0.1 && cd /local/robotpkg/var/tmp/robotpkg/robots/rmp440-genom3/work/rmp440-genom3-0.1 && /usr/bin/env MAKELEVEL= MAKEOVERRIDES= MAKEFLAGS= MFLAGS= 'CPPFLAGS=' 'CFLAGS=-pipe -O3 -DNDEBUG' 'LDFLAGS=' 'CXXFLAGS=-pipe -O3 -DNDEBUG' PREFIX='/opt/openrobots' HOME=/local/robotpkg/var/tmp/robotpkg/robots/rmp440-genom3/work PATH='/opt/openrobots/bin:/opt/openrobots/sbin:/bin:/sbin:/bin:/sbin:/usr/bin:/usr/sbin:/usr/bin:/usr/sbin:/usr/local/bin:/usr/local/sbin' LD_LIBRARY_PATH='' LOCALBASE=/opt/openrobots PKGMANDIR=man make -j4 -f Makefile all; cd /local/robotpkg/var/tmp/robotpkg/robots/rmp440-genom3/work/rmp440-genom3-0.1 && cd /local/robotpkg/var/tmp/robotpkg/robots/rmp440-genom3/work/templates/ros/client/c && /usr/bin/env MAKELEVEL= MAKEOVERRIDES= MAKEFLAGS= MFLAGS= 'CPPFLAGS=' 'CFLAGS=-pipe -O3 -DNDEBUG' 'LDFLAGS=' 'CXXFLAGS=-pipe -O3 -DNDEBUG' PREFIX='/opt/openrobots' HOME=/local/robotpkg/var/tmp/robotpkg/robots/rmp440-genom3/work PATH='/opt/openrobots/bin:/opt/openrobots/sbin:/bin:/sbin:/bin:/sbin:/usr/bin:/usr/sbin:/usr/bin:/usr/sbin:/usr/local/bin:/usr/local/sbin' LD_LIBRARY_PATH='' LOCALBASE=/opt/openrobots PKGMANDIR=man make -j4 -f Makefile all; cd /local/robotpkg/var/tmp/robotpkg/robots/rmp440-genom3/work/rmp440-genom3-0.1 && cd /local/robotpkg/var/tmp/robotpkg/robots/rmp440-genom3/work/templates/ros/client/ros && /usr/bin/env MAKELEVEL= MAKEOVERRIDES= MAKEFLAGS= MFLAGS= 'CPPFLAGS=' 'CFLAGS=-pipe -O3 -DNDEBUG' 'LDFLAGS=' 'CXXFLAGS=-pipe -O3 -DNDEBUG' PREFIX='/opt/openrobots' HOME=/local/robotpkg/var/tmp/robotpkg/robots/rmp440-genom3/work PATH='/opt/openrobots/bin:/opt/openrobots/sbin:/bin:/sbin:/bin:/sbin:/usr/bin:/usr/sbin:/usr/bin:/usr/sbin:/usr/local/bin:/usr/local/sbin' LD_LIBRARY_PATH='' LOCALBASE=/opt/openrobots PKGMANDIR=man make -j4 -f Makefile all; cd /local/robotpkg/var/tmp/robotpkg/robots/rmp440-genom3/work/rmp440-genom3-0.1 && cd /local/robotpkg/var/tmp/robotpkg/robots/rmp440-genom3/work/templates/ros/server && /usr/bin/env MAKELEVEL= MAKEOVERRIDES= MAKEFLAGS= MFLAGS= 'CPPFLAGS=' 'CFLAGS=-pipe -O3 -DNDEBUG' 'LDFLAGS=' 'CXXFLAGS=-pipe -O3 -DNDEBUG' PREFIX='/opt/openrobots' HOME=/local/robotpkg/var/tmp/robotpkg/robots/rmp440-genom3/work PATH='/opt/openrobots/bin:/opt/openrobots/sbin:/bin:/sbin:/bin:/sbin:/usr/bin:/usr/sbin:/usr/bin:/usr/sbin:/usr/local/bin:/usr/local/sbin' LD_LIBRARY_PATH='' LOCALBASE=/opt/openrobots PKGMANDIR=man make -j4 -f Makefile all; cd /local/robotpkg/var/tmp/robotpkg/robots/rmp440-genom3/work/rmp440-genom3-0.1 && cd /local/robotpkg/var/tmp/robotpkg/robots/rmp440-genom3/work/templates/openprs/client && /usr/bin/env MAKELEVEL= MAKEOVERRIDES= MAKEFLAGS= MFLAGS= 'CPPFLAGS=' 'CFLAGS=-pipe -O3 -DNDEBUG' 'LDFLAGS=' 'CXXFLAGS=-pipe -O3 -DNDEBUG' PREFIX='/opt/openrobots' HOME=/local/robotpkg/var/tmp/robotpkg/robots/rmp440-genom3/work PATH='/opt/openrobots/bin:/opt/openrobots/sbin:/bin:/sbin:/bin:/sbin:/usr/bin:/usr/sbin:/usr/bin:/usr/sbin:/usr/local/bin:/usr/local/sbin' LD_LIBRARY_PATH='' LOCALBASE=/opt/openrobots PKGMANDIR=man make -j4 -f Makefile all; Making all in codels make[1]: Entering directory `/local/robotpkg/var/tmp/robotpkg/robots/rmp440-genom3/work/rmp440-genom3-0.1/codels' /opt/openrobots/bin/genom3 mappings -MD -MF .deps/rmp440_c_types.h.d -MT rmp440_c_types.h --signature -l c ../rmp440.gen >rmp440_c_types.h make all-am make[2]: Entering directory `/local/robotpkg/var/tmp/robotpkg/robots/rmp440-genom3/work/rmp440-genom3-0.1/codels' /bin/sh ../libtool --tag=CC --mode=compile /usr/bin/gcc -DHAVE_CONFIG_H -I. -I../autoconf -I/opt/openrobots/include -I/opt/openrobots/share/idl -I/opt/openrobots/share/idl/openrobots1-idl -pipe -O3 -DNDEBUG -MT librmp440_codels_la-rmp440_codels.lo -MD -MP -MF .deps/librmp440_codels_la-rmp440_codels.Tpo -c -o librmp440_codels_la-rmp440_codels.lo `test -f 'rmp440_codels.c' || echo './'`rmp440_codels.c /bin/sh ../libtool --tag=CC --mode=compile /usr/bin/gcc -DHAVE_CONFIG_H -I. -I../autoconf -I/opt/openrobots/include -I/opt/openrobots/share/idl -I/opt/openrobots/share/idl/openrobots1-idl -pipe -O3 -DNDEBUG -MT librmp440_codels_la-rmp440_MotionTask_codels.lo -MD -MP -MF .deps/librmp440_codels_la-rmp440_MotionTask_codels.Tpo -c -o librmp440_codels_la-rmp440_MotionTask_codels.lo `test -f 'rmp440_MotionTask_codels.c' || echo './'`rmp440_MotionTask_codels.c /bin/sh ../libtool --tag=CC --mode=compile /usr/bin/gcc -DHAVE_CONFIG_H -I. -I../autoconf -I/opt/openrobots/include -I/opt/openrobots/share/idl -I/opt/openrobots/share/idl/openrobots1-idl -pipe -O3 -DNDEBUG -MT librmp440_codels_la-rmp440_TrackTask_codels.lo -MD -MP -MF .deps/librmp440_codels_la-rmp440_TrackTask_codels.Tpo -c -o librmp440_codels_la-rmp440_TrackTask_codels.lo `test -f 'rmp440_TrackTask_codels.c' || echo './'`rmp440_TrackTask_codels.c /bin/sh ../libtool --tag=CC --mode=compile /usr/bin/gcc -DHAVE_CONFIG_H -I. -I../autoconf -I/opt/openrobots/include -I/opt/openrobots/share/idl -I/opt/openrobots/share/idl/openrobots1-idl -pipe -O3 -DNDEBUG -MT librmp440_codels_la-joystick.lo -MD -MP -MF .deps/librmp440_codels_la-joystick.Tpo -c -o librmp440_codels_la-joystick.lo `test -f 'joystick.c' || echo './'`joystick.c libtool: compile: /usr/bin/gcc -DHAVE_CONFIG_H -I. -I../autoconf -I/opt/openrobots/include -I/opt/openrobots/share/idl -I/opt/openrobots/share/idl/openrobots1-idl -pipe -O3 -DNDEBUG -MT librmp440_codels_la-rmp440_codels.lo -MD -MP -MF .deps/librmp440_codels_la-rmp440_codels.Tpo -c rmp440_codels.c -fPIC -DPIC -o .libs/librmp440_codels_la-rmp440_codels.o libtool: compile: /usr/bin/gcc -DHAVE_CONFIG_H -I. -I../autoconf -I/opt/openrobots/include -I/opt/openrobots/share/idl -I/opt/openrobots/share/idl/openrobots1-idl -pipe -O3 -DNDEBUG -MT librmp440_codels_la-joystick.lo -MD -MP -MF .deps/librmp440_codels_la-joystick.Tpo -c joystick.c -fPIC -DPIC -o .libs/librmp440_codels_la-joystick.o libtool: compile: /usr/bin/gcc -DHAVE_CONFIG_H -I. -I../autoconf -I/opt/openrobots/include -I/opt/openrobots/share/idl -I/opt/openrobots/share/idl/openrobots1-idl -pipe -O3 -DNDEBUG -MT librmp440_codels_la-rmp440_MotionTask_codels.lo -MD -MP -MF .deps/librmp440_codels_la-rmp440_MotionTask_codels.Tpo -c rmp440_MotionTask_codels.c -fPIC -DPIC -o .libs/librmp440_codels_la-rmp440_MotionTask_codels.o libtool: compile: /usr/bin/gcc -DHAVE_CONFIG_H -I. -I../autoconf -I/opt/openrobots/include -I/opt/openrobots/share/idl -I/opt/openrobots/share/idl/openrobots1-idl -pipe -O3 -DNDEBUG -MT librmp440_codels_la-rmp440_TrackTask_codels.lo -MD -MP -MF .deps/librmp440_codels_la-rmp440_TrackTask_codels.Tpo -c rmp440_TrackTask_codels.c -fPIC -DPIC -o .libs/librmp440_codels_la-rmp440_TrackTask_codels.o In file included from rmp440_MotionTask_codels.c:40:0: /local/robotpkg/var/tmp/robotpkg/robots/rmp440-genom3/work/rmp440-genom3-0.1/rmp440Struct.idl:30:23: error: redefinition of typedef 'FE_STR' /opt/openrobots/include/fe/ftdi-emergency.h:26:3: note: previous declaration of 'FE_STR' was here In file included from rmp440_MotionTask_codels.c:45:0: rmp440_Log.h:22:3: error: redefinition of typedef 'rmp440_log_str' /local/robotpkg/var/tmp/robotpkg/robots/rmp440-genom3/work/rmp440-genom3-0.1/rmp440.gen:56:31: note: previous declaration of 'rmp440_log_str' was here In file included from rmp440_codels.c:27:0: rmp440_Log.h:22:3: error: redefinition of typedef 'rmp440_log_str' /local/robotpkg/var/tmp/robotpkg/robots/rmp440-genom3/work/rmp440-genom3-0.1/rmp440.gen:56:31: note: previous declaration of 'rmp440_log_str' was here make[2]: *** [librmp440_codels_la-rmp440_codels.lo] Error 1 make[2]: *** Waiting for unfinished jobs.... make[2]: *** [librmp440_codels_la-rmp440_MotionTask_codels.lo] Error 1 libtool: compile: /usr/bin/gcc -DHAVE_CONFIG_H -I. -I../autoconf -I/opt/openrobots/include -I/opt/openrobots/share/idl -I/opt/openrobots/share/idl/openrobots1-idl -pipe -O3 -DNDEBUG -MT librmp440_codels_la-joystick.lo -MD -MP -MF .deps/librmp440_codels_la-joystick.Tpo -c joystick.c -o librmp440_codels_la-joystick.o >/dev/null 2>&1 libtool: compile: /usr/bin/gcc -DHAVE_CONFIG_H -I. -I../autoconf -I/opt/openrobots/include -I/opt/openrobots/share/idl -I/opt/openrobots/share/idl/openrobots1-idl -pipe -O3 -DNDEBUG -MT librmp440_codels_la-rmp440_TrackTask_codels.lo -MD -MP -MF .deps/librmp440_codels_la-rmp440_TrackTask_codels.Tpo -c rmp440_TrackTask_codels.c -o librmp440_codels_la-rmp440_TrackTask_codels.o >/dev/null 2>&1 mv -f .deps/librmp440_codels_la-joystick.Tpo .deps/librmp440_codels_la-joystick.Plo mv -f .deps/librmp440_codels_la-rmp440_TrackTask_codels.Tpo .deps/librmp440_codels_la-rmp440_TrackTask_codels.Plo make[2]: Leaving directory `/local/robotpkg/var/tmp/robotpkg/robots/rmp440-genom3/work/rmp440-genom3-0.1/codels' make[1]: *** [all] Error 2 make[1]: Leaving directory `/local/robotpkg/var/tmp/robotpkg/robots/rmp440-genom3/work/rmp440-genom3-0.1/codels' make: *** [all-recursive] Error 1