robotpkg/robots/rmp440-genom3 bulk build results

Log for rmp440-genom3-0.1r1~codels+openprs+pocolibs-client-c+pocolibs-server on OpenNao-2.1.0.19-i386: bulk.log (Back)

=> Checking for clear installation ===> Installing bootstrap dependencies for rmp440-genom3-0.1r1~codels+openprs+pocolibs-client-c+pocolibs-server => Installing /opt/robotpkg/var/lib/robotpkg/packages/bsd/OpenNao-2.1.0.19-i386/All/digest-20080510.tgz => Installing /opt/robotpkg/var/lib/robotpkg/packages/bsd/OpenNao-2.1.0.19-i386/All/tnftp-20130505~ssl.tgz ===> Checking bootstrap dependencies for rmp440-genom3-0.1r1~codels+openprs+pocolibs-client-c+pocolibs-server => Required robotpkg package digest>=20080510: digest-20080510 found => Required robotpkg package tnftp>=20091122: tnftp-20130505~ssl found => Required system package gzip: gzip-1.4 found => Required system package patch>=2.0: patch-2.6.1 found => Required system package pax and tar archivers: pax found => Required system package pkg_install>=20110805.9: pkg_install-20110805.9 found ===> Done bootstrap-depends for rmp440-genom3-0.1r1~codels+openprs+pocolibs-client-c+pocolibs-server ===> Installing full dependencies for rmp440-genom3-0.1r1~codels+openprs+pocolibs-client-c+pocolibs-server => Dependency digest-20080510 already installed => Installing /opt/robotpkg/var/lib/robotpkg/packages/bsd/OpenNao-2.1.0.19-i386/All/genom3-2.99.31.tgz Trying to reconnect file:///opt/robotpkg/var/lib/robotpkg/packages/bsd/OpenNao-2.1.0.19-i386/All/libedit-3.1r20160903.tgz Trying to reconnect file:///opt/robotpkg/var/lib/robotpkg/packages/bsd/OpenNao-2.1.0.19-i386/All/eltclsh-1.17.tgz => Installing /opt/robotpkg/var/lib/robotpkg/packages/bsd/OpenNao-2.1.0.19-i386/All/genom3-openprs-1.0.9r5.tgz Trying to reconnect file:///opt/robotpkg/var/lib/robotpkg/packages/bsd/OpenNao-2.1.0.19-i386/All/openprs-1.1b10.tgz Trying to reconnect file:///opt/robotpkg/var/lib/robotpkg/packages/bsd/OpenNao-2.1.0.19-i386/All/transgen3-1.0b5.tgz => Installing /opt/robotpkg/var/lib/robotpkg/packages/bsd/OpenNao-2.1.0.19-i386/All/genom3-pocolibs-1.11.tgz => Installing /opt/robotpkg/var/lib/robotpkg/packages/bsd/OpenNao-2.1.0.19-i386/All/gyro-libs-3.1r2.tgz => Installing /opt/robotpkg/var/lib/robotpkg/packages/bsd/OpenNao-2.1.0.19-i386/All/mana-emergency-0.2.1r1.tgz => Dependency openprs-1.1b10 already installed => Installing /opt/robotpkg/var/lib/robotpkg/packages/bsd/OpenNao-2.1.0.19-i386/All/openrobots-idl-1.6.tgz => Dependency pocolibs-2.16 already installed => Installing /opt/robotpkg/var/lib/robotpkg/packages/bsd/OpenNao-2.1.0.19-i386/All/rmp440-libs-0.5r2.tgz => Dependency tnftp-20130505~ssl already installed => Dependency transgen3-1.0b5 already installed ===> Checking build options for rmp440-genom3-0.1r1~codels+openprs+pocolibs-client-c+pocolibs-server => Building with the following options: codels Build server codels openprs Build an OpenPRS client pocolibs-client-c Build a pocolibs C client pocolibs-server Build a pocolibs server ===> Checking alternatives for rmp440-genom3-0.1r1~codels+openprs+pocolibs-client-c+pocolibs-server => Use the GNU C compiler: c-compiler provided by gcc>=3 ===> Checking dependencies for rmp440-genom3-0.1r1~codels+openprs+pocolibs-client-c+pocolibs-server => Required system package autoconf>=2.59: autoconf-2.68 found => Required system package automake>=1.8: automake-1.11.1 found => Required system package gcc>=3: gcc-4.5.3 found => Required system package gm4>=1.4: gm4-1.4.15 found => Required system package libftdi>=0.14: libftdi-0.19 found => Required system package libtool>=1.5.22: libtool-2.4 found => Required system package pkg-config>=0.22: pkg-config-0.26 found => Required robotpkg package genom3>=2.99.31: genom3-2.99.31 found => Required robotpkg package genom3-openprs>=1.0: genom3-openprs-1.0.9r5 found => Required robotpkg package genom3-pocolibs>=1.8: genom3-pocolibs-1.11 found => Required robotpkg package gyro-libs>=2.99.0: gyro-libs-3.1r2 found => Required robotpkg package mana-emergency>=0.2: mana-emergency-0.2.1r1 found => Required robotpkg package openprs>=1.1b7: openprs-1.1b10 found => Required robotpkg package openrobots-idl>=1.6: openrobots-idl-1.6 found => Required robotpkg package pocolibs>=2.11: pocolibs-2.16 found => Required robotpkg package rmp440-libs>=0.2: rmp440-libs-0.5r2 found => Required robotpkg package transgen3>=1.0b2: transgen3-1.0b5 found ===> Done depends for rmp440-genom3-0.1r1~codels+openprs+pocolibs-client-c+pocolibs-server ===> Extracting for rmp440-genom3-0.1r1~codels+openprs+pocolibs-client-c+pocolibs-server => SHA1 checksums OK => RMD160 checksums OK ===> Patching for rmp440-genom3-0.1r1~codels+openprs+pocolibs-client-c+pocolibs-server => Applying robotpkg patches for rmp440-genom3-0.1r1~codels+openprs+pocolibs-client-c+pocolibs-server ===> Configuring for rmp440-genom3-0.1r1~codels+openprs+pocolibs-client-c+pocolibs-server => Generating openprs/client => Running autoreconf for openprs/client autoreconf-2.68: Entering directory `.' autoreconf-2.68: configure.ac: not using Gettext autoreconf-2.68: running: /usr/bin/aclocal --force -I autoconf autoreconf-2.68: configure.ac: tracing autoreconf-2.68: running: /usr/bin/libtoolize --copy --force autoreconf-2.68: running: /usr/bin/autoconf --force autoreconf-2.68: running: /usr/bin/autoheader-2.68 --force autoreconf-2.68: running: /usr/bin/automake --add-missing --copy --force-missing configure.ac:12: installing `autoconf/config.guess' configure.ac:12: installing `autoconf/config.sub' configure.ac:9: installing `autoconf/install-sh' configure.ac:9: installing `autoconf/missing' Makefile.am: installing `autoconf/depcomp' autoreconf-2.68: Leaving directory `.' => Generating pocolibs/client/c => Running autoreconf for pocolibs/client/c autoreconf-2.68: Entering directory `.' autoreconf-2.68: configure.ac: not using Gettext autoreconf-2.68: running: /usr/bin/aclocal --force -I autoconf autoreconf-2.68: configure.ac: tracing autoreconf-2.68: running: /usr/bin/libtoolize --copy --force autoreconf-2.68: running: /usr/bin/autoconf --force autoreconf-2.68: running: /usr/bin/autoheader-2.68 --force autoreconf-2.68: running: /usr/bin/automake --add-missing --copy --force-missing configure.ac:12: installing `autoconf/config.guess' configure.ac:12: installing `autoconf/config.sub' configure.ac:9: installing `autoconf/install-sh' configure.ac:9: installing `autoconf/missing' Makefile.am: installing `autoconf/depcomp' autoreconf-2.68: Leaving directory `.' => Generating pocolibs/server => Running autoreconf for pocolibs/server autoreconf-2.68: Entering directory `.' autoreconf-2.68: configure.ac: not using Gettext autoreconf-2.68: running: /usr/bin/aclocal --force -I autoconf autoreconf-2.68: configure.ac: tracing autoreconf-2.68: running: /usr/bin/libtoolize --copy --force autoreconf-2.68: running: /usr/bin/autoconf --force autoreconf-2.68: running: /usr/bin/autoheader-2.68 --force autoreconf-2.68: running: /usr/bin/automake --add-missing --copy --force-missing configure.ac:12: installing `autoconf/config.guess' configure.ac:12: installing `autoconf/config.sub' configure.ac:9: installing `autoconf/install-sh' configure.ac:9: installing `autoconf/missing' Makefile.am: installing `autoconf/depcomp' autoreconf-2.68: Leaving directory `.' => Modifying GNU configure scripts to avoid --recheck => Disabling fatal errors with C++ preprocessor in GNU configure scripts ===> Building for rmp440-genom3-0.1r1~codels+openprs+pocolibs-client-c+pocolibs-server In file included from rmp440_codels.c:27:0: rmp440_Log.h:22:3: error: redefinition of typedef 'rmp440_log_str' /local/robotpkg/var/tmp/robotpkg/robots/rmp440-genom3/work/rmp440-genom3-0.1/rmp440.gen:56:31: note: previous declaration of 'rmp440_log_str' was here make[2]: *** [librmp440_codels_la-rmp440_codels.lo] Error 1 make[2]: *** Waiting for unfinished jobs.... In file included from rmp440_MotionTask_codels.c:40:0: /local/robotpkg/var/tmp/robotpkg/robots/rmp440-genom3/work/rmp440-genom3-0.1/rmp440Struct.idl:30:23: error: redefinition of typedef 'FE_STR' /opt/openrobots/include/fe/ftdi-emergency.h:26:3: note: previous declaration of 'FE_STR' was here In file included from rmp440_MotionTask_codels.c:45:0: rmp440_Log.h:22:3: error: redefinition of typedef 'rmp440_log_str' /local/robotpkg/var/tmp/robotpkg/robots/rmp440-genom3/work/rmp440-genom3-0.1/rmp440.gen:56:31: note: previous declaration of 'rmp440_log_str' was here make[2]: *** [librmp440_codels_la-rmp440_MotionTask_codels.lo] Error 1 make[1]: *** [all] Error 2 make: *** [all-recursive] Error 1 An unexpected error occured. The last 10 log lines are shown below. | /local/robotpkg/var/tmp/robotpkg/robots/rmp440-genom3/work/rmp440-genom3-0.1/rmp440.gen:56:31: note: previous declaration of 'rmp440_log_str' was here | libtool: compile: /usr/bin/gcc -DHAVE_CONFIG_H -I. -I../autoconf -I/opt/openrobots/include -I/opt/openrobots/share/idl -I/opt/openrobots/share/idl/openrobots1-idl -pipe -O3 -DNDEBUG -MT librmp440_codels_la-joystick.lo -MD -MP -MF .deps/librmp440_codels_la-joystick.Tpo -c joystick.c -o librmp440_codels_la-joystick.o >/dev/null 2>&1 | make[2]: *** [librmp440_codels_la-rmp440_MotionTask_codels.lo] Error 1 | libtool: compile: /usr/bin/gcc -DHAVE_CONFIG_H -I. -I../autoconf -I/opt/openrobots/include -I/opt/openrobots/share/idl -I/opt/openrobots/share/idl/openrobots1-idl -pipe -O3 -DNDEBUG -MT librmp440_codels_la-rmp440_TrackTask_codels.lo -MD -MP -MF .deps/librmp440_codels_la-rmp440_TrackTask_codels.Tpo -c rmp440_TrackTask_codels.c -o librmp440_codels_la-rmp440_TrackTask_codels.o >/dev/null 2>&1 | mv -f .deps/librmp440_codels_la-rmp440_TrackTask_codels.Tpo .deps/librmp440_codels_la-rmp440_TrackTask_codels.Plo | mv -f .deps/librmp440_codels_la-joystick.Tpo .deps/librmp440_codels_la-joystick.Plo | make[2]: Leaving directory `/local/robotpkg/var/tmp/robotpkg/robots/rmp440-genom3/work/rmp440-genom3-0.1/codels' | make[1]: *** [all] Error 2 | make[1]: Leaving directory `/local/robotpkg/var/tmp/robotpkg/robots/rmp440-genom3/work/rmp440-genom3-0.1/codels' | make: *** [all-recursive] Error 1 => Marking rmp440-genom3-0.1r1~codels+openprs+pocolibs-client-c+pocolibs-server as broken For details or bug reports, check the complete log file in: /local/robotpkg/var/tmp/robotpkg/robots/rmp440-genom3/work/build.log make[3]: *** [do-build] Error 1 make[2]: *** [pkg-check-installed] Error 2 ERROR: make: *** [package] Error 2 ===> Deinstalling for rmp440-genom3 Removed digest-20080510 Removing dependency eltclsh-1.17 Removing dependency Removing dependency genom3-pocolibs-1.11 Removing dependency transgen3-1.0b5 Removing dependency genom3-openprs-1.0.9r5 Removed genom3-2.99.31 Removed gyro-libs-3.1r2 Removed mana-emergency-0.2.1r1 Removed openrobots-idl-1.6 Removed rmp440-libs-0.5r2 Removed tnftp-20130505~ssl