robotpkg/middleware/orocos-rtt bulk build results

Log for orocos-rtt-2.8.1 on Fedora-24-x86_64: bulk.log (Back)

=> Checking for clear installation ===> Installing bootstrap dependencies for orocos-rtt-2.8.1 => Installing digest-20080510.tgz => Installing tnftp-20130505~ssl.tgz ===> Checking bootstrap dependencies for orocos-rtt-2.8.1 => Required robotpkg package digest>=20080510: digest-20080510 found => Required robotpkg package tnftp>=20091122: tnftp-20130505~ssl found => Required system package git>=1.6: git-2.7.5 found => Required system package gzip: gzip-1.6 found => Required system package patch>=2.0: patch-2.7.5 found => Required system package pax and tar archivers: pax found => Required system package pkg_install>=20110805.7: pkg_install-20110805.7 found ===> Done bootstrap-depends for orocos-rtt-2.8.1 ===> Installing full dependencies for orocos-rtt-2.8.1 => Dependency digest-20080510 already installed => Dependency tnftp-20130505~ssl already installed ===> Checking build options for orocos-rtt-2.8.1 => Building with no option. ===> Checking alternatives for orocos-rtt-2.8.1 => Use the GNU C++ compiler: c++-compiler provided by g++>=3 => Use the GNU C compiler: c-compiler provided by gcc>=3 ===> Checking dependencies for orocos-rtt-2.8.1 => Required system package boost-headers>=1.38: boost-headers-1.60 found => Required system package boostlib-filesystem>=1.38: boost-libs-1.60.0 found => Required system package boostlib-iostreams>=1.38: boost-libs-1.60.0 found => Required system package boostlib-math>=1.38: boost-libs-1.60.0 found => Required system package boostlib-thread>=1.38: boost-libs-1.60.0 found => Required system package cmake>=2.6: cmake-3.9.0 found => Required system package doxygen>=1.5: doxygen-1.8.11 found => Required system package g++>=3: g++-6.3.1 found => Required system package gcc>=3: gcc-6.3.1 found => Required system package libstdc++: libstdc++ found => Required system package xerces-c>=2: xerces-c-3.1.4 found ===> Done depends for orocos-rtt-2.8.1 ===> Extracting for orocos-rtt-2.8.1 => SHA1 checksums OK => RMD160 checksums OK ===> Patching for orocos-rtt-2.8.1 => Applying robotpkg patches for orocos-rtt-2.8.1 ===> Configuring for orocos-rtt-2.8.1 CMake Deprecation Warning at CMakeLists.txt:13 (cmake_policy): The OLD behavior for policy CMP0026 will be removed from a future version of CMake. The cmake-policies(7) manual explains that the OLD behaviors of all policies are deprecated and that a policy should be set to OLD only under specific short-term circumstances. Projects should be ported to the NEW behavior and not rely on setting a policy to OLD. Orocos RTT version (2.8.1) No orocos-rtt.cmake file loaded, using default settings.See orocos-rtt.default.cmake No OROCOS_TARGET environment variable set. Using: gnulinux Boost found in /usr/include Orocos target is gnulinux CMake Warning (dev) in config/check_depend.cmake: A logical block opening on the line /local/robotpkg/var/tmp/robotpkg/middleware/orocos-rtt/work/orocos-rtt-2.8.1/config/check_depend.cmake:312 (IF) closes on the line /local/robotpkg/var/tmp/robotpkg/middleware/orocos-rtt/work/orocos-rtt-2.8.1/config/check_depend.cmake:323 (ENDIF) with mis-matching arguments. Call Stack (most recent call first): CMakeLists.txt:115 (INCLUDE) This warning is for project developers. Use -Wno-dev to suppress it. TLSF settings: -DUSE_SBRK -DUSE_MMAP -D_GNU_SOURCE -DTLSF_STATISTIC Building MQueue Transport library (Requires Boost >= 1.37.0). No default plugin path given, setting it to /opt/openrobots/lib/orocos. Define the DEFAULT_PLUGIN_PATH cmake variable to override this. ===> Building for orocos-rtt-2.8.1 /local/robotpkg/var/tmp/robotpkg/middleware/orocos-rtt/work/orocos-rtt-2.8.1/rtt/PropertyBag.cpp: In member function 'bool RTT::PropertyBag::addProperty(RTT::base::PropertyBase&)': /local/robotpkg/var/tmp/robotpkg/middleware/orocos-rtt/work/orocos-rtt-2.8.1/rtt/PropertyBag.cpp:107:16: warning: the compiler can assume that the address of 'p' will never be NULL [-Waddress] if (&p == 0) ~~~^~~~ /local/robotpkg/var/tmp/robotpkg/middleware/orocos-rtt/work/orocos-rtt-2.8.1/rtt/PropertyBag.cpp:107:9: warning: nonnull argument 'p' compared to NULL [-Wnonnull-compare] if (&p == 0) ^~ /local/robotpkg/var/tmp/robotpkg/middleware/orocos-rtt/work/orocos-rtt-2.8.1/rtt/types/PropertyDecomposition.cpp: In function 'bool RTT::types::typeDecomposition(RTT::base::DataSourceBase::shared_ptr, RTT::PropertyBag&, bool)': /local/robotpkg/var/tmp/robotpkg/middleware/orocos-rtt/work/orocos-rtt-2.8.1/rtt/types/PropertyDecomposition.cpp:106:5: warning: 'template class std::auto_ptr' is deprecated [-Wdeprecated-declarations] auto_ptr< Property > recurse_bag( new Property("recurse_bag","Part") ); ^~~~~~~~ In file included from /usr/include/c++/6.3.1/memory:81:0, from /usr/include/boost/config/no_tr1/memory.hpp:21, from /usr/include/boost/smart_ptr/shared_ptr.hpp:23, from /usr/include/boost/shared_ptr.hpp:17, from /local/robotpkg/var/tmp/robotpkg/middleware/orocos-rtt/work/orocos-rtt-2.8.1/rtt/types/../base/ActionInterface.hpp:42, from /local/robotpkg/var/tmp/robotpkg/middleware/orocos-rtt/work/orocos-rtt-2.8.1/rtt/types/../base/PropertyBase.hpp:42, from /local/robotpkg/var/tmp/robotpkg/middleware/orocos-rtt/work/orocos-rtt-2.8.1/rtt/types/PropertyDecomposition.hpp:42, from /local/robotpkg/var/tmp/robotpkg/middleware/orocos-rtt/work/orocos-rtt-2.8.1/rtt/types/PropertyDecomposition.cpp:46: /usr/include/c++/6.3.1/bits/unique_ptr.h:49:28: note: declared here template class auto_ptr; ^~~~~~~~ In file included from /usr/include/boost/iostreams/detail/is_dereferenceable.hpp:12:0, from /usr/include/boost/iostreams/detail/resolve.hpp:26, from /usr/include/boost/iostreams/detail/push.hpp:24, from /usr/include/boost/iostreams/detail/streambuf/indirect_streambuf.hpp:31, from /usr/include/boost/iostreams/stream_buffer.hpp:22, from /usr/include/boost/iostreams/stream.hpp:21, from /local/robotpkg/var/tmp/robotpkg/middleware/orocos-rtt/work/orocos-rtt-2.8.1/rtt/transports/mqueue/MQSerializationProtocol.hpp:51, from /local/robotpkg/var/tmp/robotpkg/middleware/orocos-rtt/work/orocos-rtt-2.8.1/rtt/transports/mqueue/MQLib.cpp:42: /usr/include/boost/type_traits/detail/bool_trait_def.hpp:18:79: note: #pragma message: NOTE: Use of this header (bool_trait_def.hpp) is deprecated # pragma message("NOTE: Use of this header (bool_trait_def.hpp) is deprecated") ^ In file included from /usr/include/boost/type_traits/detail/bool_trait_def.hpp:21:0, from /usr/include/boost/iostreams/detail/is_dereferenceable.hpp:12, from /usr/include/boost/iostreams/detail/resolve.hpp:26, from /usr/include/boost/iostreams/detail/push.hpp:24, from /usr/include/boost/iostreams/detail/streambuf/indirect_streambuf.hpp:31, from /usr/include/boost/iostreams/stream_buffer.hpp:22, from /usr/include/boost/iostreams/stream.hpp:21, from /local/robotpkg/var/tmp/robotpkg/middleware/orocos-rtt/work/orocos-rtt-2.8.1/rtt/transports/mqueue/MQSerializationProtocol.hpp:51, from /local/robotpkg/var/tmp/robotpkg/middleware/orocos-rtt/work/orocos-rtt-2.8.1/rtt/transports/mqueue/MQLib.cpp:42: /usr/include/boost/type_traits/detail/template_arity_spec.hpp:13:84: note: #pragma message: NOTE: Use of this header (template_arity_spec.hpp) is deprecated # pragma message("NOTE: Use of this header (template_arity_spec.hpp) is deprecated") ^ In file included from /usr/include/boost/iostreams/detail/is_dereferenceable.hpp:13:0, from /usr/include/boost/iostreams/detail/resolve.hpp:26, from /usr/include/boost/iostreams/detail/push.hpp:24, from /usr/include/boost/iostreams/detail/streambuf/indirect_streambuf.hpp:31, from /usr/include/boost/iostreams/stream_buffer.hpp:22, from /usr/include/boost/iostreams/stream.hpp:21, from /local/robotpkg/var/tmp/robotpkg/middleware/orocos-rtt/work/orocos-rtt-2.8.1/rtt/transports/mqueue/MQSerializationProtocol.hpp:51, from /local/robotpkg/var/tmp/robotpkg/middleware/orocos-rtt/work/orocos-rtt-2.8.1/rtt/transports/mqueue/MQLib.cpp:42: /usr/include/boost/type_traits/detail/template_arity_spec.hpp:13:84: note: #pragma message: NOTE: Use of this header (template_arity_spec.hpp) is deprecated # pragma message("NOTE: Use of this header (template_arity_spec.hpp) is deprecated") ^ In file included from /local/robotpkg/var/tmp/robotpkg/middleware/orocos-rtt/work/orocos-rtt-2.8.1/rtt/typekit/RealTimeTypekitTypes.cpp:42:0: /local/robotpkg/var/tmp/robotpkg/middleware/orocos-rtt/work/orocos-rtt-2.8.1/rtt/typekit/Types.inc:30:31: warning: type attributes ignored after type is already defined [-Wattributes] template class RTT_EXPORT DataSource< TYPE >; ^~~~~~~~~~~~~~~~~~ /local/robotpkg/var/tmp/robotpkg/middleware/orocos-rtt/work/orocos-rtt-2.8.1/rtt/typekit/Types.inc:30:31: note: in definition of macro 'RTT_EXPORT_TEMPLATE_TYPE' template class RTT_EXPORT DataSource< TYPE >; ^~~~~~~~~~ /local/robotpkg/var/tmp/robotpkg/middleware/orocos-rtt/work/orocos-rtt-2.8.1/rtt/typekit/Types.inc:31:31: warning: type attributes ignored after type is already defined [-Wattributes] template class RTT_EXPORT AssignableDataSource< TYPE >; ^~~~~~~~~~~~~~~~~~~~~~~~~~~~ /local/robotpkg/var/tmp/robotpkg/middleware/orocos-rtt/work/orocos-rtt-2.8.1/rtt/typekit/Types.inc:31:31: note: in definition of macro 'RTT_EXPORT_TEMPLATE_TYPE' template class RTT_EXPORT AssignableDataSource< TYPE >; ^~~~~~~~~~~~~~~~~~~~ /local/robotpkg/var/tmp/robotpkg/middleware/orocos-rtt/work/orocos-rtt-2.8.1/rtt/typekit/Types.inc:32:31: warning: type attributes ignored after type is already defined [-Wattributes] template class RTT_EXPORT ValueDataSource< TYPE >; ^~~~~~~~~~~~~~~~~~~~~~~ /local/robotpkg/var/tmp/robotpkg/middleware/orocos-rtt/work/orocos-rtt-2.8.1/rtt/typekit/Types.inc:32:31: note: in definition of macro 'RTT_EXPORT_TEMPLATE_TYPE' template class RTT_EXPORT ValueDataSource< TYPE >; ^~~~~~~~~~~~~~~ In file included from /usr/include/boost/function/detail/maybe_include.hpp:18:0, from /usr/include/boost/function/detail/function_iterate.hpp:14, from /usr/include/boost/preprocessor/iteration/detail/iter/forward1.hpp:52, from /usr/include/boost/function.hpp:64, from /local/robotpkg/var/tmp/robotpkg/middleware/orocos-rtt/work/orocos-rtt-2.8.1/rtt/scripting/../DataFlowInterface.hpp:48, from /local/robotpkg/var/tmp/robotpkg/middleware/orocos-rtt/work/orocos-rtt-2.8.1/rtt/scripting/../Service.hpp:44, from /local/robotpkg/var/tmp/robotpkg/middleware/orocos-rtt/work/orocos-rtt-2.8.1/rtt/scripting/ProgramService.hpp:43, from /local/robotpkg/var/tmp/robotpkg/middleware/orocos-rtt/work/orocos-rtt-2.8.1/rtt/scripting/ProgramService.cpp:40: /usr/include/boost/function/function_template.hpp: In instantiation of 'static R boost::detail::function::function_obj_invoker1::invoke(boost::detail::function::function_buffer&, T0) [with FunctionObj = boost::fusion::unfused)>, boost::fusion::cons, boost::fusion::nil_> >, boost::_bi::list2)> > >, boost::arg<1> > >, true>; R = bool; T0 = boost::shared_ptr]': /usr/include/boost/function/function_template.hpp:937:38: required from 'void boost::function1::assign_to(Functor) [with Functor = boost::fusion::unfused)>, boost::fusion::cons, boost::fusion::nil_> >, boost::_bi::list2)> > >, boost::arg<1> > >, true>; R = bool; T0 = boost::shared_ptr]' /usr/include/boost/function/function_template.hpp:727:7: required from 'boost::function1::function1(Functor, typename boost::enable_if_c<(! boost::is_integral::value), int>::type) [with Functor = boost::fusion::unfused)>, boost::fusion::cons, boost::fusion::nil_> >, boost::_bi::list2)> > >, boost::arg<1> > >, true>; R = bool; T0 = boost::shared_ptr; typename boost::enable_if_c<(! boost::is_integral::value), int>::type = int]' /usr/include/boost/function/function_template.hpp:1073:16: required from 'boost::function::function(Functor, typename boost::enable_if_c<(! boost::is_integral::value), int>::type) [with Functor = boost::fusion::unfused)>, boost::fusion::cons, boost::fusion::nil_> >, boost::_bi::list2)> > >, boost::arg<1> > >, true>; R = bool; T0 = boost::shared_ptr; typename boost::enable_if_c<(! boost::is_integral::value), int>::type = int]' /local/robotpkg/var/tmp/robotpkg/middleware/orocos-rtt/work/orocos-rtt-2.8.1/rtt/scripting/../internal/OperationInterfacePartFused.hpp:444:40: required from 'RTT::Handle RTT::internal::OperationInterfacePartFusedDS::produceSignal(RTT::base::ActionInterface*, const std::vector >&, RTT::ExecutionEngine*) const [with Signature = bool(boost::shared_ptr); ObjT = RTT::scripting::ProgramInterface]' /local/robotpkg/var/tmp/robotpkg/middleware/orocos-rtt/work/orocos-rtt-2.8.1/rtt/scripting/ProgramService.cpp:83:1: required from here /usr/include/boost/function/function_template.hpp:138:22: error: no match for call to '(boost::fusion::unfused)>, boost::fusion::cons, boost::fusion::nil_> >, boost::_bi::list2)> > >, boost::arg<1> > >, true>) (boost::shared_ptr)' return (*f)(BOOST_FUNCTION_ARGS); ~~~~^~~~~~~~~~~~~~~~~~~~~ In file included from /usr/include/boost/fusion/functional/generation/make_unfused.hpp:13:0, from /local/robotpkg/var/tmp/robotpkg/middleware/orocos-rtt/work/orocos-rtt-2.8.1/rtt/scripting/../internal/OperationInterfacePartFused.hpp:53, from /local/robotpkg/var/tmp/robotpkg/middleware/orocos-rtt/work/orocos-rtt-2.8.1/rtt/scripting/../Service.hpp:45, from /local/robotpkg/var/tmp/robotpkg/middleware/orocos-rtt/work/orocos-rtt-2.8.1/rtt/scripting/ProgramService.hpp:43, from /local/robotpkg/var/tmp/robotpkg/middleware/orocos-rtt/work/orocos-rtt-2.8.1/rtt/scripting/ProgramService.cpp:40: /usr/include/boost/fusion/functional/adapter/unfused.hpp:59:36: note: candidate: constexpr boost::fusion::unfused::call_const_0_result boost::fusion::unfused::operator()() const [with Function = boost::_bi::bind_t)>, boost::fusion::cons, boost::fusion::nil_> >, boost::_bi::list2)> > >, boost::arg<1> > >; boost::fusion::unfused::call_const_0_result = bool] inline call_const_0_result operator()() const ^~~~~~~~ /usr/include/boost/fusion/functional/adapter/unfused.hpp:59:36: note: candidate expects 0 arguments, 1 provided /usr/include/boost/fusion/functional/adapter/unfused.hpp:69:30: note: candidate: constexpr boost::fusion::unfused::call_0_result boost::fusion::unfused::operator()() [with Function = boost::_bi::bind_t)>, boost::fusion::cons, boost::fusion::nil_> >, boost::_bi::list2)> > >, boost::arg<1> > >; boost::fusion::unfused::call_0_result = bool] inline call_0_result operator()() ^~~~~~~~ /usr/include/boost/fusion/functional/adapter/unfused.hpp:69:30: note: candidate expects 0 arguments, 1 provided In file included from /usr/include/boost/preprocessor/iteration/detail/iter/forward1.hpp:82:0, from /usr/include/boost/fusion/functional/adapter/unfused.hpp:97, from /usr/include/boost/fusion/functional/generation/make_unfused.hpp:13, from /local/robotpkg/var/tmp/robotpkg/middleware/orocos-rtt/work/orocos-rtt-2.8.1/rtt/scripting/../internal/OperationInterfacePartFused.hpp:53, from /local/robotpkg/var/tmp/robotpkg/middleware/orocos-rtt/work/orocos-rtt-2.8.1/rtt/scripting/../Service.hpp:45, from /local/robotpkg/var/tmp/robotpkg/middleware/orocos-rtt/work/orocos-rtt-2.8.1/rtt/scripting/ProgramService.hpp:43, from /local/robotpkg/var/tmp/robotpkg/middleware/orocos-rtt/work/orocos-rtt-2.8.1/rtt/scripting/ProgramService.cpp:40: /usr/include/boost/fusion/functional/adapter/unfused.hpp:170:9: note: candidate: template constexpr typename boost::result_of::type(boost::fusion::vector&)>::type boost::fusion::unfused::operator()(T0&, T1&, T2&, T3&, T4&, T5&, T6&) [with T0 = T0; T1 = T1; T2 = T2; T3 = T3; T4 = T4; T5 = T5; T6 = T6; Function = boost::_bi::bind_t)>, boost::fusion::cons, boost::fusion::nil_> >, boost::_bi::list2)> > >, boost::arg<1> > >] operator()(BOOST_PP_ENUM_BINARY_PARAMS(N,T,& a)) ^~~~~~~~ /usr/include/boost/fusion/functional/adapter/unfused.hpp:170:9: note: template argument deduction/substitution failed: In file included from /usr/include/boost/function/detail/maybe_include.hpp:18:0, from /usr/include/boost/function/detail/function_iterate.hpp:14, from /usr/include/boost/preprocessor/iteration/detail/iter/forward1.hpp:52, from /usr/include/boost/function.hpp:64, from /local/robotpkg/var/tmp/robotpkg/middleware/orocos-rtt/work/orocos-rtt-2.8.1/rtt/scripting/../DataFlowInterface.hpp:48, from /local/robotpkg/var/tmp/robotpkg/middleware/orocos-rtt/work/orocos-rtt-2.8.1/rtt/scripting/../Service.hpp:44, from /local/robotpkg/var/tmp/robotpkg/middleware/orocos-rtt/work/orocos-rtt-2.8.1/rtt/scripting/ProgramService.hpp:43, from /local/robotpkg/var/tmp/robotpkg/middleware/orocos-rtt/work/orocos-rtt-2.8.1/rtt/scripting/ProgramService.cpp:40: /usr/include/boost/function/function_template.hpp:138:22: note: candidate expects 7 arguments, 1 provided return (*f)(BOOST_FUNCTION_ARGS); ~~~~^~~~~~~~~~~~~~~~~~~~~ In file included from /usr/include/boost/preprocessor/iteration/detail/iter/forward1.hpp:82:0, from /usr/include/boost/fusion/functional/adapter/unfused.hpp:97, from /usr/include/boost/fusion/functional/generation/make_unfused.hpp:13, from /local/robotpkg/var/tmp/robotpkg/middleware/orocos-rtt/work/orocos-rtt-2.8.1/rtt/scripting/../internal/OperationInterfacePartFused.hpp:53, from /local/robotpkg/var/tmp/robotpkg/middleware/orocos-rtt/work/orocos-rtt-2.8.1/rtt/scripting/../Service.hpp:45, from /local/robotpkg/var/tmp/robotpkg/middleware/orocos-rtt/work/orocos-rtt-2.8.1/rtt/scripting/ProgramService.hpp:43, from /local/robotpkg/var/tmp/robotpkg/middleware/orocos-rtt/work/orocos-rtt-2.8.1/rtt/scripting/ProgramService.cpp:40: /usr/include/boost/fusion/functional/adapter/unfused.hpp:158:9: note: candidate: template constexpr typename boost::result_of::type(boost::fusion::vector&)>::type boost::fusion::unfused::operator()(T0&, T1&, T2&, T3&, T4&, T5&, T6&) const [with T0 = T0; T1 = T1; T2 = T2; T3 = T3; T4 = T4; T5 = T5; T6 = T6; Function = boost::_bi::bind_t)>, boost::fusion::cons, boost::fusion::nil_> >, boost::_bi::list2)> > >, boost::arg<1> > >] operator()(BOOST_PP_ENUM_BINARY_PARAMS(N,T,& a)) const ^~~~~~~~ /usr/include/boost/fusion/functional/adapter/unfused.hpp:158:9: note: template argument deduction/substitution failed: In file included from /usr/include/boost/function/detail/maybe_include.hpp:18:0, from /usr/include/boost/function/detail/function_iterate.hpp:14, from /usr/include/boost/preprocessor/iteration/detail/iter/forward1.hpp:52, from /usr/include/boost/function.hpp:64, from /local/robotpkg/var/tmp/robotpkg/middleware/orocos-rtt/work/orocos-rtt-2.8.1/rtt/scripting/../DataFlowInterface.hpp:48, from /local/robotpkg/var/tmp/robotpkg/middleware/orocos-rtt/work/orocos-rtt-2.8.1/rtt/scripting/../Service.hpp:44, from /local/robotpkg/var/tmp/robotpkg/middleware/orocos-rtt/work/orocos-rtt-2.8.1/rtt/scripting/ProgramService.hpp:43, from /local/robotpkg/var/tmp/robotpkg/middleware/orocos-rtt/work/orocos-rtt-2.8.1/rtt/scripting/ProgramService.cpp:40: /usr/include/boost/function/function_template.hpp:138:22: note: candidate expects 7 arguments, 1 provided return (*f)(BOOST_FUNCTION_ARGS); ~~~~^~~~~~~~~~~~~~~~~~~~~ In file included from /usr/include/boost/preprocessor/iteration/detail/iter/forward1.hpp:77:0, from /usr/include/boost/fusion/functional/adapter/unfused.hpp:97, from /usr/include/boost/fusion/functional/generation/make_unfused.hpp:13, from /local/robotpkg/var/tmp/robotpkg/middleware/orocos-rtt/work/orocos-rtt-2.8.1/rtt/scripting/../internal/OperationInterfacePartFused.hpp:53, from /local/robotpkg/var/tmp/robotpkg/middleware/orocos-rtt/work/orocos-rtt-2.8.1/rtt/scripting/../Service.hpp:45, from /local/robotpkg/var/tmp/robotpkg/middleware/orocos-rtt/work/orocos-rtt-2.8.1/rtt/scripting/ProgramService.hpp:43, from /local/robotpkg/var/tmp/robotpkg/middleware/orocos-rtt/work/orocos-rtt-2.8.1/rtt/scripting/ProgramService.cpp:40: /usr/include/boost/fusion/functional/adapter/unfused.hpp:170:9: note: candidate: template constexpr typename boost::result_of::type(boost::fusion::vector&)>::type boost::fusion::unfused::operator()(T0&, T1&, T2&, T3&, T4&, T5&) [with T0 = T0; T1 = T1; T2 = T2; T3 = T3; T4 = T4; T5 = T5; Function = boost::_bi::bind_t)>, boost::fusion::cons, boost::fusion::nil_> >, boost::_bi::list2)> > >, boost::arg<1> > >] operator()(BOOST_PP_ENUM_BINARY_PARAMS(N,T,& a)) ^~~~~~~~ /usr/include/boost/fusion/functional/adapter/unfused.hpp:170:9: note: template argument deduction/substitution failed: In file included from /usr/include/boost/function/detail/maybe_include.hpp:18:0, from /usr/include/boost/function/detail/function_iterate.hpp:14, from /usr/include/boost/preprocessor/iteration/detail/iter/forward1.hpp:52, from /usr/include/boost/function.hpp:64, from /local/robotpkg/var/tmp/robotpkg/middleware/orocos-rtt/work/orocos-rtt-2.8.1/rtt/scripting/../DataFlowInterface.hpp:48, from /local/robotpkg/var/tmp/robotpkg/middleware/orocos-rtt/work/orocos-rtt-2.8.1/rtt/scripting/../Service.hpp:44, from /local/robotpkg/var/tmp/robotpkg/middleware/orocos-rtt/work/orocos-rtt-2.8.1/rtt/scripting/ProgramService.hpp:43, from /local/robotpkg/var/tmp/robotpkg/middleware/orocos-rtt/work/orocos-rtt-2.8.1/rtt/scripting/ProgramService.cpp:40: /usr/include/boost/function/function_template.hpp:138:22: note: candidate expects 6 arguments, 1 provided return (*f)(BOOST_FUNCTION_ARGS); ~~~~^~~~~~~~~~~~~~~~~~~~~ In file included from /usr/include/boost/preprocessor/iteration/detail/iter/forward1.hpp:77:0, from /usr/include/boost/fusion/functional/adapter/unfused.hpp:97, from /usr/include/boost/fusion/functional/generation/make_unfused.hpp:13, from /local/robotpkg/var/tmp/robotpkg/middleware/orocos-rtt/work/orocos-rtt-2.8.1/rtt/scripting/../internal/OperationInterfacePartFused.hpp:53, from /local/robotpkg/var/tmp/robotpkg/middleware/orocos-rtt/work/orocos-rtt-2.8.1/rtt/scripting/../Service.hpp:45, from /local/robotpkg/var/tmp/robotpkg/middleware/orocos-rtt/work/orocos-rtt-2.8.1/rtt/scripting/ProgramService.hpp:43, from /local/robotpkg/var/tmp/robotpkg/middleware/orocos-rtt/work/orocos-rtt-2.8.1/rtt/scripting/ProgramService.cpp:40: /usr/include/boost/fusion/functional/adapter/unfused.hpp:158:9: note: candidate: template constexpr typename boost::result_of::type(boost::fusion::vector&)>::type boost::fusion::unfused::operator()(T0&, T1&, T2&, T3&, T4&, T5&) const [with T0 = T0; T1 = T1; T2 = T2; T3 = T3; T4 = T4; T5 = T5; Function = boost::_bi::bind_t)>, boost::fusion::cons, boost::fusion::nil_> >, boost::_bi::list2)> > >, boost::arg<1> > >] operator()(BOOST_PP_ENUM_BINARY_PARAMS(N,T,& a)) const ^~~~~~~~ /usr/include/boost/fusion/functional/adapter/unfused.hpp:158:9: note: template argument deduction/substitution failed: In file included from /usr/include/boost/function/detail/maybe_include.hpp:18:0, from /usr/include/boost/function/detail/function_iterate.hpp:14, from /usr/include/boost/preprocessor/iteration/detail/iter/forward1.hpp:52, from /usr/include/boost/function.hpp:64, from /local/robotpkg/var/tmp/robotpkg/middleware/orocos-rtt/work/orocos-rtt-2.8.1/rtt/scripting/../DataFlowInterface.hpp:48, from /local/robotpkg/var/tmp/robotpkg/middleware/orocos-rtt/work/orocos-rtt-2.8.1/rtt/scripting/../Service.hpp:44, from /local/robotpkg/var/tmp/robotpkg/middleware/orocos-rtt/work/orocos-rtt-2.8.1/rtt/scripting/ProgramService.hpp:43, from /local/robotpkg/var/tmp/robotpkg/middleware/orocos-rtt/work/orocos-rtt-2.8.1/rtt/scripting/ProgramService.cpp:40: /usr/include/boost/function/function_template.hpp:138:22: note: candidate expects 6 arguments, 1 provided return (*f)(BOOST_FUNCTION_ARGS); ~~~~^~~~~~~~~~~~~~~~~~~~~ In file included from /usr/include/boost/preprocessor/iteration/detail/iter/forward1.hpp:72:0, from /usr/include/boost/fusion/functional/adapter/unfused.hpp:97, from /usr/include/boost/fusion/functional/generation/make_unfused.hpp:13, from /local/robotpkg/var/tmp/robotpkg/middleware/orocos-rtt/work/orocos-rtt-2.8.1/rtt/scripting/../internal/OperationInterfacePartFused.hpp:53, from /local/robotpkg/var/tmp/robotpkg/middleware/orocos-rtt/work/orocos-rtt-2.8.1/rtt/scripting/../Service.hpp:45, from /local/robotpkg/var/tmp/robotpkg/middleware/orocos-rtt/work/orocos-rtt-2.8.1/rtt/scripting/ProgramService.hpp:43, from /local/robotpkg/var/tmp/robotpkg/middleware/orocos-rtt/work/orocos-rtt-2.8.1/rtt/scripting/ProgramService.cpp:40: /usr/include/boost/fusion/functional/adapter/unfused.hpp:170:9: note: candidate: template constexpr typename boost::result_of::type(boost::fusion::vector&)>::type boost::fusion::unfused::operator()(T0&, T1&, T2&, T3&, T4&) [with T0 = T0; T1 = T1; T2 = T2; T3 = T3; T4 = T4; Function = boost::_bi::bind_t)>, boost::fusion::cons, boost::fusion::nil_> >, boost::_bi::list2)> > >, boost::arg<1> > >] operator()(BOOST_PP_ENUM_BINARY_PARAMS(N,T,& a)) ^~~~~~~~ /usr/include/boost/fusion/functional/adapter/unfused.hpp:170:9: note: template argument deduction/substitution failed: In file included from /usr/include/boost/function/detail/maybe_include.hpp:18:0, from /usr/include/boost/function/detail/function_iterate.hpp:14, from /usr/include/boost/preprocessor/iteration/detail/iter/forward1.hpp:52, from /usr/include/boost/function.hpp:64, from /local/robotpkg/var/tmp/robotpkg/middleware/orocos-rtt/work/orocos-rtt-2.8.1/rtt/scripting/../DataFlowInterface.hpp:48, from /local/robotpkg/var/tmp/robotpkg/middleware/orocos-rtt/work/orocos-rtt-2.8.1/rtt/scripting/../Service.hpp:44, from /local/robotpkg/var/tmp/robotpkg/middleware/orocos-rtt/work/orocos-rtt-2.8.1/rtt/scripting/ProgramService.hpp:43, from /local/robotpkg/var/tmp/robotpkg/middleware/orocos-rtt/work/orocos-rtt-2.8.1/rtt/scripting/ProgramService.cpp:40: /usr/include/boost/function/function_template.hpp:138:22: note: candidate expects 5 arguments, 1 provided return (*f)(BOOST_FUNCTION_ARGS); ~~~~^~~~~~~~~~~~~~~~~~~~~ In file included from /usr/include/boost/preprocessor/iteration/detail/iter/forward1.hpp:72:0, from /usr/include/boost/fusion/functional/adapter/unfused.hpp:97, from /usr/include/boost/fusion/functional/generation/make_unfused.hpp:13, from /local/robotpkg/var/tmp/robotpkg/middleware/orocos-rtt/work/orocos-rtt-2.8.1/rtt/scripting/../internal/OperationInterfacePartFused.hpp:53, from /local/robotpkg/var/tmp/robotpkg/middleware/orocos-rtt/work/orocos-rtt-2.8.1/rtt/scripting/../Service.hpp:45, from /local/robotpkg/var/tmp/robotpkg/middleware/orocos-rtt/work/orocos-rtt-2.8.1/rtt/scripting/ProgramService.hpp:43, from /local/robotpkg/var/tmp/robotpkg/middleware/orocos-rtt/work/orocos-rtt-2.8.1/rtt/scripting/ProgramService.cpp:40: /usr/include/boost/fusion/functional/adapter/unfused.hpp:158:9: note: candidate: template constexpr typename boost::result_of::type(boost::fusion::vector&)>::type boost::fusion::unfused::operator()(T0&, T1&, T2&, T3&, T4&) const [with T0 = T0; T1 = T1; T2 = T2; T3 = T3; T4 = T4; Function = boost::_bi::bind_t)>, boost::fusion::cons, boost::fusion::nil_> >, boost::_bi::list2)> > >, boost::arg<1> > >] operator()(BOOST_PP_ENUM_BINARY_PARAMS(N,T,& a)) const ^~~~~~~~ /usr/include/boost/fusion/functional/adapter/unfused.hpp:158:9: note: template argument deduction/substitution failed: In file included from /usr/include/boost/function/detail/maybe_include.hpp:18:0, from /usr/include/boost/function/detail/function_iterate.hpp:14, from /usr/include/boost/preprocessor/iteration/detail/iter/forward1.hpp:52, from /usr/include/boost/function.hpp:64, from /local/robotpkg/var/tmp/robotpkg/middleware/orocos-rtt/work/orocos-rtt-2.8.1/rtt/scripting/../DataFlowInterface.hpp:48, from /local/robotpkg/var/tmp/robotpkg/middleware/orocos-rtt/work/orocos-rtt-2.8.1/rtt/scripting/../Service.hpp:44, from /local/robotpkg/var/tmp/robotpkg/middleware/orocos-rtt/work/orocos-rtt-2.8.1/rtt/scripting/ProgramService.hpp:43, from /local/robotpkg/var/tmp/robotpkg/middleware/orocos-rtt/work/orocos-rtt-2.8.1/rtt/scripting/ProgramService.cpp:40: /usr/include/boost/function/function_template.hpp:138:22: note: candidate expects 5 arguments, 1 provided return (*f)(BOOST_FUNCTION_ARGS); ~~~~^~~~~~~~~~~~~~~~~~~~~ In file included from /usr/include/boost/preprocessor/iteration/detail/iter/forward1.hpp:67:0, from /usr/include/boost/fusion/functional/adapter/unfused.hpp:97, from /usr/include/boost/fusion/functional/generation/make_unfused.hpp:13, from /local/robotpkg/var/tmp/robotpkg/middleware/orocos-rtt/work/orocos-rtt-2.8.1/rtt/scripting/../internal/OperationInterfacePartFused.hpp:53, from /local/robotpkg/var/tmp/robotpkg/middleware/orocos-rtt/work/orocos-rtt-2.8.1/rtt/scripting/../Service.hpp:45, from /local/robotpkg/var/tmp/robotpkg/middleware/orocos-rtt/work/orocos-rtt-2.8.1/rtt/scripting/ProgramService.hpp:43, from /local/robotpkg/var/tmp/robotpkg/middleware/orocos-rtt/work/orocos-rtt-2.8.1/rtt/scripting/ProgramService.cpp:40: /usr/include/boost/fusion/functional/adapter/unfused.hpp:170:9: note: candidate: template constexpr typename boost::result_of::type(boost::fusion::vector&)>::type boost::fusion::unfused::operator()(T0&, T1&, T2&, T3&) [with T0 = T0; T1 = T1; T2 = T2; T3 = T3; Function = boost::_bi::bind_t)>, boost::fusion::cons, boost::fusion::nil_> >, boost::_bi::list2)> > >, boost::arg<1> > >] operator()(BOOST_PP_ENUM_BINARY_PARAMS(N,T,& a)) ^~~~~~~~ /usr/include/boost/fusion/functional/adapter/unfused.hpp:170:9: note: template argument deduction/substitution failed: In file included from /usr/include/boost/function/detail/maybe_include.hpp:18:0, from /usr/include/boost/function/detail/function_iterate.hpp:14, from /usr/include/boost/preprocessor/iteration/detail/iter/forward1.hpp:52, from /usr/include/boost/function.hpp:64, from /local/robotpkg/var/tmp/robotpkg/middleware/orocos-rtt/work/orocos-rtt-2.8.1/rtt/scripting/../DataFlowInterface.hpp:48, from /local/robotpkg/var/tmp/robotpkg/middleware/orocos-rtt/work/orocos-rtt-2.8.1/rtt/scripting/../Service.hpp:44, from /local/robotpkg/var/tmp/robotpkg/middleware/orocos-rtt/work/orocos-rtt-2.8.1/rtt/scripting/ProgramService.hpp:43, from /local/robotpkg/var/tmp/robotpkg/middleware/orocos-rtt/work/orocos-rtt-2.8.1/rtt/scripting/ProgramService.cpp:40: /usr/include/boost/function/function_template.hpp:138:22: note: candidate expects 4 arguments, 1 provided return (*f)(BOOST_FUNCTION_ARGS); ~~~~^~~~~~~~~~~~~~~~~~~~~ In file included from /usr/include/boost/preprocessor/iteration/detail/iter/forward1.hpp:67:0, from /usr/include/boost/fusion/functional/adapter/unfused.hpp:97, from /usr/include/boost/fusion/functional/generation/make_unfused.hpp:13, from /local/robotpkg/var/tmp/robotpkg/middleware/orocos-rtt/work/orocos-rtt-2.8.1/rtt/scripting/../internal/OperationInterfacePartFused.hpp:53, from /local/robotpkg/var/tmp/robotpkg/middleware/orocos-rtt/work/orocos-rtt-2.8.1/rtt/scripting/../Service.hpp:45, from /local/robotpkg/var/tmp/robotpkg/middleware/orocos-rtt/work/orocos-rtt-2.8.1/rtt/scripting/ProgramService.hpp:43, from /local/robotpkg/var/tmp/robotpkg/middleware/orocos-rtt/work/orocos-rtt-2.8.1/rtt/scripting/ProgramService.cpp:40: /usr/include/boost/fusion/functional/adapter/unfused.hpp:158:9: note: candidate: template constexpr typename boost::result_of::type(boost::fusion::vector&)>::type boost::fusion::unfused::operator()(T0&, T1&, T2&, T3&) const [with T0 = T0; T1 = T1; T2 = T2; T3 = T3; Function = boost::_bi::bind_t)>, boost::fusion::cons, boost::fusion::nil_> >, boost::_bi::list2)> > >, boost::arg<1> > >] operator()(BOOST_PP_ENUM_BINARY_PARAMS(N,T,& a)) const ^~~~~~~~ /usr/include/boost/fusion/functional/adapter/unfused.hpp:158:9: note: template argument deduction/substitution failed: In file included from /usr/include/boost/function/detail/maybe_include.hpp:18:0, from /usr/include/boost/function/detail/function_iterate.hpp:14, from /usr/include/boost/preprocessor/iteration/detail/iter/forward1.hpp:52, from /usr/include/boost/function.hpp:64, from /local/robotpkg/var/tmp/robotpkg/middleware/orocos-rtt/work/orocos-rtt-2.8.1/rtt/scripting/../DataFlowInterface.hpp:48, from /local/robotpkg/var/tmp/robotpkg/middleware/orocos-rtt/work/orocos-rtt-2.8.1/rtt/scripting/../Service.hpp:44, from /local/robotpkg/var/tmp/robotpkg/middleware/orocos-rtt/work/orocos-rtt-2.8.1/rtt/scripting/ProgramService.hpp:43, from /local/robotpkg/var/tmp/robotpkg/middleware/orocos-rtt/work/orocos-rtt-2.8.1/rtt/scripting/ProgramService.cpp:40: /usr/include/boost/function/function_template.hpp:138:22: note: candidate expects 4 arguments, 1 provided return (*f)(BOOST_FUNCTION_ARGS); ~~~~^~~~~~~~~~~~~~~~~~~~~ In file included from /usr/include/boost/preprocessor/iteration/detail/iter/forward1.hpp:62:0, from /usr/include/boost/fusion/functional/adapter/unfused.hpp:97, from /usr/include/boost/fusion/functional/generation/make_unfused.hpp:13, from /local/robotpkg/var/tmp/robotpkg/middleware/orocos-rtt/work/orocos-rtt-2.8.1/rtt/scripting/../internal/OperationInterfacePartFused.hpp:53, from /local/robotpkg/var/tmp/robotpkg/middleware/orocos-rtt/work/orocos-rtt-2.8.1/rtt/scripting/../Service.hpp:45, from /local/robotpkg/var/tmp/robotpkg/middleware/orocos-rtt/work/orocos-rtt-2.8.1/rtt/scripting/ProgramService.hpp:43, from /local/robotpkg/var/tmp/robotpkg/middleware/orocos-rtt/work/orocos-rtt-2.8.1/rtt/scripting/ProgramService.cpp:40: /usr/include/boost/fusion/functional/adapter/unfused.hpp:170:9: note: candidate: template constexpr typename boost::result_of::type(boost::fusion::vector&)>::type boost::fusion::unfused::operator()(T0&, T1&, T2&) [with T0 = T0; T1 = T1; T2 = T2; Function = boost::_bi::bind_t)>, boost::fusion::cons, boost::fusion::nil_> >, boost::_bi::list2)> > >, boost::arg<1> > >] operator()(BOOST_PP_ENUM_BINARY_PARAMS(N,T,& a)) ^~~~~~~~ /usr/include/boost/fusion/functional/adapter/unfused.hpp:170:9: note: template argument deduction/substitution failed: In file included from /usr/include/boost/function/detail/maybe_include.hpp:18:0, from /usr/include/boost/function/detail/function_iterate.hpp:14, from /usr/include/boost/preprocessor/iteration/detail/iter/forward1.hpp:52, from /usr/include/boost/function.hpp:64, from /local/robotpkg/var/tmp/robotpkg/middleware/orocos-rtt/work/orocos-rtt-2.8.1/rtt/scripting/../DataFlowInterface.hpp:48, from /local/robotpkg/var/tmp/robotpkg/middleware/orocos-rtt/work/orocos-rtt-2.8.1/rtt/scripting/../Service.hpp:44, from /local/robotpkg/var/tmp/robotpkg/middleware/orocos-rtt/work/orocos-rtt-2.8.1/rtt/scripting/ProgramService.hpp:43, from /local/robotpkg/var/tmp/robotpkg/middleware/orocos-rtt/work/orocos-rtt-2.8.1/rtt/scripting/ProgramService.cpp:40: /usr/include/boost/function/function_template.hpp:138:22: note: candidate expects 3 arguments, 1 provided return (*f)(BOOST_FUNCTION_ARGS); ~~~~^~~~~~~~~~~~~~~~~~~~~ In file included from /usr/include/boost/preprocessor/iteration/detail/iter/forward1.hpp:62:0, from /usr/include/boost/fusion/functional/adapter/unfused.hpp:97, from /usr/include/boost/fusion/functional/generation/make_unfused.hpp:13, from /local/robotpkg/var/tmp/robotpkg/middleware/orocos-rtt/work/orocos-rtt-2.8.1/rtt/scripting/../internal/OperationInterfacePartFused.hpp:53, from /local/robotpkg/var/tmp/robotpkg/middleware/orocos-rtt/work/orocos-rtt-2.8.1/rtt/scripting/../Service.hpp:45, from /local/robotpkg/var/tmp/robotpkg/middleware/orocos-rtt/work/orocos-rtt-2.8.1/rtt/scripting/ProgramService.hpp:43, from /local/robotpkg/var/tmp/robotpkg/middleware/orocos-rtt/work/orocos-rtt-2.8.1/rtt/scripting/ProgramService.cpp:40: /usr/include/boost/fusion/functional/adapter/unfused.hpp:158:9: note: candidate: template constexpr typename boost::result_of::type(boost::fusion::vector&)>::type boost::fusion::unfused::operator()(T0&, T1&, T2&) const [with T0 = T0; T1 = T1; T2 = T2; Function = boost::_bi::bind_t)>, boost::fusion::cons, boost::fusion::nil_> >, boost::_bi::list2)> > >, boost::arg<1> > >] operator()(BOOST_PP_ENUM_BINARY_PARAMS(N,T,& a)) const ^~~~~~~~ /usr/include/boost/fusion/functional/adapter/unfused.hpp:158:9: note: template argument deduction/substitution failed: In file included from /usr/include/boost/function/detail/maybe_include.hpp:18:0, from /usr/include/boost/function/detail/function_iterate.hpp:14, from /usr/include/boost/preprocessor/iteration/detail/iter/forward1.hpp:52, from /usr/include/boost/function.hpp:64, from /local/robotpkg/var/tmp/robotpkg/middleware/orocos-rtt/work/orocos-rtt-2.8.1/rtt/scripting/../DataFlowInterface.hpp:48, from /local/robotpkg/var/tmp/robotpkg/middleware/orocos-rtt/work/orocos-rtt-2.8.1/rtt/scripting/../Service.hpp:44, from /local/robotpkg/var/tmp/robotpkg/middleware/orocos-rtt/work/orocos-rtt-2.8.1/rtt/scripting/ProgramService.hpp:43, from /local/robotpkg/var/tmp/robotpkg/middleware/orocos-rtt/work/orocos-rtt-2.8.1/rtt/scripting/ProgramService.cpp:40: /usr/include/boost/function/function_template.hpp:138:22: note: candidate expects 3 arguments, 1 provided return (*f)(BOOST_FUNCTION_ARGS); ~~~~^~~~~~~~~~~~~~~~~~~~~ In file included from /usr/include/boost/preprocessor/iteration/detail/iter/forward1.hpp:57:0, from /usr/include/boost/fusion/functional/adapter/unfused.hpp:97, from /usr/include/boost/fusion/functional/generation/make_unfused.hpp:13, from /local/robotpkg/var/tmp/robotpkg/middleware/orocos-rtt/work/orocos-rtt-2.8.1/rtt/scripting/../internal/OperationInterfacePartFused.hpp:53, from /local/robotpkg/var/tmp/robotpkg/middleware/orocos-rtt/work/orocos-rtt-2.8.1/rtt/scripting/../Service.hpp:45, from /local/robotpkg/var/tmp/robotpkg/middleware/orocos-rtt/work/orocos-rtt-2.8.1/rtt/scripting/ProgramService.hpp:43, from /local/robotpkg/var/tmp/robotpkg/middleware/orocos-rtt/work/orocos-rtt-2.8.1/rtt/scripting/ProgramService.cpp:40: /usr/include/boost/fusion/functional/adapter/unfused.hpp:170:9: note: candidate: template constexpr typename boost::result_of::type(boost::fusion::vector&)>::type boost::fusion::unfused::operator()(T0&, T1&) [with T0 = T0; T1 = T1; Function = boost::_bi::bind_t)>, boost::fusion::cons, boost::fusion::nil_> >, boost::_bi::list2)> > >, boost::arg<1> > >] operator()(BOOST_PP_ENUM_BINARY_PARAMS(N,T,& a)) ^~~~~~~~ /usr/include/boost/fusion/functional/adapter/unfused.hpp:170:9: note: template argument deduction/substitution failed: In file included from /usr/include/boost/function/detail/maybe_include.hpp:18:0, from /usr/include/boost/function/detail/function_iterate.hpp:14, from /usr/include/boost/preprocessor/iteration/detail/iter/forward1.hpp:52, from /usr/include/boost/function.hpp:64, from /local/robotpkg/var/tmp/robotpkg/middleware/orocos-rtt/work/orocos-rtt-2.8.1/rtt/scripting/../DataFlowInterface.hpp:48, from /local/robotpkg/var/tmp/robotpkg/middleware/orocos-rtt/work/orocos-rtt-2.8.1/rtt/scripting/../Service.hpp:44, from /local/robotpkg/var/tmp/robotpkg/middleware/orocos-rtt/work/orocos-rtt-2.8.1/rtt/scripting/ProgramService.hpp:43, from /local/robotpkg/var/tmp/robotpkg/middleware/orocos-rtt/work/orocos-rtt-2.8.1/rtt/scripting/ProgramService.cpp:40: /usr/include/boost/function/function_template.hpp:138:22: note: candidate expects 2 arguments, 1 provided return (*f)(BOOST_FUNCTION_ARGS); ~~~~^~~~~~~~~~~~~~~~~~~~~ In file included from /usr/include/boost/preprocessor/iteration/detail/iter/forward1.hpp:57:0, from /usr/include/boost/fusion/functional/adapter/unfused.hpp:97, from /usr/include/boost/fusion/functional/generation/make_unfused.hpp:13, from /local/robotpkg/var/tmp/robotpkg/middleware/orocos-rtt/work/orocos-rtt-2.8.1/rtt/scripting/../internal/OperationInterfacePartFused.hpp:53, from /local/robotpkg/var/tmp/robotpkg/middleware/orocos-rtt/work/orocos-rtt-2.8.1/rtt/scripting/../Service.hpp:45, from /local/robotpkg/var/tmp/robotpkg/middleware/orocos-rtt/work/orocos-rtt-2.8.1/rtt/scripting/ProgramService.hpp:43, from /local/robotpkg/var/tmp/robotpkg/middleware/orocos-rtt/work/orocos-rtt-2.8.1/rtt/scripting/ProgramService.cpp:40: /usr/include/boost/fusion/functional/adapter/unfused.hpp:158:9: note: candidate: template constexpr typename boost::result_of::type(boost::fusion::vector&)>::type boost::fusion::unfused::operator()(T0&, T1&) const [with T0 = T0; T1 = T1; Function = boost::_bi::bind_t)>, boost::fusion::cons, boost::fusion::nil_> >, boost::_bi::list2)> > >, boost::arg<1> > >] operator()(BOOST_PP_ENUM_BINARY_PARAMS(N,T,& a)) const ^~~~~~~~ /usr/include/boost/fusion/functional/adapter/unfused.hpp:158:9: note: template argument deduction/substitution failed: In file included from /usr/include/boost/function/detail/maybe_include.hpp:18:0, from /usr/include/boost/function/detail/function_iterate.hpp:14, from /usr/include/boost/preprocessor/iteration/detail/iter/forward1.hpp:52, from /usr/include/boost/function.hpp:64, from /local/robotpkg/var/tmp/robotpkg/middleware/orocos-rtt/work/orocos-rtt-2.8.1/rtt/scripting/../DataFlowInterface.hpp:48, from /local/robotpkg/var/tmp/robotpkg/middleware/orocos-rtt/work/orocos-rtt-2.8.1/rtt/scripting/../Service.hpp:44, from /local/robotpkg/var/tmp/robotpkg/middleware/orocos-rtt/work/orocos-rtt-2.8.1/rtt/scripting/ProgramService.hpp:43, from /local/robotpkg/var/tmp/robotpkg/middleware/orocos-rtt/work/orocos-rtt-2.8.1/rtt/scripting/ProgramService.cpp:40: /usr/include/boost/function/function_template.hpp:138:22: note: candidate expects 2 arguments, 1 provided return (*f)(BOOST_FUNCTION_ARGS); ~~~~^~~~~~~~~~~~~~~~~~~~~ In file included from /usr/include/boost/preprocessor/iteration/detail/iter/forward1.hpp:52:0, from /usr/include/boost/fusion/functional/adapter/unfused.hpp:97, from /usr/include/boost/fusion/functional/generation/make_unfused.hpp:13, from /local/robotpkg/var/tmp/robotpkg/middleware/orocos-rtt/work/orocos-rtt-2.8.1/rtt/scripting/../internal/OperationInterfacePartFused.hpp:53, from /local/robotpkg/var/tmp/robotpkg/middleware/orocos-rtt/work/orocos-rtt-2.8.1/rtt/scripting/../Service.hpp:45, from /local/robotpkg/var/tmp/robotpkg/middleware/orocos-rtt/work/orocos-rtt-2.8.1/rtt/scripting/ProgramService.hpp:43, from /local/robotpkg/var/tmp/robotpkg/middleware/orocos-rtt/work/orocos-rtt-2.8.1/rtt/scripting/ProgramService.cpp:40: /usr/include/boost/fusion/functional/adapter/unfused.hpp:170:9: note: candidate: constexpr typename boost::result_of::type(boost::fusion::vector&)>::type boost::fusion::unfused::operator()(T0&) [with T0 = boost::shared_ptr; Function = boost::_bi::bind_t)>, boost::fusion::cons, boost::fusion::nil_> >, boost::_bi::list2)> > >, boost::arg<1> > >; typename boost::result_of::type(boost::fusion::vector&)>::type = bool] operator()(BOOST_PP_ENUM_BINARY_PARAMS(N,T,& a)) ^~~~~~~~ /usr/include/boost/fusion/functional/adapter/unfused.hpp:170:9: note: conversion of argument 1 would be ill-formed: In file included from /usr/include/boost/function/detail/maybe_include.hpp:18:0, from /usr/include/boost/function/detail/function_iterate.hpp:14, from /usr/include/boost/preprocessor/iteration/detail/iter/forward1.hpp:52, from /usr/include/boost/function.hpp:64, from /local/robotpkg/var/tmp/robotpkg/middleware/orocos-rtt/work/orocos-rtt-2.8.1/rtt/scripting/../DataFlowInterface.hpp:48, from /local/robotpkg/var/tmp/robotpkg/middleware/orocos-rtt/work/orocos-rtt-2.8.1/rtt/scripting/../Service.hpp:44, from /local/robotpkg/var/tmp/robotpkg/middleware/orocos-rtt/work/orocos-rtt-2.8.1/rtt/scripting/ProgramService.hpp:43, from /local/robotpkg/var/tmp/robotpkg/middleware/orocos-rtt/work/orocos-rtt-2.8.1/rtt/scripting/ProgramService.cpp:40: /usr/include/boost/function/function_template.hpp:138:22: error: invalid initialization of non-const reference of type 'boost::shared_ptr&' from an rvalue of type 'boost::shared_ptr' return (*f)(BOOST_FUNCTION_ARGS); ~~~~^~~~~~~~~~~~~~~~~~~~~ In file included from /usr/include/boost/preprocessor/iteration/detail/iter/forward1.hpp:52:0, from /usr/include/boost/fusion/functional/adapter/unfused.hpp:97, from /usr/include/boost/fusion/functional/generation/make_unfused.hpp:13, from /local/robotpkg/var/tmp/robotpkg/middleware/orocos-rtt/work/orocos-rtt-2.8.1/rtt/scripting/../internal/OperationInterfacePartFused.hpp:53, from /local/robotpkg/var/tmp/robotpkg/middleware/orocos-rtt/work/orocos-rtt-2.8.1/rtt/scripting/../Service.hpp:45, from /local/robotpkg/var/tmp/robotpkg/middleware/orocos-rtt/work/orocos-rtt-2.8.1/rtt/scripting/ProgramService.hpp:43, from /local/robotpkg/var/tmp/robotpkg/middleware/orocos-rtt/work/orocos-rtt-2.8.1/rtt/scripting/ProgramService.cpp:40: /usr/include/boost/fusion/functional/adapter/unfused.hpp:158:9: note: candidate: constexpr typename boost::result_of::type(boost::fusion::vector&)>::type boost::fusion::unfused::operator()(T0&) const [with T0 = boost::shared_ptr; Function = boost::_bi::bind_t)>, boost::fusion::cons, boost::fusion::nil_> >, boost::_bi::list2)> > >, boost::arg<1> > >; typename boost::result_of::type(boost::fusion::vector&)>::type = bool] operator()(BOOST_PP_ENUM_BINARY_PARAMS(N,T,& a)) const ^~~~~~~~ /usr/include/boost/fusion/functional/adapter/unfused.hpp:158:9: note: conversion of argument 1 would be ill-formed: In file included from /usr/include/boost/function/detail/maybe_include.hpp:18:0, from /usr/include/boost/function/detail/function_iterate.hpp:14, from /usr/include/boost/preprocessor/iteration/detail/iter/forward1.hpp:52, from /usr/include/boost/function.hpp:64, from /local/robotpkg/var/tmp/robotpkg/middleware/orocos-rtt/work/orocos-rtt-2.8.1/rtt/scripting/../DataFlowInterface.hpp:48, from /local/robotpkg/var/tmp/robotpkg/middleware/orocos-rtt/work/orocos-rtt-2.8.1/rtt/scripting/../Service.hpp:44, from /local/robotpkg/var/tmp/robotpkg/middleware/orocos-rtt/work/orocos-rtt-2.8.1/rtt/scripting/ProgramService.hpp:43, from /local/robotpkg/var/tmp/robotpkg/middleware/orocos-rtt/work/orocos-rtt-2.8.1/rtt/scripting/ProgramService.cpp:40: /usr/include/boost/function/function_template.hpp:138:22: error: invalid initialization of non-const reference of type 'boost::shared_ptr&' from an rvalue of type 'boost::shared_ptr' return (*f)(BOOST_FUNCTION_ARGS); ~~~~^~~~~~~~~~~~~~~~~~~~~ make[2]: *** [rtt/scripting/CMakeFiles/rtt-scripting-gnulinux_plugin.dir/ProgramService.cpp.o] Error 1 make[2]: *** Waiting for unfinished jobs.... make[1]: *** [rtt/scripting/CMakeFiles/rtt-scripting-gnulinux_plugin.dir/all] Error 2 make[1]: *** Waiting for unfinished jobs.... make: *** [all] Error 2 An unexpected error occured. The last 10 log lines are shown below. | /usr/bin/g++ -fPIC -pipe -O3 -DNDEBUG -fmessage-length=0 -Wl,-zdefs -shared -Wl,-soname,librtt-typekit-gnulinux.so.2.8 -o librtt-typekit-gnulinux.so.2.8.1 CMakeFiles/rtt-typekit-gnulinux_plugin.dir/RealTimeTypekit.cpp.o CMakeFiles/rtt-typekit-gnulinux_plugin.dir/RealTimeTypekitConstructors.cpp.o CMakeFiles/rtt-typekit-gnulinux_plugin.dir/RealTimeTypekitGlobals.cpp.o CMakeFiles/rtt-typekit-gnulinux_plugin.dir/RealTimeTypekitOperators.cpp.o CMakeFiles/rtt-typekit-gnulinux_plugin.dir/RealTimeTypekitStdTypes.cpp.o CMakeFiles/rtt-typekit-gnulinux_plugin.dir/RealTimeTypekitTypes.cpp.o CMakeFiles/rtt-typekit-gnulinux_plugin.dir/RealTimeTypekitTypes2.cpp.o -Wl,-rpath,/local/robotpkg/var/tmp/robotpkg/middleware/orocos-rtt/work/orocos-rtt-2.8.1/rtt: ../liborocos-rtt-gnulinux.so.2.8.1 -lboost_filesystem -lboost_system -lboost_serialization -lxerces-c -lpthread -lrt -ldl | cd /local/robotpkg/var/tmp/robotpkg/middleware/orocos-rtt/work/orocos-rtt-2.8.1/rtt/typekit && /usr/bin/cmake -E cmake_symlink_library librtt-typekit-gnulinux.so.2.8.1 librtt-typekit-gnulinux.so.2.8 librtt-typekit-gnulinux.so | Copying /local/robotpkg/var/tmp/robotpkg/middleware/orocos-rtt/work/orocos-rtt-2.8.1/rtt/typekit/librtt-typekit-gnulinux.so to /local/robotpkg/var/tmp/robotpkg/middleware/orocos-rtt/work/orocos-rtt-2.8.1/rtt/types | cd /local/robotpkg/var/tmp/robotpkg/middleware/orocos-rtt/work/orocos-rtt-2.8.1/rtt/typekit && /usr/bin/cmake -E make_directory /local/robotpkg/var/tmp/robotpkg/middleware/orocos-rtt/work/orocos-rtt-2.8.1/rtt/types | cd /local/robotpkg/var/tmp/robotpkg/middleware/orocos-rtt/work/orocos-rtt-2.8.1/rtt/typekit && /usr/bin/cmake -E copy /local/robotpkg/var/tmp/robotpkg/middleware/orocos-rtt/work/orocos-rtt-2.8.1/rtt/typekit/librtt-typekit-gnulinux.so /local/robotpkg/var/tmp/robotpkg/middleware/orocos-rtt/work/orocos-rtt-2.8.1/rtt/types | make[2]: Leaving directory '/local/robotpkg/var/tmp/robotpkg/middleware/orocos-rtt/work/orocos-rtt-2.8.1' | [ 90%] Built target rtt-typekit-gnulinux_plugin | make[1]: Leaving directory '/local/robotpkg/var/tmp/robotpkg/middleware/orocos-rtt/work/orocos-rtt-2.8.1' | make: *** [all] Error 2 | Makefile:132: recipe for target 'all' failed For details or bug reports, check the complete log file in: /local/robotpkg/var/tmp/robotpkg/middleware/orocos-rtt/work/build.log make[3]: *** [do-build] Error 1 /local/robotpkg/var/lib/robotpkg/mk/build/build.mk:196: recipe for target 'do-build' failed /local/robotpkg/var/lib/robotpkg/mk/pkg/package.mk:42: recipe for target 'pkg-check-installed' failed make[2]: *** [pkg-check-installed] Error 2 => Marking orocos-rtt-2.8.1 as broken ERROR: make: *** [package] Error 2 ===> Deinstalling for orocos-rtt Removed digest-20080510 Removed tnftp-20130505~ssl