robotpkg/middleware/orocos-rtt bulk build results

Log for orocos-rtt-2.8.1 on Fedora-24-x86_64: build.log (Back)

--- Environment --- _ROBOTPKG_NOW=0119141957 CMAKE=/usr/bin/cmake CXXCPP=/usr/bin/g++ -E LOCALBASE=/opt/openrobots LC_MONETARY=C LOWER_OS_VERSION=24 GZIP_CMD=/usr/bin/gzip ROBOTPKG_BASE=/local/robotpkg OS_KERNEL_VERSION=4.11.12-100.fc24.x86_64 MAKEFLAGS= --no-print-directory -- PKGREQD.cmdline=orocos-rtt-2.8.1 RECURSIVE_PKGPATH=middleware/orocos-rtt\ tag=Fedora-24-x86_64 BULK_LOGDIR=/local/robotpkg/var/log/bulk BULKBASE=/opt/openrobots LOCALBASE=/opt/openrobots PKG_DBDIR=/opt/openrobots/var/db/robotpkg EXPECT_TARGETS=fetch\ install\ package _override_vars_middleware_orocos_rtt=PKGREQD LC_NUMERIC=C OWNER_UID=rbulk MACHINE_PLATFORM=Fedora-24-x86_64 MAKEOVERRIDES=PKGREQD.cmdline=orocos-rtt-2.8.1 RECURSIVE_PKGPATH=middleware/orocos-rtt\ tag=Fedora-24-x86_64 BULK_LOGDIR=/local/robotpkg/var/log/bulk BULKBASE=/opt/openrobots LOCALBASE=/opt/openrobots PKG_DBDIR=/opt/openrobots/var/db/robotpkg EXPECT_TARGETS=fetch\ install\ package _overrides_archivers_pax_PKGREQD=pax pax OS_KERNEL=Linux _overrides_pkgtools_digest_PKGREQD=digest>=20080510 digest>=20080510 digest>=20080510 BULKBASE=/opt/openrobots _overrides_pkgtools_tnftp_PKGREQD=tnftp>=20091122 tnftp>=20091122 TAR=/usr/bin/tar LOWER_OPSYS=fedora hline="$bf======================================================================$rm" MAKELEVEL=4 OWNER_GID=robots ROBOTPKG_DIR=/local/robotpkg/var/lib/robotpkg MFLAGS=--no-print-directory _override_vars_pkgtools_pkg_install=PKGREQD PKGREQD PKGREQD CPP=/usr/bin/gcc -E rm= TNFTP=/opt/openrobots/sbin/tnftp MACHINE_KERNEL=Linux-4.11.12-100.fc24.x86_64-x86_64 _override_vars_pkgtools_tnftp=PKGREQD PKGREQD PATH=/usr/local/sbin:/usr/local/bin:/usr/sbin:/usr/bin LC_MESSAGES=C MAKECONF=/opt/robotpkg/etc/robotpkg.conf PKG_DBDIR=/opt/openrobots/var/db/robotpkg tag=Fedora-24-x86_64 bf= LC_COLLATE=C PWD=/local/robotpkg/var/lib/robotpkg/middleware/orocos-rtt LANG=C _override_vars_devel_boost_libs=PKGREQD PKGREQD PKGREQD PKGREQD PKGREQD PKGREQD PKGREQD PKGREQD PKGREQD PKGREQD PKGREQD PKGREQD _overrides_pkgtools_pkg_install_PKGREQD=pkg_install>=20110805.7 pkg_install>=20110805.7 pkg_install>=20110805.7 RECURSIVE_PKGPATH=middleware/orocos-rtt PATCH=/usr/bin/patch CXX=/usr/bin/g++ _overrides_middleware_orocos_rtt_PKGREQD=orocos-rtt-2.8.1 OS_VERSION=24 SHLVL=4 _overrides_devel_boost_headers_PKGREQD=boost-headers>=1.38 boost-headers>=1.38 boost-headers>=1.38 ROBOTPKG_TRUSTED_ENV=robotpkg PKGTOOLS_VERSION=20110805.7 GIT=/usr/bin/git EXPECT_TARGETS=fetch install package LOWER_OS_KERNEL=linux FC=false GCC=/usr/bin/gcc LOWER_ARCH=x86_64 MACHINE_ARCH=x86_64 _override_vars_devel_boost_headers=PKGREQD PKGREQD PKGREQD ECHO_N=echo -n DOXYGEN=/usr/bin/doxygen _override_vars_archivers_pax=PKGREQD PKGREQD LC_CTYPE=C ZCAT=/usr/bin/zcat _override_vars_pkgtools_digest=PKGREQD PKGREQD PKGREQD DIGEST=/opt/openrobots/sbin/robotpkg_digest CC=/usr/bin/gcc PAX=/usr/bin/pax _overrides_devel_boost_libs_PKGREQD=boost-libs>=1.38 boost-libs>=1.38 boost-libs>=1.38 boost-libs>=1.38 boost-libs>=1.38 boost-libs>=1.38 boost-libs>=1.38 boost-libs>=1.38 boost-libs>=1.38 boost-libs>=1.38 boost-libs>=1.38 boost-libs>=1.38 OPSYS=Fedora BULK_LOGDIR=/local/robotpkg/var/log/bulk NODENAME=fluffy64-fedora24.laas.fr LC_TIME=C GXX=/usr/bin/g++ _=/usr/bin/env --- Running set -e; \ cd /local/robotpkg/var/tmp/robotpkg/middleware/orocos-rtt/work/orocos-rtt-2.8.1 && cd /local/robotpkg/var/tmp/robotpkg/middleware/orocos-rtt/work/orocos-rtt-2.8.1 && /usr/bin/env MAKELEVEL= MAKEOVERRIDES= MAKEFLAGS= MFLAGS= 'CPPFLAGS=' 'CFLAGS=-pipe -O3 -DNDEBUG' 'LDFLAGS=' 'CXXFLAGS=-pipe -O3 -DNDEBUG' PREFIX='/opt/openrobots' HOME=/local/robotpkg/var/tmp/robotpkg/middleware/orocos-rtt/work PATH='/opt/openrobots/sbin:/usr/local/sbin:/usr/local/bin:/usr/sbin:/usr/bin' LD_LIBRARY_PATH='' LOCALBASE=/opt/openrobots PKGMANDIR=man make -j4 -f Makefile all; /usr/bin/cmake -H/local/robotpkg/var/tmp/robotpkg/middleware/orocos-rtt/work/orocos-rtt-2.8.1 -B/local/robotpkg/var/tmp/robotpkg/middleware/orocos-rtt/work/orocos-rtt-2.8.1 --check-build-system CMakeFiles/Makefile.cmake 0 /usr/bin/cmake -E cmake_progress_start /local/robotpkg/var/tmp/robotpkg/middleware/orocos-rtt/work/orocos-rtt-2.8.1/CMakeFiles /local/robotpkg/var/tmp/robotpkg/middleware/orocos-rtt/work/orocos-rtt-2.8.1/CMakeFiles/progress.marks make -f CMakeFiles/Makefile2 all make[1]: Entering directory '/local/robotpkg/var/tmp/robotpkg/middleware/orocos-rtt/work/orocos-rtt-2.8.1' make -f rtt/CMakeFiles/orocos-rtt-gnulinux_dynamic.dir/build.make rtt/CMakeFiles/orocos-rtt-gnulinux_dynamic.dir/depend make -f doc/CMakeFiles/message.dir/build.make doc/CMakeFiles/message.dir/depend make[2]: Entering directory '/local/robotpkg/var/tmp/robotpkg/middleware/orocos-rtt/work/orocos-rtt-2.8.1' cd /local/robotpkg/var/tmp/robotpkg/middleware/orocos-rtt/work/orocos-rtt-2.8.1 && /usr/bin/cmake -E cmake_depends "Unix Makefiles" /local/robotpkg/var/tmp/robotpkg/middleware/orocos-rtt/work/orocos-rtt-2.8.1 /local/robotpkg/var/tmp/robotpkg/middleware/orocos-rtt/work/orocos-rtt-2.8.1/doc /local/robotpkg/var/tmp/robotpkg/middleware/orocos-rtt/work/orocos-rtt-2.8.1 /local/robotpkg/var/tmp/robotpkg/middleware/orocos-rtt/work/orocos-rtt-2.8.1/doc /local/robotpkg/var/tmp/robotpkg/middleware/orocos-rtt/work/orocos-rtt-2.8.1/doc/CMakeFiles/message.dir/DependInfo.cmake --color= make[2]: Entering directory '/local/robotpkg/var/tmp/robotpkg/middleware/orocos-rtt/work/orocos-rtt-2.8.1' cd /local/robotpkg/var/tmp/robotpkg/middleware/orocos-rtt/work/orocos-rtt-2.8.1 && /usr/bin/cmake -E cmake_depends "Unix Makefiles" /local/robotpkg/var/tmp/robotpkg/middleware/orocos-rtt/work/orocos-rtt-2.8.1 /local/robotpkg/var/tmp/robotpkg/middleware/orocos-rtt/work/orocos-rtt-2.8.1/rtt /local/robotpkg/var/tmp/robotpkg/middleware/orocos-rtt/work/orocos-rtt-2.8.1 /local/robotpkg/var/tmp/robotpkg/middleware/orocos-rtt/work/orocos-rtt-2.8.1/rtt /local/robotpkg/var/tmp/robotpkg/middleware/orocos-rtt/work/orocos-rtt-2.8.1/rtt/CMakeFiles/orocos-rtt-gnulinux_dynamic.dir/DependInfo.cmake --color= Scanning dependencies of target message make[2]: Leaving directory '/local/robotpkg/var/tmp/robotpkg/middleware/orocos-rtt/work/orocos-rtt-2.8.1' make -f doc/CMakeFiles/message.dir/build.make doc/CMakeFiles/message.dir/build make[2]: Entering directory '/local/robotpkg/var/tmp/robotpkg/middleware/orocos-rtt/work/orocos-rtt-2.8.1' cd /local/robotpkg/var/tmp/robotpkg/middleware/orocos-rtt/work/orocos-rtt-2.8.1/doc && echo Use: make docapi dochtml docpdf to build the documentation. Use: make docapi dochtml docpdf to build the documentation. make[2]: Leaving directory '/local/robotpkg/var/tmp/robotpkg/middleware/orocos-rtt/work/orocos-rtt-2.8.1' [ 0%] Built target message Scanning dependencies of target orocos-rtt-gnulinux_dynamic make[2]: Leaving directory '/local/robotpkg/var/tmp/robotpkg/middleware/orocos-rtt/work/orocos-rtt-2.8.1' make -f rtt/CMakeFiles/orocos-rtt-gnulinux_dynamic.dir/build.make rtt/CMakeFiles/orocos-rtt-gnulinux_dynamic.dir/build make[2]: Entering directory '/local/robotpkg/var/tmp/robotpkg/middleware/orocos-rtt/work/orocos-rtt-2.8.1' [ 0%] Building CXX object rtt/CMakeFiles/orocos-rtt-gnulinux_dynamic.dir/ArgumentDescription.cpp.o [ 0%] Building CXX object rtt/CMakeFiles/orocos-rtt-gnulinux_dynamic.dir/Activity.cpp.o cd /local/robotpkg/var/tmp/robotpkg/middleware/orocos-rtt/work/orocos-rtt-2.8.1/rtt && /usr/bin/g++ -DOROCOS_TARGET=gnulinux -DRTT_DLL_EXPORT -I/local/robotpkg/var/tmp/robotpkg/middleware/orocos-rtt/work/orocos-rtt-2.8.1/rtt/os/gnulinux -I/local/robotpkg/var/tmp/robotpkg/middleware/orocos-rtt/work/orocos-rtt-2.8.1/rtt/os -I/local/robotpkg/var/tmp/robotpkg/middleware/orocos-rtt/work/orocos-rtt-2.8.1/rtt -I/local/robotpkg/var/tmp/robotpkg/middleware/orocos-rtt/work/orocos-rtt-2.8.1 -pipe -O3 -DNDEBUG -fmessage-length=0 -fPIC -Wall -o CMakeFiles/orocos-rtt-gnulinux_dynamic.dir/ArgumentDescription.cpp.o -c /local/robotpkg/var/tmp/robotpkg/middleware/orocos-rtt/work/orocos-rtt-2.8.1/rtt/ArgumentDescription.cpp cd /local/robotpkg/var/tmp/robotpkg/middleware/orocos-rtt/work/orocos-rtt-2.8.1/rtt && /usr/bin/g++ -DOROCOS_TARGET=gnulinux -DRTT_DLL_EXPORT -I/local/robotpkg/var/tmp/robotpkg/middleware/orocos-rtt/work/orocos-rtt-2.8.1/rtt/os/gnulinux -I/local/robotpkg/var/tmp/robotpkg/middleware/orocos-rtt/work/orocos-rtt-2.8.1/rtt/os -I/local/robotpkg/var/tmp/robotpkg/middleware/orocos-rtt/work/orocos-rtt-2.8.1/rtt -I/local/robotpkg/var/tmp/robotpkg/middleware/orocos-rtt/work/orocos-rtt-2.8.1 -pipe -O3 -DNDEBUG -fmessage-length=0 -fPIC -Wall -o CMakeFiles/orocos-rtt-gnulinux_dynamic.dir/Activity.cpp.o -c /local/robotpkg/var/tmp/robotpkg/middleware/orocos-rtt/work/orocos-rtt-2.8.1/rtt/Activity.cpp [ 1%] Building CXX object rtt/CMakeFiles/orocos-rtt-gnulinux_dynamic.dir/Attribute.cpp.o cd /local/robotpkg/var/tmp/robotpkg/middleware/orocos-rtt/work/orocos-rtt-2.8.1/rtt && /usr/bin/g++ -DOROCOS_TARGET=gnulinux -DRTT_DLL_EXPORT -I/local/robotpkg/var/tmp/robotpkg/middleware/orocos-rtt/work/orocos-rtt-2.8.1/rtt/os/gnulinux -I/local/robotpkg/var/tmp/robotpkg/middleware/orocos-rtt/work/orocos-rtt-2.8.1/rtt/os -I/local/robotpkg/var/tmp/robotpkg/middleware/orocos-rtt/work/orocos-rtt-2.8.1/rtt -I/local/robotpkg/var/tmp/robotpkg/middleware/orocos-rtt/work/orocos-rtt-2.8.1 -pipe -O3 -DNDEBUG -fmessage-length=0 -fPIC -Wall -o CMakeFiles/orocos-rtt-gnulinux_dynamic.dir/Attribute.cpp.o -c /local/robotpkg/var/tmp/robotpkg/middleware/orocos-rtt/work/orocos-rtt-2.8.1/rtt/Attribute.cpp [ 1%] Building CXX object rtt/CMakeFiles/orocos-rtt-gnulinux_dynamic.dir/ConfigurationInterface.cpp.o cd /local/robotpkg/var/tmp/robotpkg/middleware/orocos-rtt/work/orocos-rtt-2.8.1/rtt && /usr/bin/g++ -DOROCOS_TARGET=gnulinux -DRTT_DLL_EXPORT -I/local/robotpkg/var/tmp/robotpkg/middleware/orocos-rtt/work/orocos-rtt-2.8.1/rtt/os/gnulinux -I/local/robotpkg/var/tmp/robotpkg/middleware/orocos-rtt/work/orocos-rtt-2.8.1/rtt/os -I/local/robotpkg/var/tmp/robotpkg/middleware/orocos-rtt/work/orocos-rtt-2.8.1/rtt -I/local/robotpkg/var/tmp/robotpkg/middleware/orocos-rtt/work/orocos-rtt-2.8.1 -pipe -O3 -DNDEBUG -fmessage-length=0 -fPIC -Wall -o CMakeFiles/orocos-rtt-gnulinux_dynamic.dir/ConfigurationInterface.cpp.o -c /local/robotpkg/var/tmp/robotpkg/middleware/orocos-rtt/work/orocos-rtt-2.8.1/rtt/ConfigurationInterface.cpp [ 2%] Building CXX object rtt/CMakeFiles/orocos-rtt-gnulinux_dynamic.dir/ConnPolicy.cpp.o cd /local/robotpkg/var/tmp/robotpkg/middleware/orocos-rtt/work/orocos-rtt-2.8.1/rtt && /usr/bin/g++ -DOROCOS_TARGET=gnulinux -DRTT_DLL_EXPORT -I/local/robotpkg/var/tmp/robotpkg/middleware/orocos-rtt/work/orocos-rtt-2.8.1/rtt/os/gnulinux -I/local/robotpkg/var/tmp/robotpkg/middleware/orocos-rtt/work/orocos-rtt-2.8.1/rtt/os -I/local/robotpkg/var/tmp/robotpkg/middleware/orocos-rtt/work/orocos-rtt-2.8.1/rtt -I/local/robotpkg/var/tmp/robotpkg/middleware/orocos-rtt/work/orocos-rtt-2.8.1 -pipe -O3 -DNDEBUG -fmessage-length=0 -fPIC -Wall -o CMakeFiles/orocos-rtt-gnulinux_dynamic.dir/ConnPolicy.cpp.o -c /local/robotpkg/var/tmp/robotpkg/middleware/orocos-rtt/work/orocos-rtt-2.8.1/rtt/ConnPolicy.cpp [ 2%] Building CXX object rtt/CMakeFiles/orocos-rtt-gnulinux_dynamic.dir/DataFlowInterface.cpp.o cd /local/robotpkg/var/tmp/robotpkg/middleware/orocos-rtt/work/orocos-rtt-2.8.1/rtt && /usr/bin/g++ -DOROCOS_TARGET=gnulinux -DRTT_DLL_EXPORT -I/local/robotpkg/var/tmp/robotpkg/middleware/orocos-rtt/work/orocos-rtt-2.8.1/rtt/os/gnulinux -I/local/robotpkg/var/tmp/robotpkg/middleware/orocos-rtt/work/orocos-rtt-2.8.1/rtt/os -I/local/robotpkg/var/tmp/robotpkg/middleware/orocos-rtt/work/orocos-rtt-2.8.1/rtt -I/local/robotpkg/var/tmp/robotpkg/middleware/orocos-rtt/work/orocos-rtt-2.8.1 -pipe -O3 -DNDEBUG -fmessage-length=0 -fPIC -Wall -o CMakeFiles/orocos-rtt-gnulinux_dynamic.dir/DataFlowInterface.cpp.o -c /local/robotpkg/var/tmp/robotpkg/middleware/orocos-rtt/work/orocos-rtt-2.8.1/rtt/DataFlowInterface.cpp [ 4%] Building CXX object rtt/CMakeFiles/orocos-rtt-gnulinux_dynamic.dir/ExecutionEngine.cpp.o cd /local/robotpkg/var/tmp/robotpkg/middleware/orocos-rtt/work/orocos-rtt-2.8.1/rtt && /usr/bin/g++ -DOROCOS_TARGET=gnulinux -DRTT_DLL_EXPORT -I/local/robotpkg/var/tmp/robotpkg/middleware/orocos-rtt/work/orocos-rtt-2.8.1/rtt/os/gnulinux -I/local/robotpkg/var/tmp/robotpkg/middleware/orocos-rtt/work/orocos-rtt-2.8.1/rtt/os -I/local/robotpkg/var/tmp/robotpkg/middleware/orocos-rtt/work/orocos-rtt-2.8.1/rtt -I/local/robotpkg/var/tmp/robotpkg/middleware/orocos-rtt/work/orocos-rtt-2.8.1 -pipe -O3 -DNDEBUG -fmessage-length=0 -fPIC -Wall -o CMakeFiles/orocos-rtt-gnulinux_dynamic.dir/ExecutionEngine.cpp.o -c /local/robotpkg/var/tmp/robotpkg/middleware/orocos-rtt/work/orocos-rtt-2.8.1/rtt/ExecutionEngine.cpp [ 4%] Building CXX object rtt/CMakeFiles/orocos-rtt-gnulinux_dynamic.dir/FactoryExceptions.cpp.o cd /local/robotpkg/var/tmp/robotpkg/middleware/orocos-rtt/work/orocos-rtt-2.8.1/rtt && /usr/bin/g++ -DOROCOS_TARGET=gnulinux -DRTT_DLL_EXPORT -I/local/robotpkg/var/tmp/robotpkg/middleware/orocos-rtt/work/orocos-rtt-2.8.1/rtt/os/gnulinux -I/local/robotpkg/var/tmp/robotpkg/middleware/orocos-rtt/work/orocos-rtt-2.8.1/rtt/os -I/local/robotpkg/var/tmp/robotpkg/middleware/orocos-rtt/work/orocos-rtt-2.8.1/rtt -I/local/robotpkg/var/tmp/robotpkg/middleware/orocos-rtt/work/orocos-rtt-2.8.1 -pipe -O3 -DNDEBUG -fmessage-length=0 -fPIC -Wall -o CMakeFiles/orocos-rtt-gnulinux_dynamic.dir/FactoryExceptions.cpp.o -c /local/robotpkg/var/tmp/robotpkg/middleware/orocos-rtt/work/orocos-rtt-2.8.1/rtt/FactoryExceptions.cpp [ 4%] Building CXX object rtt/CMakeFiles/orocos-rtt-gnulinux_dynamic.dir/FlowStatus.cpp.o cd /local/robotpkg/var/tmp/robotpkg/middleware/orocos-rtt/work/orocos-rtt-2.8.1/rtt && /usr/bin/g++ -DOROCOS_TARGET=gnulinux -DRTT_DLL_EXPORT -I/local/robotpkg/var/tmp/robotpkg/middleware/orocos-rtt/work/orocos-rtt-2.8.1/rtt/os/gnulinux -I/local/robotpkg/var/tmp/robotpkg/middleware/orocos-rtt/work/orocos-rtt-2.8.1/rtt/os -I/local/robotpkg/var/tmp/robotpkg/middleware/orocos-rtt/work/orocos-rtt-2.8.1/rtt -I/local/robotpkg/var/tmp/robotpkg/middleware/orocos-rtt/work/orocos-rtt-2.8.1 -pipe -O3 -DNDEBUG -fmessage-length=0 -fPIC -Wall -o CMakeFiles/orocos-rtt-gnulinux_dynamic.dir/FlowStatus.cpp.o -c /local/robotpkg/var/tmp/robotpkg/middleware/orocos-rtt/work/orocos-rtt-2.8.1/rtt/FlowStatus.cpp [ 5%] Building CXX object rtt/CMakeFiles/orocos-rtt-gnulinux_dynamic.dir/Handle.cpp.o cd /local/robotpkg/var/tmp/robotpkg/middleware/orocos-rtt/work/orocos-rtt-2.8.1/rtt && /usr/bin/g++ -DOROCOS_TARGET=gnulinux -DRTT_DLL_EXPORT -I/local/robotpkg/var/tmp/robotpkg/middleware/orocos-rtt/work/orocos-rtt-2.8.1/rtt/os/gnulinux -I/local/robotpkg/var/tmp/robotpkg/middleware/orocos-rtt/work/orocos-rtt-2.8.1/rtt/os -I/local/robotpkg/var/tmp/robotpkg/middleware/orocos-rtt/work/orocos-rtt-2.8.1/rtt -I/local/robotpkg/var/tmp/robotpkg/middleware/orocos-rtt/work/orocos-rtt-2.8.1 -pipe -O3 -DNDEBUG -fmessage-length=0 -fPIC -Wall -o CMakeFiles/orocos-rtt-gnulinux_dynamic.dir/Handle.cpp.o -c /local/robotpkg/var/tmp/robotpkg/middleware/orocos-rtt/work/orocos-rtt-2.8.1/rtt/Handle.cpp [ 5%] Building CXX object rtt/CMakeFiles/orocos-rtt-gnulinux_dynamic.dir/Logger.cpp.o cd /local/robotpkg/var/tmp/robotpkg/middleware/orocos-rtt/work/orocos-rtt-2.8.1/rtt && /usr/bin/g++ -DOROCOS_TARGET=gnulinux -DRTT_DLL_EXPORT -I/local/robotpkg/var/tmp/robotpkg/middleware/orocos-rtt/work/orocos-rtt-2.8.1/rtt/os/gnulinux -I/local/robotpkg/var/tmp/robotpkg/middleware/orocos-rtt/work/orocos-rtt-2.8.1/rtt/os -I/local/robotpkg/var/tmp/robotpkg/middleware/orocos-rtt/work/orocos-rtt-2.8.1/rtt -I/local/robotpkg/var/tmp/robotpkg/middleware/orocos-rtt/work/orocos-rtt-2.8.1 -pipe -O3 -DNDEBUG -fmessage-length=0 -fPIC -Wall -o CMakeFiles/orocos-rtt-gnulinux_dynamic.dir/Logger.cpp.o -c /local/robotpkg/var/tmp/robotpkg/middleware/orocos-rtt/work/orocos-rtt-2.8.1/rtt/Logger.cpp [ 6%] Building CXX object rtt/CMakeFiles/orocos-rtt-gnulinux_dynamic.dir/Operation.cpp.o cd /local/robotpkg/var/tmp/robotpkg/middleware/orocos-rtt/work/orocos-rtt-2.8.1/rtt && /usr/bin/g++ -DOROCOS_TARGET=gnulinux -DRTT_DLL_EXPORT -I/local/robotpkg/var/tmp/robotpkg/middleware/orocos-rtt/work/orocos-rtt-2.8.1/rtt/os/gnulinux -I/local/robotpkg/var/tmp/robotpkg/middleware/orocos-rtt/work/orocos-rtt-2.8.1/rtt/os -I/local/robotpkg/var/tmp/robotpkg/middleware/orocos-rtt/work/orocos-rtt-2.8.1/rtt -I/local/robotpkg/var/tmp/robotpkg/middleware/orocos-rtt/work/orocos-rtt-2.8.1 -pipe -O3 -DNDEBUG -fmessage-length=0 -fPIC -Wall -o CMakeFiles/orocos-rtt-gnulinux_dynamic.dir/Operation.cpp.o -c /local/robotpkg/var/tmp/robotpkg/middleware/orocos-rtt/work/orocos-rtt-2.8.1/rtt/Operation.cpp [ 6%] Building CXX object rtt/CMakeFiles/orocos-rtt-gnulinux_dynamic.dir/OperationInterface.cpp.o cd /local/robotpkg/var/tmp/robotpkg/middleware/orocos-rtt/work/orocos-rtt-2.8.1/rtt && /usr/bin/g++ -DOROCOS_TARGET=gnulinux -DRTT_DLL_EXPORT -I/local/robotpkg/var/tmp/robotpkg/middleware/orocos-rtt/work/orocos-rtt-2.8.1/rtt/os/gnulinux -I/local/robotpkg/var/tmp/robotpkg/middleware/orocos-rtt/work/orocos-rtt-2.8.1/rtt/os -I/local/robotpkg/var/tmp/robotpkg/middleware/orocos-rtt/work/orocos-rtt-2.8.1/rtt -I/local/robotpkg/var/tmp/robotpkg/middleware/orocos-rtt/work/orocos-rtt-2.8.1 -pipe -O3 -DNDEBUG -fmessage-length=0 -fPIC -Wall -o CMakeFiles/orocos-rtt-gnulinux_dynamic.dir/OperationInterface.cpp.o -c /local/robotpkg/var/tmp/robotpkg/middleware/orocos-rtt/work/orocos-rtt-2.8.1/rtt/OperationInterface.cpp [ 8%] Building CXX object rtt/CMakeFiles/orocos-rtt-gnulinux_dynamic.dir/Property.cpp.o cd /local/robotpkg/var/tmp/robotpkg/middleware/orocos-rtt/work/orocos-rtt-2.8.1/rtt && /usr/bin/g++ -DOROCOS_TARGET=gnulinux -DRTT_DLL_EXPORT -I/local/robotpkg/var/tmp/robotpkg/middleware/orocos-rtt/work/orocos-rtt-2.8.1/rtt/os/gnulinux -I/local/robotpkg/var/tmp/robotpkg/middleware/orocos-rtt/work/orocos-rtt-2.8.1/rtt/os -I/local/robotpkg/var/tmp/robotpkg/middleware/orocos-rtt/work/orocos-rtt-2.8.1/rtt -I/local/robotpkg/var/tmp/robotpkg/middleware/orocos-rtt/work/orocos-rtt-2.8.1 -pipe -O3 -DNDEBUG -fmessage-length=0 -fPIC -Wall -o CMakeFiles/orocos-rtt-gnulinux_dynamic.dir/Property.cpp.o -c /local/robotpkg/var/tmp/robotpkg/middleware/orocos-rtt/work/orocos-rtt-2.8.1/rtt/Property.cpp [ 8%] Building CXX object rtt/CMakeFiles/orocos-rtt-gnulinux_dynamic.dir/PropertyBag.cpp.o cd /local/robotpkg/var/tmp/robotpkg/middleware/orocos-rtt/work/orocos-rtt-2.8.1/rtt && /usr/bin/g++ -DOROCOS_TARGET=gnulinux -DRTT_DLL_EXPORT -I/local/robotpkg/var/tmp/robotpkg/middleware/orocos-rtt/work/orocos-rtt-2.8.1/rtt/os/gnulinux -I/local/robotpkg/var/tmp/robotpkg/middleware/orocos-rtt/work/orocos-rtt-2.8.1/rtt/os -I/local/robotpkg/var/tmp/robotpkg/middleware/orocos-rtt/work/orocos-rtt-2.8.1/rtt -I/local/robotpkg/var/tmp/robotpkg/middleware/orocos-rtt/work/orocos-rtt-2.8.1 -pipe -O3 -DNDEBUG -fmessage-length=0 -fPIC -Wall -o CMakeFiles/orocos-rtt-gnulinux_dynamic.dir/PropertyBag.cpp.o -c /local/robotpkg/var/tmp/robotpkg/middleware/orocos-rtt/work/orocos-rtt-2.8.1/rtt/PropertyBag.cpp [ 8%] Building CXX object rtt/CMakeFiles/orocos-rtt-gnulinux_dynamic.dir/SendStatus.cpp.o cd /local/robotpkg/var/tmp/robotpkg/middleware/orocos-rtt/work/orocos-rtt-2.8.1/rtt && /usr/bin/g++ -DOROCOS_TARGET=gnulinux -DRTT_DLL_EXPORT -I/local/robotpkg/var/tmp/robotpkg/middleware/orocos-rtt/work/orocos-rtt-2.8.1/rtt/os/gnulinux -I/local/robotpkg/var/tmp/robotpkg/middleware/orocos-rtt/work/orocos-rtt-2.8.1/rtt/os -I/local/robotpkg/var/tmp/robotpkg/middleware/orocos-rtt/work/orocos-rtt-2.8.1/rtt -I/local/robotpkg/var/tmp/robotpkg/middleware/orocos-rtt/work/orocos-rtt-2.8.1 -pipe -O3 -DNDEBUG -fmessage-length=0 -fPIC -Wall -o CMakeFiles/orocos-rtt-gnulinux_dynamic.dir/SendStatus.cpp.o -c /local/robotpkg/var/tmp/robotpkg/middleware/orocos-rtt/work/orocos-rtt-2.8.1/rtt/SendStatus.cpp [ 9%] Building CXX object rtt/CMakeFiles/orocos-rtt-gnulinux_dynamic.dir/Service.cpp.o cd /local/robotpkg/var/tmp/robotpkg/middleware/orocos-rtt/work/orocos-rtt-2.8.1/rtt && /usr/bin/g++ -DOROCOS_TARGET=gnulinux -DRTT_DLL_EXPORT -I/local/robotpkg/var/tmp/robotpkg/middleware/orocos-rtt/work/orocos-rtt-2.8.1/rtt/os/gnulinux -I/local/robotpkg/var/tmp/robotpkg/middleware/orocos-rtt/work/orocos-rtt-2.8.1/rtt/os -I/local/robotpkg/var/tmp/robotpkg/middleware/orocos-rtt/work/orocos-rtt-2.8.1/rtt -I/local/robotpkg/var/tmp/robotpkg/middleware/orocos-rtt/work/orocos-rtt-2.8.1 -pipe -O3 -DNDEBUG -fmessage-length=0 -fPIC -Wall -o CMakeFiles/orocos-rtt-gnulinux_dynamic.dir/Service.cpp.o -c /local/robotpkg/var/tmp/robotpkg/middleware/orocos-rtt/work/orocos-rtt-2.8.1/rtt/Service.cpp [ 9%] Building CXX object rtt/CMakeFiles/orocos-rtt-gnulinux_dynamic.dir/ServiceRequester.cpp.o cd /local/robotpkg/var/tmp/robotpkg/middleware/orocos-rtt/work/orocos-rtt-2.8.1/rtt && /usr/bin/g++ -DOROCOS_TARGET=gnulinux -DRTT_DLL_EXPORT -I/local/robotpkg/var/tmp/robotpkg/middleware/orocos-rtt/work/orocos-rtt-2.8.1/rtt/os/gnulinux -I/local/robotpkg/var/tmp/robotpkg/middleware/orocos-rtt/work/orocos-rtt-2.8.1/rtt/os -I/local/robotpkg/var/tmp/robotpkg/middleware/orocos-rtt/work/orocos-rtt-2.8.1/rtt -I/local/robotpkg/var/tmp/robotpkg/middleware/orocos-rtt/work/orocos-rtt-2.8.1 -pipe -O3 -DNDEBUG -fmessage-length=0 -fPIC -Wall -o CMakeFiles/orocos-rtt-gnulinux_dynamic.dir/ServiceRequester.cpp.o -c /local/robotpkg/var/tmp/robotpkg/middleware/orocos-rtt/work/orocos-rtt-2.8.1/rtt/ServiceRequester.cpp [ 11%] Building CXX object rtt/CMakeFiles/orocos-rtt-gnulinux_dynamic.dir/TaskContext.cpp.o cd /local/robotpkg/var/tmp/robotpkg/middleware/orocos-rtt/work/orocos-rtt-2.8.1/rtt && /usr/bin/g++ -DOROCOS_TARGET=gnulinux -DRTT_DLL_EXPORT -I/local/robotpkg/var/tmp/robotpkg/middleware/orocos-rtt/work/orocos-rtt-2.8.1/rtt/os/gnulinux -I/local/robotpkg/var/tmp/robotpkg/middleware/orocos-rtt/work/orocos-rtt-2.8.1/rtt/os -I/local/robotpkg/var/tmp/robotpkg/middleware/orocos-rtt/work/orocos-rtt-2.8.1/rtt -I/local/robotpkg/var/tmp/robotpkg/middleware/orocos-rtt/work/orocos-rtt-2.8.1 -pipe -O3 -DNDEBUG -fmessage-length=0 -fPIC -Wall -o CMakeFiles/orocos-rtt-gnulinux_dynamic.dir/TaskContext.cpp.o -c /local/robotpkg/var/tmp/robotpkg/middleware/orocos-rtt/work/orocos-rtt-2.8.1/rtt/TaskContext.cpp /local/robotpkg/var/tmp/robotpkg/middleware/orocos-rtt/work/orocos-rtt-2.8.1/rtt/PropertyBag.cpp: In member function 'bool RTT::PropertyBag::addProperty(RTT::base::PropertyBase&)': /local/robotpkg/var/tmp/robotpkg/middleware/orocos-rtt/work/orocos-rtt-2.8.1/rtt/PropertyBag.cpp:107:16: warning: the compiler can assume that the address of 'p' will never be NULL [-Waddress] if (&p == 0) ~~~^~~~ /local/robotpkg/var/tmp/robotpkg/middleware/orocos-rtt/work/orocos-rtt-2.8.1/rtt/PropertyBag.cpp:107:9: warning: nonnull argument 'p' compared to NULL [-Wnonnull-compare] if (&p == 0) ^~ [ 11%] Building C object rtt/CMakeFiles/orocos-rtt-gnulinux_dynamic.dir/os/tlsf/tlsf.c.o cd /local/robotpkg/var/tmp/robotpkg/middleware/orocos-rtt/work/orocos-rtt-2.8.1/rtt && /usr/bin/gcc -DOROCOS_TARGET=gnulinux -DRTT_DLL_EXPORT -I/local/robotpkg/var/tmp/robotpkg/middleware/orocos-rtt/work/orocos-rtt-2.8.1/rtt/os/gnulinux -I/local/robotpkg/var/tmp/robotpkg/middleware/orocos-rtt/work/orocos-rtt-2.8.1/rtt/os -I/local/robotpkg/var/tmp/robotpkg/middleware/orocos-rtt/work/orocos-rtt-2.8.1/rtt -I/local/robotpkg/var/tmp/robotpkg/middleware/orocos-rtt/work/orocos-rtt-2.8.1 -pipe -O3 -DNDEBUG -fPIC -Wall -DUSE_SBRK -DUSE_MMAP -D_GNU_SOURCE -DTLSF_STATISTIC -o CMakeFiles/orocos-rtt-gnulinux_dynamic.dir/os/tlsf/tlsf.c.o -c /local/robotpkg/var/tmp/robotpkg/middleware/orocos-rtt/work/orocos-rtt-2.8.1/rtt/os/tlsf/tlsf.c [ 11%] Building CXX object rtt/CMakeFiles/orocos-rtt-gnulinux_dynamic.dir/os/MainThread.cpp.o cd /local/robotpkg/var/tmp/robotpkg/middleware/orocos-rtt/work/orocos-rtt-2.8.1/rtt && /usr/bin/g++ -DOROCOS_TARGET=gnulinux -DRTT_DLL_EXPORT -I/local/robotpkg/var/tmp/robotpkg/middleware/orocos-rtt/work/orocos-rtt-2.8.1/rtt/os/gnulinux -I/local/robotpkg/var/tmp/robotpkg/middleware/orocos-rtt/work/orocos-rtt-2.8.1/rtt/os -I/local/robotpkg/var/tmp/robotpkg/middleware/orocos-rtt/work/orocos-rtt-2.8.1/rtt -I/local/robotpkg/var/tmp/robotpkg/middleware/orocos-rtt/work/orocos-rtt-2.8.1 -pipe -O3 -DNDEBUG -fmessage-length=0 -fPIC -Wall -o CMakeFiles/orocos-rtt-gnulinux_dynamic.dir/os/MainThread.cpp.o -c /local/robotpkg/var/tmp/robotpkg/middleware/orocos-rtt/work/orocos-rtt-2.8.1/rtt/os/MainThread.cpp [ 12%] Building CXX object rtt/CMakeFiles/orocos-rtt-gnulinux_dynamic.dir/os/Mutex.cpp.o cd /local/robotpkg/var/tmp/robotpkg/middleware/orocos-rtt/work/orocos-rtt-2.8.1/rtt && /usr/bin/g++ -DOROCOS_TARGET=gnulinux -DRTT_DLL_EXPORT -I/local/robotpkg/var/tmp/robotpkg/middleware/orocos-rtt/work/orocos-rtt-2.8.1/rtt/os/gnulinux -I/local/robotpkg/var/tmp/robotpkg/middleware/orocos-rtt/work/orocos-rtt-2.8.1/rtt/os -I/local/robotpkg/var/tmp/robotpkg/middleware/orocos-rtt/work/orocos-rtt-2.8.1/rtt -I/local/robotpkg/var/tmp/robotpkg/middleware/orocos-rtt/work/orocos-rtt-2.8.1 -pipe -O3 -DNDEBUG -fmessage-length=0 -fPIC -Wall -o CMakeFiles/orocos-rtt-gnulinux_dynamic.dir/os/Mutex.cpp.o -c /local/robotpkg/var/tmp/robotpkg/middleware/orocos-rtt/work/orocos-rtt-2.8.1/rtt/os/Mutex.cpp [ 12%] Building CXX object rtt/CMakeFiles/orocos-rtt-gnulinux_dynamic.dir/os/StartStopManager.cpp.o cd /local/robotpkg/var/tmp/robotpkg/middleware/orocos-rtt/work/orocos-rtt-2.8.1/rtt && /usr/bin/g++ -DOROCOS_TARGET=gnulinux -DRTT_DLL_EXPORT -I/local/robotpkg/var/tmp/robotpkg/middleware/orocos-rtt/work/orocos-rtt-2.8.1/rtt/os/gnulinux -I/local/robotpkg/var/tmp/robotpkg/middleware/orocos-rtt/work/orocos-rtt-2.8.1/rtt/os -I/local/robotpkg/var/tmp/robotpkg/middleware/orocos-rtt/work/orocos-rtt-2.8.1/rtt -I/local/robotpkg/var/tmp/robotpkg/middleware/orocos-rtt/work/orocos-rtt-2.8.1 -pipe -O3 -DNDEBUG -fmessage-length=0 -fPIC -Wall -o CMakeFiles/orocos-rtt-gnulinux_dynamic.dir/os/StartStopManager.cpp.o -c /local/robotpkg/var/tmp/robotpkg/middleware/orocos-rtt/work/orocos-rtt-2.8.1/rtt/os/StartStopManager.cpp [ 13%] Building CXX object rtt/CMakeFiles/orocos-rtt-gnulinux_dynamic.dir/os/Thread.cpp.o cd /local/robotpkg/var/tmp/robotpkg/middleware/orocos-rtt/work/orocos-rtt-2.8.1/rtt && /usr/bin/g++ -DOROCOS_TARGET=gnulinux -DRTT_DLL_EXPORT -I/local/robotpkg/var/tmp/robotpkg/middleware/orocos-rtt/work/orocos-rtt-2.8.1/rtt/os/gnulinux -I/local/robotpkg/var/tmp/robotpkg/middleware/orocos-rtt/work/orocos-rtt-2.8.1/rtt/os -I/local/robotpkg/var/tmp/robotpkg/middleware/orocos-rtt/work/orocos-rtt-2.8.1/rtt -I/local/robotpkg/var/tmp/robotpkg/middleware/orocos-rtt/work/orocos-rtt-2.8.1 -pipe -O3 -DNDEBUG -fmessage-length=0 -fPIC -Wall -o CMakeFiles/orocos-rtt-gnulinux_dynamic.dir/os/Thread.cpp.o -c /local/robotpkg/var/tmp/robotpkg/middleware/orocos-rtt/work/orocos-rtt-2.8.1/rtt/os/Thread.cpp [ 13%] Building CXX object rtt/CMakeFiles/orocos-rtt-gnulinux_dynamic.dir/os/ThreadInterface.cpp.o cd /local/robotpkg/var/tmp/robotpkg/middleware/orocos-rtt/work/orocos-rtt-2.8.1/rtt && /usr/bin/g++ -DOROCOS_TARGET=gnulinux -DRTT_DLL_EXPORT -I/local/robotpkg/var/tmp/robotpkg/middleware/orocos-rtt/work/orocos-rtt-2.8.1/rtt/os/gnulinux -I/local/robotpkg/var/tmp/robotpkg/middleware/orocos-rtt/work/orocos-rtt-2.8.1/rtt/os -I/local/robotpkg/var/tmp/robotpkg/middleware/orocos-rtt/work/orocos-rtt-2.8.1/rtt -I/local/robotpkg/var/tmp/robotpkg/middleware/orocos-rtt/work/orocos-rtt-2.8.1 -pipe -O3 -DNDEBUG -fmessage-length=0 -fPIC -Wall -o CMakeFiles/orocos-rtt-gnulinux_dynamic.dir/os/ThreadInterface.cpp.o -c /local/robotpkg/var/tmp/robotpkg/middleware/orocos-rtt/work/orocos-rtt-2.8.1/rtt/os/ThreadInterface.cpp [ 15%] Building CXX object rtt/CMakeFiles/orocos-rtt-gnulinux_dynamic.dir/os/TimeService.cpp.o cd /local/robotpkg/var/tmp/robotpkg/middleware/orocos-rtt/work/orocos-rtt-2.8.1/rtt && /usr/bin/g++ -DOROCOS_TARGET=gnulinux -DRTT_DLL_EXPORT -I/local/robotpkg/var/tmp/robotpkg/middleware/orocos-rtt/work/orocos-rtt-2.8.1/rtt/os/gnulinux -I/local/robotpkg/var/tmp/robotpkg/middleware/orocos-rtt/work/orocos-rtt-2.8.1/rtt/os -I/local/robotpkg/var/tmp/robotpkg/middleware/orocos-rtt/work/orocos-rtt-2.8.1/rtt -I/local/robotpkg/var/tmp/robotpkg/middleware/orocos-rtt/work/orocos-rtt-2.8.1 -pipe -O3 -DNDEBUG -fmessage-length=0 -fPIC -Wall -o CMakeFiles/orocos-rtt-gnulinux_dynamic.dir/os/TimeService.cpp.o -c /local/robotpkg/var/tmp/robotpkg/middleware/orocos-rtt/work/orocos-rtt-2.8.1/rtt/os/TimeService.cpp [ 15%] Building CXX object rtt/CMakeFiles/orocos-rtt-gnulinux_dynamic.dir/os/Timer.cpp.o cd /local/robotpkg/var/tmp/robotpkg/middleware/orocos-rtt/work/orocos-rtt-2.8.1/rtt && /usr/bin/g++ -DOROCOS_TARGET=gnulinux -DRTT_DLL_EXPORT -I/local/robotpkg/var/tmp/robotpkg/middleware/orocos-rtt/work/orocos-rtt-2.8.1/rtt/os/gnulinux -I/local/robotpkg/var/tmp/robotpkg/middleware/orocos-rtt/work/orocos-rtt-2.8.1/rtt/os -I/local/robotpkg/var/tmp/robotpkg/middleware/orocos-rtt/work/orocos-rtt-2.8.1/rtt -I/local/robotpkg/var/tmp/robotpkg/middleware/orocos-rtt/work/orocos-rtt-2.8.1 -pipe -O3 -DNDEBUG -fmessage-length=0 -fPIC -Wall -o CMakeFiles/orocos-rtt-gnulinux_dynamic.dir/os/Timer.cpp.o -c /local/robotpkg/var/tmp/robotpkg/middleware/orocos-rtt/work/orocos-rtt-2.8.1/rtt/os/Timer.cpp [ 15%] Building CXX object rtt/CMakeFiles/orocos-rtt-gnulinux_dynamic.dir/os/exceptions.cpp.o cd /local/robotpkg/var/tmp/robotpkg/middleware/orocos-rtt/work/orocos-rtt-2.8.1/rtt && /usr/bin/g++ -DOROCOS_TARGET=gnulinux -DRTT_DLL_EXPORT -I/local/robotpkg/var/tmp/robotpkg/middleware/orocos-rtt/work/orocos-rtt-2.8.1/rtt/os/gnulinux -I/local/robotpkg/var/tmp/robotpkg/middleware/orocos-rtt/work/orocos-rtt-2.8.1/rtt/os -I/local/robotpkg/var/tmp/robotpkg/middleware/orocos-rtt/work/orocos-rtt-2.8.1/rtt -I/local/robotpkg/var/tmp/robotpkg/middleware/orocos-rtt/work/orocos-rtt-2.8.1 -pipe -O3 -DNDEBUG -fmessage-length=0 -fPIC -Wall -o CMakeFiles/orocos-rtt-gnulinux_dynamic.dir/os/exceptions.cpp.o -c /local/robotpkg/var/tmp/robotpkg/middleware/orocos-rtt/work/orocos-rtt-2.8.1/rtt/os/exceptions.cpp [ 16%] Building CXX object rtt/CMakeFiles/orocos-rtt-gnulinux_dynamic.dir/os/rint.cpp.o cd /local/robotpkg/var/tmp/robotpkg/middleware/orocos-rtt/work/orocos-rtt-2.8.1/rtt && /usr/bin/g++ -DOROCOS_TARGET=gnulinux -DRTT_DLL_EXPORT -I/local/robotpkg/var/tmp/robotpkg/middleware/orocos-rtt/work/orocos-rtt-2.8.1/rtt/os/gnulinux -I/local/robotpkg/var/tmp/robotpkg/middleware/orocos-rtt/work/orocos-rtt-2.8.1/rtt/os -I/local/robotpkg/var/tmp/robotpkg/middleware/orocos-rtt/work/orocos-rtt-2.8.1/rtt -I/local/robotpkg/var/tmp/robotpkg/middleware/orocos-rtt/work/orocos-rtt-2.8.1 -pipe -O3 -DNDEBUG -fmessage-length=0 -fPIC -Wall -o CMakeFiles/orocos-rtt-gnulinux_dynamic.dir/os/rint.cpp.o -c /local/robotpkg/var/tmp/robotpkg/middleware/orocos-rtt/work/orocos-rtt-2.8.1/rtt/os/rint.cpp [ 16%] Building CXX object rtt/CMakeFiles/orocos-rtt-gnulinux_dynamic.dir/os/rtconversions.cpp.o cd /local/robotpkg/var/tmp/robotpkg/middleware/orocos-rtt/work/orocos-rtt-2.8.1/rtt && /usr/bin/g++ -DOROCOS_TARGET=gnulinux -DRTT_DLL_EXPORT -I/local/robotpkg/var/tmp/robotpkg/middleware/orocos-rtt/work/orocos-rtt-2.8.1/rtt/os/gnulinux -I/local/robotpkg/var/tmp/robotpkg/middleware/orocos-rtt/work/orocos-rtt-2.8.1/rtt/os -I/local/robotpkg/var/tmp/robotpkg/middleware/orocos-rtt/work/orocos-rtt-2.8.1/rtt -I/local/robotpkg/var/tmp/robotpkg/middleware/orocos-rtt/work/orocos-rtt-2.8.1 -pipe -O3 -DNDEBUG -fmessage-length=0 -fPIC -Wall -o CMakeFiles/orocos-rtt-gnulinux_dynamic.dir/os/rtconversions.cpp.o -c /local/robotpkg/var/tmp/robotpkg/middleware/orocos-rtt/work/orocos-rtt-2.8.1/rtt/os/rtconversions.cpp [ 18%] Building CXX object rtt/CMakeFiles/orocos-rtt-gnulinux_dynamic.dir/os/rtstreams.cpp.o cd /local/robotpkg/var/tmp/robotpkg/middleware/orocos-rtt/work/orocos-rtt-2.8.1/rtt && /usr/bin/g++ -DOROCOS_TARGET=gnulinux -DRTT_DLL_EXPORT -I/local/robotpkg/var/tmp/robotpkg/middleware/orocos-rtt/work/orocos-rtt-2.8.1/rtt/os/gnulinux -I/local/robotpkg/var/tmp/robotpkg/middleware/orocos-rtt/work/orocos-rtt-2.8.1/rtt/os -I/local/robotpkg/var/tmp/robotpkg/middleware/orocos-rtt/work/orocos-rtt-2.8.1/rtt -I/local/robotpkg/var/tmp/robotpkg/middleware/orocos-rtt/work/orocos-rtt-2.8.1 -pipe -O3 -DNDEBUG -fmessage-length=0 -fPIC -Wall -o CMakeFiles/orocos-rtt-gnulinux_dynamic.dir/os/rtstreams.cpp.o -c /local/robotpkg/var/tmp/robotpkg/middleware/orocos-rtt/work/orocos-rtt-2.8.1/rtt/os/rtstreams.cpp [ 18%] Building CXX object rtt/CMakeFiles/orocos-rtt-gnulinux_dynamic.dir/os/startstop.cpp.o cd /local/robotpkg/var/tmp/robotpkg/middleware/orocos-rtt/work/orocos-rtt-2.8.1/rtt && /usr/bin/g++ -DOROCOS_TARGET=gnulinux -DRTT_DLL_EXPORT -I/local/robotpkg/var/tmp/robotpkg/middleware/orocos-rtt/work/orocos-rtt-2.8.1/rtt/os/gnulinux -I/local/robotpkg/var/tmp/robotpkg/middleware/orocos-rtt/work/orocos-rtt-2.8.1/rtt/os -I/local/robotpkg/var/tmp/robotpkg/middleware/orocos-rtt/work/orocos-rtt-2.8.1/rtt -I/local/robotpkg/var/tmp/robotpkg/middleware/orocos-rtt/work/orocos-rtt-2.8.1 -pipe -O3 -DNDEBUG -fmessage-length=0 -fPIC -Wall -o CMakeFiles/orocos-rtt-gnulinux_dynamic.dir/os/startstop.cpp.o -c /local/robotpkg/var/tmp/robotpkg/middleware/orocos-rtt/work/orocos-rtt-2.8.1/rtt/os/startstop.cpp [ 19%] Building CXX object rtt/CMakeFiles/orocos-rtt-gnulinux_dynamic.dir/os/threads.cpp.o cd /local/robotpkg/var/tmp/robotpkg/middleware/orocos-rtt/work/orocos-rtt-2.8.1/rtt && /usr/bin/g++ -DOROCOS_TARGET=gnulinux -DRTT_DLL_EXPORT -I/local/robotpkg/var/tmp/robotpkg/middleware/orocos-rtt/work/orocos-rtt-2.8.1/rtt/os/gnulinux -I/local/robotpkg/var/tmp/robotpkg/middleware/orocos-rtt/work/orocos-rtt-2.8.1/rtt/os -I/local/robotpkg/var/tmp/robotpkg/middleware/orocos-rtt/work/orocos-rtt-2.8.1/rtt -I/local/robotpkg/var/tmp/robotpkg/middleware/orocos-rtt/work/orocos-rtt-2.8.1 -pipe -O3 -DNDEBUG -fmessage-length=0 -fPIC -Wall -o CMakeFiles/orocos-rtt-gnulinux_dynamic.dir/os/threads.cpp.o -c /local/robotpkg/var/tmp/robotpkg/middleware/orocos-rtt/work/orocos-rtt-2.8.1/rtt/os/threads.cpp [ 19%] Building CXX object rtt/CMakeFiles/orocos-rtt-gnulinux_dynamic.dir/os/gnulinux/fosi_internal.cpp.o cd /local/robotpkg/var/tmp/robotpkg/middleware/orocos-rtt/work/orocos-rtt-2.8.1/rtt && /usr/bin/g++ -DOROCOS_TARGET=gnulinux -DRTT_DLL_EXPORT -I/local/robotpkg/var/tmp/robotpkg/middleware/orocos-rtt/work/orocos-rtt-2.8.1/rtt/os/gnulinux -I/local/robotpkg/var/tmp/robotpkg/middleware/orocos-rtt/work/orocos-rtt-2.8.1/rtt/os -I/local/robotpkg/var/tmp/robotpkg/middleware/orocos-rtt/work/orocos-rtt-2.8.1/rtt -I/local/robotpkg/var/tmp/robotpkg/middleware/orocos-rtt/work/orocos-rtt-2.8.1 -pipe -O3 -DNDEBUG -fmessage-length=0 -fPIC -Wall -o CMakeFiles/orocos-rtt-gnulinux_dynamic.dir/os/gnulinux/fosi_internal.cpp.o -c /local/robotpkg/var/tmp/robotpkg/middleware/orocos-rtt/work/orocos-rtt-2.8.1/rtt/os/gnulinux/fosi_internal.cpp [ 19%] Building CXX object rtt/CMakeFiles/orocos-rtt-gnulinux_dynamic.dir/os/gnulinux/gnuthreads.cpp.o cd /local/robotpkg/var/tmp/robotpkg/middleware/orocos-rtt/work/orocos-rtt-2.8.1/rtt && /usr/bin/g++ -DOROCOS_TARGET=gnulinux -DRTT_DLL_EXPORT -I/local/robotpkg/var/tmp/robotpkg/middleware/orocos-rtt/work/orocos-rtt-2.8.1/rtt/os/gnulinux -I/local/robotpkg/var/tmp/robotpkg/middleware/orocos-rtt/work/orocos-rtt-2.8.1/rtt/os -I/local/robotpkg/var/tmp/robotpkg/middleware/orocos-rtt/work/orocos-rtt-2.8.1/rtt -I/local/robotpkg/var/tmp/robotpkg/middleware/orocos-rtt/work/orocos-rtt-2.8.1 -pipe -O3 -DNDEBUG -fmessage-length=0 -fPIC -Wall -o CMakeFiles/orocos-rtt-gnulinux_dynamic.dir/os/gnulinux/gnuthreads.cpp.o -c /local/robotpkg/var/tmp/robotpkg/middleware/orocos-rtt/work/orocos-rtt-2.8.1/rtt/os/gnulinux/gnuthreads.cpp [ 20%] Building C object rtt/CMakeFiles/orocos-rtt-gnulinux_dynamic.dir/os/gnulinux/fosi.c.o cd /local/robotpkg/var/tmp/robotpkg/middleware/orocos-rtt/work/orocos-rtt-2.8.1/rtt && /usr/bin/gcc -DOROCOS_TARGET=gnulinux -DRTT_DLL_EXPORT -I/local/robotpkg/var/tmp/robotpkg/middleware/orocos-rtt/work/orocos-rtt-2.8.1/rtt/os/gnulinux -I/local/robotpkg/var/tmp/robotpkg/middleware/orocos-rtt/work/orocos-rtt-2.8.1/rtt/os -I/local/robotpkg/var/tmp/robotpkg/middleware/orocos-rtt/work/orocos-rtt-2.8.1/rtt -I/local/robotpkg/var/tmp/robotpkg/middleware/orocos-rtt/work/orocos-rtt-2.8.1 -pipe -O3 -DNDEBUG -fPIC -Wall -o CMakeFiles/orocos-rtt-gnulinux_dynamic.dir/os/gnulinux/fosi.c.o -c /local/robotpkg/var/tmp/robotpkg/middleware/orocos-rtt/work/orocos-rtt-2.8.1/rtt/os/gnulinux/fosi.c [ 20%] Building CXX object rtt/CMakeFiles/orocos-rtt-gnulinux_dynamic.dir/base/ActionInterface.cpp.o cd /local/robotpkg/var/tmp/robotpkg/middleware/orocos-rtt/work/orocos-rtt-2.8.1/rtt && /usr/bin/g++ -DOROCOS_TARGET=gnulinux -DRTT_DLL_EXPORT -I/local/robotpkg/var/tmp/robotpkg/middleware/orocos-rtt/work/orocos-rtt-2.8.1/rtt/os/gnulinux -I/local/robotpkg/var/tmp/robotpkg/middleware/orocos-rtt/work/orocos-rtt-2.8.1/rtt/os -I/local/robotpkg/var/tmp/robotpkg/middleware/orocos-rtt/work/orocos-rtt-2.8.1/rtt -I/local/robotpkg/var/tmp/robotpkg/middleware/orocos-rtt/work/orocos-rtt-2.8.1 -pipe -O3 -DNDEBUG -fmessage-length=0 -fPIC -Wall -o CMakeFiles/orocos-rtt-gnulinux_dynamic.dir/base/ActionInterface.cpp.o -c /local/robotpkg/var/tmp/robotpkg/middleware/orocos-rtt/work/orocos-rtt-2.8.1/rtt/base/ActionInterface.cpp [ 22%] Building CXX object rtt/CMakeFiles/orocos-rtt-gnulinux_dynamic.dir/base/ActivityInterface.cpp.o cd /local/robotpkg/var/tmp/robotpkg/middleware/orocos-rtt/work/orocos-rtt-2.8.1/rtt && /usr/bin/g++ -DOROCOS_TARGET=gnulinux -DRTT_DLL_EXPORT -I/local/robotpkg/var/tmp/robotpkg/middleware/orocos-rtt/work/orocos-rtt-2.8.1/rtt/os/gnulinux -I/local/robotpkg/var/tmp/robotpkg/middleware/orocos-rtt/work/orocos-rtt-2.8.1/rtt/os -I/local/robotpkg/var/tmp/robotpkg/middleware/orocos-rtt/work/orocos-rtt-2.8.1/rtt -I/local/robotpkg/var/tmp/robotpkg/middleware/orocos-rtt/work/orocos-rtt-2.8.1 -pipe -O3 -DNDEBUG -fmessage-length=0 -fPIC -Wall -o CMakeFiles/orocos-rtt-gnulinux_dynamic.dir/base/ActivityInterface.cpp.o -c /local/robotpkg/var/tmp/robotpkg/middleware/orocos-rtt/work/orocos-rtt-2.8.1/rtt/base/ActivityInterface.cpp [ 22%] Building CXX object rtt/CMakeFiles/orocos-rtt-gnulinux_dynamic.dir/base/BufferBase.cpp.o cd /local/robotpkg/var/tmp/robotpkg/middleware/orocos-rtt/work/orocos-rtt-2.8.1/rtt && /usr/bin/g++ -DOROCOS_TARGET=gnulinux -DRTT_DLL_EXPORT -I/local/robotpkg/var/tmp/robotpkg/middleware/orocos-rtt/work/orocos-rtt-2.8.1/rtt/os/gnulinux -I/local/robotpkg/var/tmp/robotpkg/middleware/orocos-rtt/work/orocos-rtt-2.8.1/rtt/os -I/local/robotpkg/var/tmp/robotpkg/middleware/orocos-rtt/work/orocos-rtt-2.8.1/rtt -I/local/robotpkg/var/tmp/robotpkg/middleware/orocos-rtt/work/orocos-rtt-2.8.1 -pipe -O3 -DNDEBUG -fmessage-length=0 -fPIC -Wall -o CMakeFiles/orocos-rtt-gnulinux_dynamic.dir/base/BufferBase.cpp.o -c /local/robotpkg/var/tmp/robotpkg/middleware/orocos-rtt/work/orocos-rtt-2.8.1/rtt/base/BufferBase.cpp [ 22%] Building CXX object rtt/CMakeFiles/orocos-rtt-gnulinux_dynamic.dir/base/BufferLockFree.cpp.o cd /local/robotpkg/var/tmp/robotpkg/middleware/orocos-rtt/work/orocos-rtt-2.8.1/rtt && /usr/bin/g++ -DOROCOS_TARGET=gnulinux -DRTT_DLL_EXPORT -I/local/robotpkg/var/tmp/robotpkg/middleware/orocos-rtt/work/orocos-rtt-2.8.1/rtt/os/gnulinux -I/local/robotpkg/var/tmp/robotpkg/middleware/orocos-rtt/work/orocos-rtt-2.8.1/rtt/os -I/local/robotpkg/var/tmp/robotpkg/middleware/orocos-rtt/work/orocos-rtt-2.8.1/rtt -I/local/robotpkg/var/tmp/robotpkg/middleware/orocos-rtt/work/orocos-rtt-2.8.1 -pipe -O3 -DNDEBUG -fmessage-length=0 -fPIC -Wall -o CMakeFiles/orocos-rtt-gnulinux_dynamic.dir/base/BufferLockFree.cpp.o -c /local/robotpkg/var/tmp/robotpkg/middleware/orocos-rtt/work/orocos-rtt-2.8.1/rtt/base/BufferLockFree.cpp [ 23%] Building CXX object rtt/CMakeFiles/orocos-rtt-gnulinux_dynamic.dir/base/ChannelInterface.cpp.o cd /local/robotpkg/var/tmp/robotpkg/middleware/orocos-rtt/work/orocos-rtt-2.8.1/rtt && /usr/bin/g++ -DOROCOS_TARGET=gnulinux -DRTT_DLL_EXPORT -I/local/robotpkg/var/tmp/robotpkg/middleware/orocos-rtt/work/orocos-rtt-2.8.1/rtt/os/gnulinux -I/local/robotpkg/var/tmp/robotpkg/middleware/orocos-rtt/work/orocos-rtt-2.8.1/rtt/os -I/local/robotpkg/var/tmp/robotpkg/middleware/orocos-rtt/work/orocos-rtt-2.8.1/rtt -I/local/robotpkg/var/tmp/robotpkg/middleware/orocos-rtt/work/orocos-rtt-2.8.1 -pipe -O3 -DNDEBUG -fmessage-length=0 -fPIC -Wall -o CMakeFiles/orocos-rtt-gnulinux_dynamic.dir/base/ChannelInterface.cpp.o -c /local/robotpkg/var/tmp/robotpkg/middleware/orocos-rtt/work/orocos-rtt-2.8.1/rtt/base/ChannelInterface.cpp [ 23%] Building CXX object rtt/CMakeFiles/orocos-rtt-gnulinux_dynamic.dir/base/CoreRunnableInterface.cpp.o cd /local/robotpkg/var/tmp/robotpkg/middleware/orocos-rtt/work/orocos-rtt-2.8.1/rtt && /usr/bin/g++ -DOROCOS_TARGET=gnulinux -DRTT_DLL_EXPORT -I/local/robotpkg/var/tmp/robotpkg/middleware/orocos-rtt/work/orocos-rtt-2.8.1/rtt/os/gnulinux -I/local/robotpkg/var/tmp/robotpkg/middleware/orocos-rtt/work/orocos-rtt-2.8.1/rtt/os -I/local/robotpkg/var/tmp/robotpkg/middleware/orocos-rtt/work/orocos-rtt-2.8.1/rtt -I/local/robotpkg/var/tmp/robotpkg/middleware/orocos-rtt/work/orocos-rtt-2.8.1 -pipe -O3 -DNDEBUG -fmessage-length=0 -fPIC -Wall -o CMakeFiles/orocos-rtt-gnulinux_dynamic.dir/base/CoreRunnableInterface.cpp.o -c /local/robotpkg/var/tmp/robotpkg/middleware/orocos-rtt/work/orocos-rtt-2.8.1/rtt/base/CoreRunnableInterface.cpp [ 25%] Building CXX object rtt/CMakeFiles/orocos-rtt-gnulinux_dynamic.dir/base/InputPortInterface.cpp.o cd /local/robotpkg/var/tmp/robotpkg/middleware/orocos-rtt/work/orocos-rtt-2.8.1/rtt && /usr/bin/g++ -DOROCOS_TARGET=gnulinux -DRTT_DLL_EXPORT -I/local/robotpkg/var/tmp/robotpkg/middleware/orocos-rtt/work/orocos-rtt-2.8.1/rtt/os/gnulinux -I/local/robotpkg/var/tmp/robotpkg/middleware/orocos-rtt/work/orocos-rtt-2.8.1/rtt/os -I/local/robotpkg/var/tmp/robotpkg/middleware/orocos-rtt/work/orocos-rtt-2.8.1/rtt -I/local/robotpkg/var/tmp/robotpkg/middleware/orocos-rtt/work/orocos-rtt-2.8.1 -pipe -O3 -DNDEBUG -fmessage-length=0 -fPIC -Wall -o CMakeFiles/orocos-rtt-gnulinux_dynamic.dir/base/InputPortInterface.cpp.o -c /local/robotpkg/var/tmp/robotpkg/middleware/orocos-rtt/work/orocos-rtt-2.8.1/rtt/base/InputPortInterface.cpp [ 25%] Building CXX object rtt/CMakeFiles/orocos-rtt-gnulinux_dynamic.dir/base/OperationBase.cpp.o cd /local/robotpkg/var/tmp/robotpkg/middleware/orocos-rtt/work/orocos-rtt-2.8.1/rtt && /usr/bin/g++ -DOROCOS_TARGET=gnulinux -DRTT_DLL_EXPORT -I/local/robotpkg/var/tmp/robotpkg/middleware/orocos-rtt/work/orocos-rtt-2.8.1/rtt/os/gnulinux -I/local/robotpkg/var/tmp/robotpkg/middleware/orocos-rtt/work/orocos-rtt-2.8.1/rtt/os -I/local/robotpkg/var/tmp/robotpkg/middleware/orocos-rtt/work/orocos-rtt-2.8.1/rtt -I/local/robotpkg/var/tmp/robotpkg/middleware/orocos-rtt/work/orocos-rtt-2.8.1 -pipe -O3 -DNDEBUG -fmessage-length=0 -fPIC -Wall -o CMakeFiles/orocos-rtt-gnulinux_dynamic.dir/base/OperationBase.cpp.o -c /local/robotpkg/var/tmp/robotpkg/middleware/orocos-rtt/work/orocos-rtt-2.8.1/rtt/base/OperationBase.cpp [ 26%] Building CXX object rtt/CMakeFiles/orocos-rtt-gnulinux_dynamic.dir/base/OperationCallerInterface.cpp.o cd /local/robotpkg/var/tmp/robotpkg/middleware/orocos-rtt/work/orocos-rtt-2.8.1/rtt && /usr/bin/g++ -DOROCOS_TARGET=gnulinux -DRTT_DLL_EXPORT -I/local/robotpkg/var/tmp/robotpkg/middleware/orocos-rtt/work/orocos-rtt-2.8.1/rtt/os/gnulinux -I/local/robotpkg/var/tmp/robotpkg/middleware/orocos-rtt/work/orocos-rtt-2.8.1/rtt/os -I/local/robotpkg/var/tmp/robotpkg/middleware/orocos-rtt/work/orocos-rtt-2.8.1/rtt -I/local/robotpkg/var/tmp/robotpkg/middleware/orocos-rtt/work/orocos-rtt-2.8.1 -pipe -O3 -DNDEBUG -fmessage-length=0 -fPIC -Wall -o CMakeFiles/orocos-rtt-gnulinux_dynamic.dir/base/OperationCallerInterface.cpp.o -c /local/robotpkg/var/tmp/robotpkg/middleware/orocos-rtt/work/orocos-rtt-2.8.1/rtt/base/OperationCallerInterface.cpp [ 26%] Building CXX object rtt/CMakeFiles/orocos-rtt-gnulinux_dynamic.dir/base/OutputPortInterface.cpp.o cd /local/robotpkg/var/tmp/robotpkg/middleware/orocos-rtt/work/orocos-rtt-2.8.1/rtt && /usr/bin/g++ -DOROCOS_TARGET=gnulinux -DRTT_DLL_EXPORT -I/local/robotpkg/var/tmp/robotpkg/middleware/orocos-rtt/work/orocos-rtt-2.8.1/rtt/os/gnulinux -I/local/robotpkg/var/tmp/robotpkg/middleware/orocos-rtt/work/orocos-rtt-2.8.1/rtt/os -I/local/robotpkg/var/tmp/robotpkg/middleware/orocos-rtt/work/orocos-rtt-2.8.1/rtt -I/local/robotpkg/var/tmp/robotpkg/middleware/orocos-rtt/work/orocos-rtt-2.8.1 -pipe -O3 -DNDEBUG -fmessage-length=0 -fPIC -Wall -o CMakeFiles/orocos-rtt-gnulinux_dynamic.dir/base/OutputPortInterface.cpp.o -c /local/robotpkg/var/tmp/robotpkg/middleware/orocos-rtt/work/orocos-rtt-2.8.1/rtt/base/OutputPortInterface.cpp [ 26%] Building CXX object rtt/CMakeFiles/orocos-rtt-gnulinux_dynamic.dir/base/PortInterface.cpp.o cd /local/robotpkg/var/tmp/robotpkg/middleware/orocos-rtt/work/orocos-rtt-2.8.1/rtt && /usr/bin/g++ -DOROCOS_TARGET=gnulinux -DRTT_DLL_EXPORT -I/local/robotpkg/var/tmp/robotpkg/middleware/orocos-rtt/work/orocos-rtt-2.8.1/rtt/os/gnulinux -I/local/robotpkg/var/tmp/robotpkg/middleware/orocos-rtt/work/orocos-rtt-2.8.1/rtt/os -I/local/robotpkg/var/tmp/robotpkg/middleware/orocos-rtt/work/orocos-rtt-2.8.1/rtt -I/local/robotpkg/var/tmp/robotpkg/middleware/orocos-rtt/work/orocos-rtt-2.8.1 -pipe -O3 -DNDEBUG -fmessage-length=0 -fPIC -Wall -o CMakeFiles/orocos-rtt-gnulinux_dynamic.dir/base/PortInterface.cpp.o -c /local/robotpkg/var/tmp/robotpkg/middleware/orocos-rtt/work/orocos-rtt-2.8.1/rtt/base/PortInterface.cpp [ 27%] Building CXX object rtt/CMakeFiles/orocos-rtt-gnulinux_dynamic.dir/base/PropertyBagVisitor.cpp.o cd /local/robotpkg/var/tmp/robotpkg/middleware/orocos-rtt/work/orocos-rtt-2.8.1/rtt && /usr/bin/g++ -DOROCOS_TARGET=gnulinux -DRTT_DLL_EXPORT -I/local/robotpkg/var/tmp/robotpkg/middleware/orocos-rtt/work/orocos-rtt-2.8.1/rtt/os/gnulinux -I/local/robotpkg/var/tmp/robotpkg/middleware/orocos-rtt/work/orocos-rtt-2.8.1/rtt/os -I/local/robotpkg/var/tmp/robotpkg/middleware/orocos-rtt/work/orocos-rtt-2.8.1/rtt -I/local/robotpkg/var/tmp/robotpkg/middleware/orocos-rtt/work/orocos-rtt-2.8.1 -pipe -O3 -DNDEBUG -fmessage-length=0 -fPIC -Wall -o CMakeFiles/orocos-rtt-gnulinux_dynamic.dir/base/PropertyBagVisitor.cpp.o -c /local/robotpkg/var/tmp/robotpkg/middleware/orocos-rtt/work/orocos-rtt-2.8.1/rtt/base/PropertyBagVisitor.cpp [ 27%] Building CXX object rtt/CMakeFiles/orocos-rtt-gnulinux_dynamic.dir/base/PropertyBase.cpp.o cd /local/robotpkg/var/tmp/robotpkg/middleware/orocos-rtt/work/orocos-rtt-2.8.1/rtt && /usr/bin/g++ -DOROCOS_TARGET=gnulinux -DRTT_DLL_EXPORT -I/local/robotpkg/var/tmp/robotpkg/middleware/orocos-rtt/work/orocos-rtt-2.8.1/rtt/os/gnulinux -I/local/robotpkg/var/tmp/robotpkg/middleware/orocos-rtt/work/orocos-rtt-2.8.1/rtt/os -I/local/robotpkg/var/tmp/robotpkg/middleware/orocos-rtt/work/orocos-rtt-2.8.1/rtt -I/local/robotpkg/var/tmp/robotpkg/middleware/orocos-rtt/work/orocos-rtt-2.8.1 -pipe -O3 -DNDEBUG -fmessage-length=0 -fPIC -Wall -o CMakeFiles/orocos-rtt-gnulinux_dynamic.dir/base/PropertyBase.cpp.o -c /local/robotpkg/var/tmp/robotpkg/middleware/orocos-rtt/work/orocos-rtt-2.8.1/rtt/base/PropertyBase.cpp [ 29%] Building CXX object rtt/CMakeFiles/orocos-rtt-gnulinux_dynamic.dir/base/TaskCore.cpp.o cd /local/robotpkg/var/tmp/robotpkg/middleware/orocos-rtt/work/orocos-rtt-2.8.1/rtt && /usr/bin/g++ -DOROCOS_TARGET=gnulinux -DRTT_DLL_EXPORT -I/local/robotpkg/var/tmp/robotpkg/middleware/orocos-rtt/work/orocos-rtt-2.8.1/rtt/os/gnulinux -I/local/robotpkg/var/tmp/robotpkg/middleware/orocos-rtt/work/orocos-rtt-2.8.1/rtt/os -I/local/robotpkg/var/tmp/robotpkg/middleware/orocos-rtt/work/orocos-rtt-2.8.1/rtt -I/local/robotpkg/var/tmp/robotpkg/middleware/orocos-rtt/work/orocos-rtt-2.8.1 -pipe -O3 -DNDEBUG -fmessage-length=0 -fPIC -Wall -o CMakeFiles/orocos-rtt-gnulinux_dynamic.dir/base/TaskCore.cpp.o -c /local/robotpkg/var/tmp/robotpkg/middleware/orocos-rtt/work/orocos-rtt-2.8.1/rtt/base/TaskCore.cpp [ 29%] Building CXX object rtt/CMakeFiles/orocos-rtt-gnulinux_dynamic.dir/internal/CatchConfig.cpp.o cd /local/robotpkg/var/tmp/robotpkg/middleware/orocos-rtt/work/orocos-rtt-2.8.1/rtt && /usr/bin/g++ -DOROCOS_TARGET=gnulinux -DRTT_DLL_EXPORT -I/local/robotpkg/var/tmp/robotpkg/middleware/orocos-rtt/work/orocos-rtt-2.8.1/rtt/os/gnulinux -I/local/robotpkg/var/tmp/robotpkg/middleware/orocos-rtt/work/orocos-rtt-2.8.1/rtt/os -I/local/robotpkg/var/tmp/robotpkg/middleware/orocos-rtt/work/orocos-rtt-2.8.1/rtt -I/local/robotpkg/var/tmp/robotpkg/middleware/orocos-rtt/work/orocos-rtt-2.8.1 -pipe -O3 -DNDEBUG -fmessage-length=0 -fPIC -Wall -o CMakeFiles/orocos-rtt-gnulinux_dynamic.dir/internal/CatchConfig.cpp.o -c /local/robotpkg/var/tmp/robotpkg/middleware/orocos-rtt/work/orocos-rtt-2.8.1/rtt/internal/CatchConfig.cpp [ 30%] Building CXX object rtt/CMakeFiles/orocos-rtt-gnulinux_dynamic.dir/internal/ConnFactory.cpp.o cd /local/robotpkg/var/tmp/robotpkg/middleware/orocos-rtt/work/orocos-rtt-2.8.1/rtt && /usr/bin/g++ -DOROCOS_TARGET=gnulinux -DRTT_DLL_EXPORT -I/local/robotpkg/var/tmp/robotpkg/middleware/orocos-rtt/work/orocos-rtt-2.8.1/rtt/os/gnulinux -I/local/robotpkg/var/tmp/robotpkg/middleware/orocos-rtt/work/orocos-rtt-2.8.1/rtt/os -I/local/robotpkg/var/tmp/robotpkg/middleware/orocos-rtt/work/orocos-rtt-2.8.1/rtt -I/local/robotpkg/var/tmp/robotpkg/middleware/orocos-rtt/work/orocos-rtt-2.8.1 -pipe -O3 -DNDEBUG -fmessage-length=0 -fPIC -Wall -o CMakeFiles/orocos-rtt-gnulinux_dynamic.dir/internal/ConnFactory.cpp.o -c /local/robotpkg/var/tmp/robotpkg/middleware/orocos-rtt/work/orocos-rtt-2.8.1/rtt/internal/ConnFactory.cpp [ 30%] Building CXX object rtt/CMakeFiles/orocos-rtt-gnulinux_dynamic.dir/internal/ConnID.cpp.o cd /local/robotpkg/var/tmp/robotpkg/middleware/orocos-rtt/work/orocos-rtt-2.8.1/rtt && /usr/bin/g++ -DOROCOS_TARGET=gnulinux -DRTT_DLL_EXPORT -I/local/robotpkg/var/tmp/robotpkg/middleware/orocos-rtt/work/orocos-rtt-2.8.1/rtt/os/gnulinux -I/local/robotpkg/var/tmp/robotpkg/middleware/orocos-rtt/work/orocos-rtt-2.8.1/rtt/os -I/local/robotpkg/var/tmp/robotpkg/middleware/orocos-rtt/work/orocos-rtt-2.8.1/rtt -I/local/robotpkg/var/tmp/robotpkg/middleware/orocos-rtt/work/orocos-rtt-2.8.1 -pipe -O3 -DNDEBUG -fmessage-length=0 -fPIC -Wall -o CMakeFiles/orocos-rtt-gnulinux_dynamic.dir/internal/ConnID.cpp.o -c /local/robotpkg/var/tmp/robotpkg/middleware/orocos-rtt/work/orocos-rtt-2.8.1/rtt/internal/ConnID.cpp [ 30%] Building CXX object rtt/CMakeFiles/orocos-rtt-gnulinux_dynamic.dir/internal/ConnectionManager.cpp.o cd /local/robotpkg/var/tmp/robotpkg/middleware/orocos-rtt/work/orocos-rtt-2.8.1/rtt && /usr/bin/g++ -DOROCOS_TARGET=gnulinux -DRTT_DLL_EXPORT -I/local/robotpkg/var/tmp/robotpkg/middleware/orocos-rtt/work/orocos-rtt-2.8.1/rtt/os/gnulinux -I/local/robotpkg/var/tmp/robotpkg/middleware/orocos-rtt/work/orocos-rtt-2.8.1/rtt/os -I/local/robotpkg/var/tmp/robotpkg/middleware/orocos-rtt/work/orocos-rtt-2.8.1/rtt -I/local/robotpkg/var/tmp/robotpkg/middleware/orocos-rtt/work/orocos-rtt-2.8.1 -pipe -O3 -DNDEBUG -fmessage-length=0 -fPIC -Wall -o CMakeFiles/orocos-rtt-gnulinux_dynamic.dir/internal/ConnectionManager.cpp.o -c /local/robotpkg/var/tmp/robotpkg/middleware/orocos-rtt/work/orocos-rtt-2.8.1/rtt/internal/ConnectionManager.cpp [ 31%] Building CXX object rtt/CMakeFiles/orocos-rtt-gnulinux_dynamic.dir/internal/DataSource.cpp.o cd /local/robotpkg/var/tmp/robotpkg/middleware/orocos-rtt/work/orocos-rtt-2.8.1/rtt && /usr/bin/g++ -DOROCOS_TARGET=gnulinux -DRTT_DLL_EXPORT -I/local/robotpkg/var/tmp/robotpkg/middleware/orocos-rtt/work/orocos-rtt-2.8.1/rtt/os/gnulinux -I/local/robotpkg/var/tmp/robotpkg/middleware/orocos-rtt/work/orocos-rtt-2.8.1/rtt/os -I/local/robotpkg/var/tmp/robotpkg/middleware/orocos-rtt/work/orocos-rtt-2.8.1/rtt -I/local/robotpkg/var/tmp/robotpkg/middleware/orocos-rtt/work/orocos-rtt-2.8.1 -pipe -O3 -DNDEBUG -fmessage-length=0 -fPIC -Wall -o CMakeFiles/orocos-rtt-gnulinux_dynamic.dir/internal/DataSource.cpp.o -c /local/robotpkg/var/tmp/robotpkg/middleware/orocos-rtt/work/orocos-rtt-2.8.1/rtt/internal/DataSource.cpp [ 31%] Building CXX object rtt/CMakeFiles/orocos-rtt-gnulinux_dynamic.dir/internal/DataSourceCommand.cpp.o cd /local/robotpkg/var/tmp/robotpkg/middleware/orocos-rtt/work/orocos-rtt-2.8.1/rtt && /usr/bin/g++ -DOROCOS_TARGET=gnulinux -DRTT_DLL_EXPORT -I/local/robotpkg/var/tmp/robotpkg/middleware/orocos-rtt/work/orocos-rtt-2.8.1/rtt/os/gnulinux -I/local/robotpkg/var/tmp/robotpkg/middleware/orocos-rtt/work/orocos-rtt-2.8.1/rtt/os -I/local/robotpkg/var/tmp/robotpkg/middleware/orocos-rtt/work/orocos-rtt-2.8.1/rtt -I/local/robotpkg/var/tmp/robotpkg/middleware/orocos-rtt/work/orocos-rtt-2.8.1 -pipe -O3 -DNDEBUG -fmessage-length=0 -fPIC -Wall -o CMakeFiles/orocos-rtt-gnulinux_dynamic.dir/internal/DataSourceCommand.cpp.o -c /local/robotpkg/var/tmp/robotpkg/middleware/orocos-rtt/work/orocos-rtt-2.8.1/rtt/internal/DataSourceCommand.cpp [ 33%] Building CXX object rtt/CMakeFiles/orocos-rtt-gnulinux_dynamic.dir/internal/DataSources.cpp.o cd /local/robotpkg/var/tmp/robotpkg/middleware/orocos-rtt/work/orocos-rtt-2.8.1/rtt && /usr/bin/g++ -DOROCOS_TARGET=gnulinux -DRTT_DLL_EXPORT -I/local/robotpkg/var/tmp/robotpkg/middleware/orocos-rtt/work/orocos-rtt-2.8.1/rtt/os/gnulinux -I/local/robotpkg/var/tmp/robotpkg/middleware/orocos-rtt/work/orocos-rtt-2.8.1/rtt/os -I/local/robotpkg/var/tmp/robotpkg/middleware/orocos-rtt/work/orocos-rtt-2.8.1/rtt -I/local/robotpkg/var/tmp/robotpkg/middleware/orocos-rtt/work/orocos-rtt-2.8.1 -pipe -O3 -DNDEBUG -fmessage-length=0 -fPIC -Wall -o CMakeFiles/orocos-rtt-gnulinux_dynamic.dir/internal/DataSources.cpp.o -c /local/robotpkg/var/tmp/robotpkg/middleware/orocos-rtt/work/orocos-rtt-2.8.1/rtt/internal/DataSources.cpp [ 33%] Building CXX object rtt/CMakeFiles/orocos-rtt-gnulinux_dynamic.dir/internal/GlobalEngine.cpp.o cd /local/robotpkg/var/tmp/robotpkg/middleware/orocos-rtt/work/orocos-rtt-2.8.1/rtt && /usr/bin/g++ -DOROCOS_TARGET=gnulinux -DRTT_DLL_EXPORT -I/local/robotpkg/var/tmp/robotpkg/middleware/orocos-rtt/work/orocos-rtt-2.8.1/rtt/os/gnulinux -I/local/robotpkg/var/tmp/robotpkg/middleware/orocos-rtt/work/orocos-rtt-2.8.1/rtt/os -I/local/robotpkg/var/tmp/robotpkg/middleware/orocos-rtt/work/orocos-rtt-2.8.1/rtt -I/local/robotpkg/var/tmp/robotpkg/middleware/orocos-rtt/work/orocos-rtt-2.8.1 -pipe -O3 -DNDEBUG -fmessage-length=0 -fPIC -Wall -o CMakeFiles/orocos-rtt-gnulinux_dynamic.dir/internal/GlobalEngine.cpp.o -c /local/robotpkg/var/tmp/robotpkg/middleware/orocos-rtt/work/orocos-rtt-2.8.1/rtt/internal/GlobalEngine.cpp [ 33%] Building CXX object rtt/CMakeFiles/orocos-rtt-gnulinux_dynamic.dir/internal/GlobalService.cpp.o cd /local/robotpkg/var/tmp/robotpkg/middleware/orocos-rtt/work/orocos-rtt-2.8.1/rtt && /usr/bin/g++ -DOROCOS_TARGET=gnulinux -DRTT_DLL_EXPORT -I/local/robotpkg/var/tmp/robotpkg/middleware/orocos-rtt/work/orocos-rtt-2.8.1/rtt/os/gnulinux -I/local/robotpkg/var/tmp/robotpkg/middleware/orocos-rtt/work/orocos-rtt-2.8.1/rtt/os -I/local/robotpkg/var/tmp/robotpkg/middleware/orocos-rtt/work/orocos-rtt-2.8.1/rtt -I/local/robotpkg/var/tmp/robotpkg/middleware/orocos-rtt/work/orocos-rtt-2.8.1 -pipe -O3 -DNDEBUG -fmessage-length=0 -fPIC -Wall -o CMakeFiles/orocos-rtt-gnulinux_dynamic.dir/internal/GlobalService.cpp.o -c /local/robotpkg/var/tmp/robotpkg/middleware/orocos-rtt/work/orocos-rtt-2.8.1/rtt/internal/GlobalService.cpp [ 34%] Building CXX object rtt/CMakeFiles/orocos-rtt-gnulinux_dynamic.dir/internal/ListLockFree.cpp.o cd /local/robotpkg/var/tmp/robotpkg/middleware/orocos-rtt/work/orocos-rtt-2.8.1/rtt && /usr/bin/g++ -DOROCOS_TARGET=gnulinux -DRTT_DLL_EXPORT -I/local/robotpkg/var/tmp/robotpkg/middleware/orocos-rtt/work/orocos-rtt-2.8.1/rtt/os/gnulinux -I/local/robotpkg/var/tmp/robotpkg/middleware/orocos-rtt/work/orocos-rtt-2.8.1/rtt/os -I/local/robotpkg/var/tmp/robotpkg/middleware/orocos-rtt/work/orocos-rtt-2.8.1/rtt -I/local/robotpkg/var/tmp/robotpkg/middleware/orocos-rtt/work/orocos-rtt-2.8.1 -pipe -O3 -DNDEBUG -fmessage-length=0 -fPIC -Wall -o CMakeFiles/orocos-rtt-gnulinux_dynamic.dir/internal/ListLockFree.cpp.o -c /local/robotpkg/var/tmp/robotpkg/middleware/orocos-rtt/work/orocos-rtt-2.8.1/rtt/internal/ListLockFree.cpp [ 34%] Building CXX object rtt/CMakeFiles/orocos-rtt-gnulinux_dynamic.dir/internal/OperationCallerC.cpp.o cd /local/robotpkg/var/tmp/robotpkg/middleware/orocos-rtt/work/orocos-rtt-2.8.1/rtt && /usr/bin/g++ -DOROCOS_TARGET=gnulinux -DRTT_DLL_EXPORT -I/local/robotpkg/var/tmp/robotpkg/middleware/orocos-rtt/work/orocos-rtt-2.8.1/rtt/os/gnulinux -I/local/robotpkg/var/tmp/robotpkg/middleware/orocos-rtt/work/orocos-rtt-2.8.1/rtt/os -I/local/robotpkg/var/tmp/robotpkg/middleware/orocos-rtt/work/orocos-rtt-2.8.1/rtt -I/local/robotpkg/var/tmp/robotpkg/middleware/orocos-rtt/work/orocos-rtt-2.8.1 -pipe -O3 -DNDEBUG -fmessage-length=0 -fPIC -Wall -o CMakeFiles/orocos-rtt-gnulinux_dynamic.dir/internal/OperationCallerC.cpp.o -c /local/robotpkg/var/tmp/robotpkg/middleware/orocos-rtt/work/orocos-rtt-2.8.1/rtt/internal/OperationCallerC.cpp [ 36%] Building CXX object rtt/CMakeFiles/orocos-rtt-gnulinux_dynamic.dir/internal/OperationInterfacePartFused.cpp.o cd /local/robotpkg/var/tmp/robotpkg/middleware/orocos-rtt/work/orocos-rtt-2.8.1/rtt && /usr/bin/g++ -DOROCOS_TARGET=gnulinux -DRTT_DLL_EXPORT -I/local/robotpkg/var/tmp/robotpkg/middleware/orocos-rtt/work/orocos-rtt-2.8.1/rtt/os/gnulinux -I/local/robotpkg/var/tmp/robotpkg/middleware/orocos-rtt/work/orocos-rtt-2.8.1/rtt/os -I/local/robotpkg/var/tmp/robotpkg/middleware/orocos-rtt/work/orocos-rtt-2.8.1/rtt -I/local/robotpkg/var/tmp/robotpkg/middleware/orocos-rtt/work/orocos-rtt-2.8.1 -pipe -O3 -DNDEBUG -fmessage-length=0 -fPIC -Wall -o CMakeFiles/orocos-rtt-gnulinux_dynamic.dir/internal/OperationInterfacePartFused.cpp.o -c /local/robotpkg/var/tmp/robotpkg/middleware/orocos-rtt/work/orocos-rtt-2.8.1/rtt/internal/OperationInterfacePartFused.cpp [ 36%] Building CXX object rtt/CMakeFiles/orocos-rtt-gnulinux_dynamic.dir/internal/SendHandleC.cpp.o cd /local/robotpkg/var/tmp/robotpkg/middleware/orocos-rtt/work/orocos-rtt-2.8.1/rtt && /usr/bin/g++ -DOROCOS_TARGET=gnulinux -DRTT_DLL_EXPORT -I/local/robotpkg/var/tmp/robotpkg/middleware/orocos-rtt/work/orocos-rtt-2.8.1/rtt/os/gnulinux -I/local/robotpkg/var/tmp/robotpkg/middleware/orocos-rtt/work/orocos-rtt-2.8.1/rtt/os -I/local/robotpkg/var/tmp/robotpkg/middleware/orocos-rtt/work/orocos-rtt-2.8.1/rtt -I/local/robotpkg/var/tmp/robotpkg/middleware/orocos-rtt/work/orocos-rtt-2.8.1 -pipe -O3 -DNDEBUG -fmessage-length=0 -fPIC -Wall -o CMakeFiles/orocos-rtt-gnulinux_dynamic.dir/internal/SendHandleC.cpp.o -c /local/robotpkg/var/tmp/robotpkg/middleware/orocos-rtt/work/orocos-rtt-2.8.1/rtt/internal/SendHandleC.cpp [ 37%] Building CXX object rtt/CMakeFiles/orocos-rtt-gnulinux_dynamic.dir/internal/SignalBase.cpp.o cd /local/robotpkg/var/tmp/robotpkg/middleware/orocos-rtt/work/orocos-rtt-2.8.1/rtt && /usr/bin/g++ -DOROCOS_TARGET=gnulinux -DRTT_DLL_EXPORT -I/local/robotpkg/var/tmp/robotpkg/middleware/orocos-rtt/work/orocos-rtt-2.8.1/rtt/os/gnulinux -I/local/robotpkg/var/tmp/robotpkg/middleware/orocos-rtt/work/orocos-rtt-2.8.1/rtt/os -I/local/robotpkg/var/tmp/robotpkg/middleware/orocos-rtt/work/orocos-rtt-2.8.1/rtt -I/local/robotpkg/var/tmp/robotpkg/middleware/orocos-rtt/work/orocos-rtt-2.8.1 -pipe -O3 -DNDEBUG -fmessage-length=0 -fPIC -Wall -o CMakeFiles/orocos-rtt-gnulinux_dynamic.dir/internal/SignalBase.cpp.o -c /local/robotpkg/var/tmp/robotpkg/middleware/orocos-rtt/work/orocos-rtt-2.8.1/rtt/internal/SignalBase.cpp [ 37%] Building CXX object rtt/CMakeFiles/orocos-rtt-gnulinux_dynamic.dir/types/CompositionFactory.cpp.o cd /local/robotpkg/var/tmp/robotpkg/middleware/orocos-rtt/work/orocos-rtt-2.8.1/rtt && /usr/bin/g++ -DOROCOS_TARGET=gnulinux -DRTT_DLL_EXPORT -I/local/robotpkg/var/tmp/robotpkg/middleware/orocos-rtt/work/orocos-rtt-2.8.1/rtt/os/gnulinux -I/local/robotpkg/var/tmp/robotpkg/middleware/orocos-rtt/work/orocos-rtt-2.8.1/rtt/os -I/local/robotpkg/var/tmp/robotpkg/middleware/orocos-rtt/work/orocos-rtt-2.8.1/rtt -I/local/robotpkg/var/tmp/robotpkg/middleware/orocos-rtt/work/orocos-rtt-2.8.1 -pipe -O3 -DNDEBUG -fmessage-length=0 -fPIC -Wall -o CMakeFiles/orocos-rtt-gnulinux_dynamic.dir/types/CompositionFactory.cpp.o -c /local/robotpkg/var/tmp/robotpkg/middleware/orocos-rtt/work/orocos-rtt-2.8.1/rtt/types/CompositionFactory.cpp [ 37%] Building CXX object rtt/CMakeFiles/orocos-rtt-gnulinux_dynamic.dir/types/GlobalsRepository.cpp.o cd /local/robotpkg/var/tmp/robotpkg/middleware/orocos-rtt/work/orocos-rtt-2.8.1/rtt && /usr/bin/g++ -DOROCOS_TARGET=gnulinux -DRTT_DLL_EXPORT -I/local/robotpkg/var/tmp/robotpkg/middleware/orocos-rtt/work/orocos-rtt-2.8.1/rtt/os/gnulinux -I/local/robotpkg/var/tmp/robotpkg/middleware/orocos-rtt/work/orocos-rtt-2.8.1/rtt/os -I/local/robotpkg/var/tmp/robotpkg/middleware/orocos-rtt/work/orocos-rtt-2.8.1/rtt -I/local/robotpkg/var/tmp/robotpkg/middleware/orocos-rtt/work/orocos-rtt-2.8.1 -pipe -O3 -DNDEBUG -fmessage-length=0 -fPIC -Wall -o CMakeFiles/orocos-rtt-gnulinux_dynamic.dir/types/GlobalsRepository.cpp.o -c /local/robotpkg/var/tmp/robotpkg/middleware/orocos-rtt/work/orocos-rtt-2.8.1/rtt/types/GlobalsRepository.cpp [ 38%] Building CXX object rtt/CMakeFiles/orocos-rtt-gnulinux_dynamic.dir/types/MemberFactory.cpp.o cd /local/robotpkg/var/tmp/robotpkg/middleware/orocos-rtt/work/orocos-rtt-2.8.1/rtt && /usr/bin/g++ -DOROCOS_TARGET=gnulinux -DRTT_DLL_EXPORT -I/local/robotpkg/var/tmp/robotpkg/middleware/orocos-rtt/work/orocos-rtt-2.8.1/rtt/os/gnulinux -I/local/robotpkg/var/tmp/robotpkg/middleware/orocos-rtt/work/orocos-rtt-2.8.1/rtt/os -I/local/robotpkg/var/tmp/robotpkg/middleware/orocos-rtt/work/orocos-rtt-2.8.1/rtt -I/local/robotpkg/var/tmp/robotpkg/middleware/orocos-rtt/work/orocos-rtt-2.8.1 -pipe -O3 -DNDEBUG -fmessage-length=0 -fPIC -Wall -o CMakeFiles/orocos-rtt-gnulinux_dynamic.dir/types/MemberFactory.cpp.o -c /local/robotpkg/var/tmp/robotpkg/middleware/orocos-rtt/work/orocos-rtt-2.8.1/rtt/types/MemberFactory.cpp [ 38%] Building CXX object rtt/CMakeFiles/orocos-rtt-gnulinux_dynamic.dir/types/Operators.cpp.o cd /local/robotpkg/var/tmp/robotpkg/middleware/orocos-rtt/work/orocos-rtt-2.8.1/rtt && /usr/bin/g++ -DOROCOS_TARGET=gnulinux -DRTT_DLL_EXPORT -I/local/robotpkg/var/tmp/robotpkg/middleware/orocos-rtt/work/orocos-rtt-2.8.1/rtt/os/gnulinux -I/local/robotpkg/var/tmp/robotpkg/middleware/orocos-rtt/work/orocos-rtt-2.8.1/rtt/os -I/local/robotpkg/var/tmp/robotpkg/middleware/orocos-rtt/work/orocos-rtt-2.8.1/rtt -I/local/robotpkg/var/tmp/robotpkg/middleware/orocos-rtt/work/orocos-rtt-2.8.1 -pipe -O3 -DNDEBUG -fmessage-length=0 -fPIC -Wall -o CMakeFiles/orocos-rtt-gnulinux_dynamic.dir/types/Operators.cpp.o -c /local/robotpkg/var/tmp/robotpkg/middleware/orocos-rtt/work/orocos-rtt-2.8.1/rtt/types/Operators.cpp [ 40%] Building CXX object rtt/CMakeFiles/orocos-rtt-gnulinux_dynamic.dir/types/PropertyComposition.cpp.o cd /local/robotpkg/var/tmp/robotpkg/middleware/orocos-rtt/work/orocos-rtt-2.8.1/rtt && /usr/bin/g++ -DOROCOS_TARGET=gnulinux -DRTT_DLL_EXPORT -I/local/robotpkg/var/tmp/robotpkg/middleware/orocos-rtt/work/orocos-rtt-2.8.1/rtt/os/gnulinux -I/local/robotpkg/var/tmp/robotpkg/middleware/orocos-rtt/work/orocos-rtt-2.8.1/rtt/os -I/local/robotpkg/var/tmp/robotpkg/middleware/orocos-rtt/work/orocos-rtt-2.8.1/rtt -I/local/robotpkg/var/tmp/robotpkg/middleware/orocos-rtt/work/orocos-rtt-2.8.1 -pipe -O3 -DNDEBUG -fmessage-length=0 -fPIC -Wall -o CMakeFiles/orocos-rtt-gnulinux_dynamic.dir/types/PropertyComposition.cpp.o -c /local/robotpkg/var/tmp/robotpkg/middleware/orocos-rtt/work/orocos-rtt-2.8.1/rtt/types/PropertyComposition.cpp [ 40%] Building CXX object rtt/CMakeFiles/orocos-rtt-gnulinux_dynamic.dir/types/PropertyDecomposition.cpp.o cd /local/robotpkg/var/tmp/robotpkg/middleware/orocos-rtt/work/orocos-rtt-2.8.1/rtt && /usr/bin/g++ -DOROCOS_TARGET=gnulinux -DRTT_DLL_EXPORT -I/local/robotpkg/var/tmp/robotpkg/middleware/orocos-rtt/work/orocos-rtt-2.8.1/rtt/os/gnulinux -I/local/robotpkg/var/tmp/robotpkg/middleware/orocos-rtt/work/orocos-rtt-2.8.1/rtt/os -I/local/robotpkg/var/tmp/robotpkg/middleware/orocos-rtt/work/orocos-rtt-2.8.1/rtt -I/local/robotpkg/var/tmp/robotpkg/middleware/orocos-rtt/work/orocos-rtt-2.8.1 -pipe -O3 -DNDEBUG -fmessage-length=0 -fPIC -Wall -o CMakeFiles/orocos-rtt-gnulinux_dynamic.dir/types/PropertyDecomposition.cpp.o -c /local/robotpkg/var/tmp/robotpkg/middleware/orocos-rtt/work/orocos-rtt-2.8.1/rtt/types/PropertyDecomposition.cpp [ 40%] Building CXX object rtt/CMakeFiles/orocos-rtt-gnulinux_dynamic.dir/types/SequenceTypeInfoBase.cpp.o cd /local/robotpkg/var/tmp/robotpkg/middleware/orocos-rtt/work/orocos-rtt-2.8.1/rtt && /usr/bin/g++ -DOROCOS_TARGET=gnulinux -DRTT_DLL_EXPORT -I/local/robotpkg/var/tmp/robotpkg/middleware/orocos-rtt/work/orocos-rtt-2.8.1/rtt/os/gnulinux -I/local/robotpkg/var/tmp/robotpkg/middleware/orocos-rtt/work/orocos-rtt-2.8.1/rtt/os -I/local/robotpkg/var/tmp/robotpkg/middleware/orocos-rtt/work/orocos-rtt-2.8.1/rtt -I/local/robotpkg/var/tmp/robotpkg/middleware/orocos-rtt/work/orocos-rtt-2.8.1 -pipe -O3 -DNDEBUG -fmessage-length=0 -fPIC -Wall -o CMakeFiles/orocos-rtt-gnulinux_dynamic.dir/types/SequenceTypeInfoBase.cpp.o -c /local/robotpkg/var/tmp/robotpkg/middleware/orocos-rtt/work/orocos-rtt-2.8.1/rtt/types/SequenceTypeInfoBase.cpp [ 41%] Building CXX object rtt/CMakeFiles/orocos-rtt-gnulinux_dynamic.dir/types/StreamFactory.cpp.o cd /local/robotpkg/var/tmp/robotpkg/middleware/orocos-rtt/work/orocos-rtt-2.8.1/rtt && /usr/bin/g++ -DOROCOS_TARGET=gnulinux -DRTT_DLL_EXPORT -I/local/robotpkg/var/tmp/robotpkg/middleware/orocos-rtt/work/orocos-rtt-2.8.1/rtt/os/gnulinux -I/local/robotpkg/var/tmp/robotpkg/middleware/orocos-rtt/work/orocos-rtt-2.8.1/rtt/os -I/local/robotpkg/var/tmp/robotpkg/middleware/orocos-rtt/work/orocos-rtt-2.8.1/rtt -I/local/robotpkg/var/tmp/robotpkg/middleware/orocos-rtt/work/orocos-rtt-2.8.1 -pipe -O3 -DNDEBUG -fmessage-length=0 -fPIC -Wall -o CMakeFiles/orocos-rtt-gnulinux_dynamic.dir/types/StreamFactory.cpp.o -c /local/robotpkg/var/tmp/robotpkg/middleware/orocos-rtt/work/orocos-rtt-2.8.1/rtt/types/StreamFactory.cpp /local/robotpkg/var/tmp/robotpkg/middleware/orocos-rtt/work/orocos-rtt-2.8.1/rtt/types/PropertyDecomposition.cpp: In function 'bool RTT::types::typeDecomposition(RTT::base::DataSourceBase::shared_ptr, RTT::PropertyBag&, bool)': /local/robotpkg/var/tmp/robotpkg/middleware/orocos-rtt/work/orocos-rtt-2.8.1/rtt/types/PropertyDecomposition.cpp:106:5: warning: 'template class std::auto_ptr' is deprecated [-Wdeprecated-declarations] auto_ptr< Property > recurse_bag( new Property("recurse_bag","Part") ); ^~~~~~~~ In file included from /usr/include/c++/6.3.1/memory:81:0, from /usr/include/boost/config/no_tr1/memory.hpp:21, from /usr/include/boost/smart_ptr/shared_ptr.hpp:23, from /usr/include/boost/shared_ptr.hpp:17, from /local/robotpkg/var/tmp/robotpkg/middleware/orocos-rtt/work/orocos-rtt-2.8.1/rtt/types/../base/ActionInterface.hpp:42, from /local/robotpkg/var/tmp/robotpkg/middleware/orocos-rtt/work/orocos-rtt-2.8.1/rtt/types/../base/PropertyBase.hpp:42, from /local/robotpkg/var/tmp/robotpkg/middleware/orocos-rtt/work/orocos-rtt-2.8.1/rtt/types/PropertyDecomposition.hpp:42, from /local/robotpkg/var/tmp/robotpkg/middleware/orocos-rtt/work/orocos-rtt-2.8.1/rtt/types/PropertyDecomposition.cpp:46: /usr/include/c++/6.3.1/bits/unique_ptr.h:49:28: note: declared here template class auto_ptr; ^~~~~~~~ [ 41%] Building CXX object rtt/CMakeFiles/orocos-rtt-gnulinux_dynamic.dir/types/TypeConstructor.cpp.o cd /local/robotpkg/var/tmp/robotpkg/middleware/orocos-rtt/work/orocos-rtt-2.8.1/rtt && /usr/bin/g++ -DOROCOS_TARGET=gnulinux -DRTT_DLL_EXPORT -I/local/robotpkg/var/tmp/robotpkg/middleware/orocos-rtt/work/orocos-rtt-2.8.1/rtt/os/gnulinux -I/local/robotpkg/var/tmp/robotpkg/middleware/orocos-rtt/work/orocos-rtt-2.8.1/rtt/os -I/local/robotpkg/var/tmp/robotpkg/middleware/orocos-rtt/work/orocos-rtt-2.8.1/rtt -I/local/robotpkg/var/tmp/robotpkg/middleware/orocos-rtt/work/orocos-rtt-2.8.1 -pipe -O3 -DNDEBUG -fmessage-length=0 -fPIC -Wall -o CMakeFiles/orocos-rtt-gnulinux_dynamic.dir/types/TypeConstructor.cpp.o -c /local/robotpkg/var/tmp/robotpkg/middleware/orocos-rtt/work/orocos-rtt-2.8.1/rtt/types/TypeConstructor.cpp [ 43%] Building CXX object rtt/CMakeFiles/orocos-rtt-gnulinux_dynamic.dir/types/TypeInfo.cpp.o cd /local/robotpkg/var/tmp/robotpkg/middleware/orocos-rtt/work/orocos-rtt-2.8.1/rtt && /usr/bin/g++ -DOROCOS_TARGET=gnulinux -DRTT_DLL_EXPORT -I/local/robotpkg/var/tmp/robotpkg/middleware/orocos-rtt/work/orocos-rtt-2.8.1/rtt/os/gnulinux -I/local/robotpkg/var/tmp/robotpkg/middleware/orocos-rtt/work/orocos-rtt-2.8.1/rtt/os -I/local/robotpkg/var/tmp/robotpkg/middleware/orocos-rtt/work/orocos-rtt-2.8.1/rtt -I/local/robotpkg/var/tmp/robotpkg/middleware/orocos-rtt/work/orocos-rtt-2.8.1 -pipe -O3 -DNDEBUG -fmessage-length=0 -fPIC -Wall -o CMakeFiles/orocos-rtt-gnulinux_dynamic.dir/types/TypeInfo.cpp.o -c /local/robotpkg/var/tmp/robotpkg/middleware/orocos-rtt/work/orocos-rtt-2.8.1/rtt/types/TypeInfo.cpp [ 43%] Building CXX object rtt/CMakeFiles/orocos-rtt-gnulinux_dynamic.dir/types/TypeInfoRepository.cpp.o cd /local/robotpkg/var/tmp/robotpkg/middleware/orocos-rtt/work/orocos-rtt-2.8.1/rtt && /usr/bin/g++ -DOROCOS_TARGET=gnulinux -DRTT_DLL_EXPORT -I/local/robotpkg/var/tmp/robotpkg/middleware/orocos-rtt/work/orocos-rtt-2.8.1/rtt/os/gnulinux -I/local/robotpkg/var/tmp/robotpkg/middleware/orocos-rtt/work/orocos-rtt-2.8.1/rtt/os -I/local/robotpkg/var/tmp/robotpkg/middleware/orocos-rtt/work/orocos-rtt-2.8.1/rtt -I/local/robotpkg/var/tmp/robotpkg/middleware/orocos-rtt/work/orocos-rtt-2.8.1 -pipe -O3 -DNDEBUG -fmessage-length=0 -fPIC -Wall -o CMakeFiles/orocos-rtt-gnulinux_dynamic.dir/types/TypeInfoRepository.cpp.o -c /local/robotpkg/var/tmp/robotpkg/middleware/orocos-rtt/work/orocos-rtt-2.8.1/rtt/types/TypeInfoRepository.cpp [ 44%] Building CXX object rtt/CMakeFiles/orocos-rtt-gnulinux_dynamic.dir/types/TypeStream-io.cpp.o cd /local/robotpkg/var/tmp/robotpkg/middleware/orocos-rtt/work/orocos-rtt-2.8.1/rtt && /usr/bin/g++ -DOROCOS_TARGET=gnulinux -DRTT_DLL_EXPORT -I/local/robotpkg/var/tmp/robotpkg/middleware/orocos-rtt/work/orocos-rtt-2.8.1/rtt/os/gnulinux -I/local/robotpkg/var/tmp/robotpkg/middleware/orocos-rtt/work/orocos-rtt-2.8.1/rtt/os -I/local/robotpkg/var/tmp/robotpkg/middleware/orocos-rtt/work/orocos-rtt-2.8.1/rtt -I/local/robotpkg/var/tmp/robotpkg/middleware/orocos-rtt/work/orocos-rtt-2.8.1 -pipe -O3 -DNDEBUG -fmessage-length=0 -fPIC -Wall -o CMakeFiles/orocos-rtt-gnulinux_dynamic.dir/types/TypeStream-io.cpp.o -c /local/robotpkg/var/tmp/robotpkg/middleware/orocos-rtt/work/orocos-rtt-2.8.1/rtt/types/TypeStream-io.cpp [ 44%] Building CXX object rtt/CMakeFiles/orocos-rtt-gnulinux_dynamic.dir/types/TypeStream.cpp.o cd /local/robotpkg/var/tmp/robotpkg/middleware/orocos-rtt/work/orocos-rtt-2.8.1/rtt && /usr/bin/g++ -DOROCOS_TARGET=gnulinux -DRTT_DLL_EXPORT -I/local/robotpkg/var/tmp/robotpkg/middleware/orocos-rtt/work/orocos-rtt-2.8.1/rtt/os/gnulinux -I/local/robotpkg/var/tmp/robotpkg/middleware/orocos-rtt/work/orocos-rtt-2.8.1/rtt/os -I/local/robotpkg/var/tmp/robotpkg/middleware/orocos-rtt/work/orocos-rtt-2.8.1/rtt -I/local/robotpkg/var/tmp/robotpkg/middleware/orocos-rtt/work/orocos-rtt-2.8.1 -pipe -O3 -DNDEBUG -fmessage-length=0 -fPIC -Wall -o CMakeFiles/orocos-rtt-gnulinux_dynamic.dir/types/TypeStream.cpp.o -c /local/robotpkg/var/tmp/robotpkg/middleware/orocos-rtt/work/orocos-rtt-2.8.1/rtt/types/TypeStream.cpp [ 44%] Building CXX object rtt/CMakeFiles/orocos-rtt-gnulinux_dynamic.dir/types/TypekitRepository.cpp.o cd /local/robotpkg/var/tmp/robotpkg/middleware/orocos-rtt/work/orocos-rtt-2.8.1/rtt && /usr/bin/g++ -DOROCOS_TARGET=gnulinux -DRTT_DLL_EXPORT -I/local/robotpkg/var/tmp/robotpkg/middleware/orocos-rtt/work/orocos-rtt-2.8.1/rtt/os/gnulinux -I/local/robotpkg/var/tmp/robotpkg/middleware/orocos-rtt/work/orocos-rtt-2.8.1/rtt/os -I/local/robotpkg/var/tmp/robotpkg/middleware/orocos-rtt/work/orocos-rtt-2.8.1/rtt -I/local/robotpkg/var/tmp/robotpkg/middleware/orocos-rtt/work/orocos-rtt-2.8.1 -pipe -O3 -DNDEBUG -fmessage-length=0 -fPIC -Wall -o CMakeFiles/orocos-rtt-gnulinux_dynamic.dir/types/TypekitRepository.cpp.o -c /local/robotpkg/var/tmp/robotpkg/middleware/orocos-rtt/work/orocos-rtt-2.8.1/rtt/types/TypekitRepository.cpp [ 45%] Building CXX object rtt/CMakeFiles/orocos-rtt-gnulinux_dynamic.dir/types/Types.cpp.o cd /local/robotpkg/var/tmp/robotpkg/middleware/orocos-rtt/work/orocos-rtt-2.8.1/rtt && /usr/bin/g++ -DOROCOS_TARGET=gnulinux -DRTT_DLL_EXPORT -I/local/robotpkg/var/tmp/robotpkg/middleware/orocos-rtt/work/orocos-rtt-2.8.1/rtt/os/gnulinux -I/local/robotpkg/var/tmp/robotpkg/middleware/orocos-rtt/work/orocos-rtt-2.8.1/rtt/os -I/local/robotpkg/var/tmp/robotpkg/middleware/orocos-rtt/work/orocos-rtt-2.8.1/rtt -I/local/robotpkg/var/tmp/robotpkg/middleware/orocos-rtt/work/orocos-rtt-2.8.1 -pipe -O3 -DNDEBUG -fmessage-length=0 -fPIC -Wall -o CMakeFiles/orocos-rtt-gnulinux_dynamic.dir/types/Types.cpp.o -c /local/robotpkg/var/tmp/robotpkg/middleware/orocos-rtt/work/orocos-rtt-2.8.1/rtt/types/Types.cpp [ 45%] Building CXX object rtt/CMakeFiles/orocos-rtt-gnulinux_dynamic.dir/types/ValueFactory.cpp.o cd /local/robotpkg/var/tmp/robotpkg/middleware/orocos-rtt/work/orocos-rtt-2.8.1/rtt && /usr/bin/g++ -DOROCOS_TARGET=gnulinux -DRTT_DLL_EXPORT -I/local/robotpkg/var/tmp/robotpkg/middleware/orocos-rtt/work/orocos-rtt-2.8.1/rtt/os/gnulinux -I/local/robotpkg/var/tmp/robotpkg/middleware/orocos-rtt/work/orocos-rtt-2.8.1/rtt/os -I/local/robotpkg/var/tmp/robotpkg/middleware/orocos-rtt/work/orocos-rtt-2.8.1/rtt -I/local/robotpkg/var/tmp/robotpkg/middleware/orocos-rtt/work/orocos-rtt-2.8.1 -pipe -O3 -DNDEBUG -fmessage-length=0 -fPIC -Wall -o CMakeFiles/orocos-rtt-gnulinux_dynamic.dir/types/ValueFactory.cpp.o -c /local/robotpkg/var/tmp/robotpkg/middleware/orocos-rtt/work/orocos-rtt-2.8.1/rtt/types/ValueFactory.cpp [ 47%] Building CXX object rtt/CMakeFiles/orocos-rtt-gnulinux_dynamic.dir/plugin/Plugin.cpp.o cd /local/robotpkg/var/tmp/robotpkg/middleware/orocos-rtt/work/orocos-rtt-2.8.1/rtt && /usr/bin/g++ -DOROCOS_TARGET=gnulinux -DRTT_DLL_EXPORT -I/local/robotpkg/var/tmp/robotpkg/middleware/orocos-rtt/work/orocos-rtt-2.8.1/rtt/os/gnulinux -I/local/robotpkg/var/tmp/robotpkg/middleware/orocos-rtt/work/orocos-rtt-2.8.1/rtt/os -I/local/robotpkg/var/tmp/robotpkg/middleware/orocos-rtt/work/orocos-rtt-2.8.1/rtt -I/local/robotpkg/var/tmp/robotpkg/middleware/orocos-rtt/work/orocos-rtt-2.8.1 -pipe -O3 -DNDEBUG -fmessage-length=0 -fPIC -Wall -o CMakeFiles/orocos-rtt-gnulinux_dynamic.dir/plugin/Plugin.cpp.o -c /local/robotpkg/var/tmp/robotpkg/middleware/orocos-rtt/work/orocos-rtt-2.8.1/rtt/plugin/Plugin.cpp [ 47%] Building CXX object rtt/CMakeFiles/orocos-rtt-gnulinux_dynamic.dir/plugin/PluginLoader.cpp.o cd /local/robotpkg/var/tmp/robotpkg/middleware/orocos-rtt/work/orocos-rtt-2.8.1/rtt && /usr/bin/g++ -DOROCOS_TARGET=gnulinux -DRTT_DLL_EXPORT -I/local/robotpkg/var/tmp/robotpkg/middleware/orocos-rtt/work/orocos-rtt-2.8.1/rtt/os/gnulinux -I/local/robotpkg/var/tmp/robotpkg/middleware/orocos-rtt/work/orocos-rtt-2.8.1/rtt/os -I/local/robotpkg/var/tmp/robotpkg/middleware/orocos-rtt/work/orocos-rtt-2.8.1/rtt -I/local/robotpkg/var/tmp/robotpkg/middleware/orocos-rtt/work/orocos-rtt-2.8.1 -pipe -O3 -DNDEBUG -fmessage-length=0 -fPIC -Wall -o CMakeFiles/orocos-rtt-gnulinux_dynamic.dir/plugin/PluginLoader.cpp.o -c /local/robotpkg/var/tmp/robotpkg/middleware/orocos-rtt/work/orocos-rtt-2.8.1/rtt/plugin/PluginLoader.cpp [ 48%] Building CXX object rtt/CMakeFiles/orocos-rtt-gnulinux_dynamic.dir/plugin/pluginpath.cpp.o cd /local/robotpkg/var/tmp/robotpkg/middleware/orocos-rtt/work/orocos-rtt-2.8.1/rtt && /usr/bin/g++ -DOROCOS_TARGET=gnulinux -DRTT_DLL_EXPORT -I/local/robotpkg/var/tmp/robotpkg/middleware/orocos-rtt/work/orocos-rtt-2.8.1/rtt/os/gnulinux -I/local/robotpkg/var/tmp/robotpkg/middleware/orocos-rtt/work/orocos-rtt-2.8.1/rtt/os -I/local/robotpkg/var/tmp/robotpkg/middleware/orocos-rtt/work/orocos-rtt-2.8.1/rtt -I/local/robotpkg/var/tmp/robotpkg/middleware/orocos-rtt/work/orocos-rtt-2.8.1 -pipe -O3 -DNDEBUG -fmessage-length=0 -fPIC -Wall -o CMakeFiles/orocos-rtt-gnulinux_dynamic.dir/plugin/pluginpath.cpp.o -c /local/robotpkg/var/tmp/robotpkg/middleware/orocos-rtt/work/orocos-rtt-2.8.1/rtt/plugin/pluginpath.cpp [ 48%] Building CXX object rtt/CMakeFiles/orocos-rtt-gnulinux_dynamic.dir/deployment/ComponentLoader.cpp.o cd /local/robotpkg/var/tmp/robotpkg/middleware/orocos-rtt/work/orocos-rtt-2.8.1/rtt && /usr/bin/g++ -DOROCOS_TARGET=gnulinux -DRTT_DLL_EXPORT -I/local/robotpkg/var/tmp/robotpkg/middleware/orocos-rtt/work/orocos-rtt-2.8.1/rtt/os/gnulinux -I/local/robotpkg/var/tmp/robotpkg/middleware/orocos-rtt/work/orocos-rtt-2.8.1/rtt/os -I/local/robotpkg/var/tmp/robotpkg/middleware/orocos-rtt/work/orocos-rtt-2.8.1/rtt -I/local/robotpkg/var/tmp/robotpkg/middleware/orocos-rtt/work/orocos-rtt-2.8.1 -pipe -O3 -DNDEBUG -fmessage-length=0 -fPIC -Wall -o CMakeFiles/orocos-rtt-gnulinux_dynamic.dir/deployment/ComponentLoader.cpp.o -c /local/robotpkg/var/tmp/robotpkg/middleware/orocos-rtt/work/orocos-rtt-2.8.1/rtt/deployment/ComponentLoader.cpp [ 48%] Building CXX object rtt/CMakeFiles/orocos-rtt-gnulinux_dynamic.dir/deployment/comppath.cpp.o cd /local/robotpkg/var/tmp/robotpkg/middleware/orocos-rtt/work/orocos-rtt-2.8.1/rtt && /usr/bin/g++ -DOROCOS_TARGET=gnulinux -DRTT_DLL_EXPORT -I/local/robotpkg/var/tmp/robotpkg/middleware/orocos-rtt/work/orocos-rtt-2.8.1/rtt/os/gnulinux -I/local/robotpkg/var/tmp/robotpkg/middleware/orocos-rtt/work/orocos-rtt-2.8.1/rtt/os -I/local/robotpkg/var/tmp/robotpkg/middleware/orocos-rtt/work/orocos-rtt-2.8.1/rtt -I/local/robotpkg/var/tmp/robotpkg/middleware/orocos-rtt/work/orocos-rtt-2.8.1 -pipe -O3 -DNDEBUG -fmessage-length=0 -fPIC -Wall -o CMakeFiles/orocos-rtt-gnulinux_dynamic.dir/deployment/comppath.cpp.o -c /local/robotpkg/var/tmp/robotpkg/middleware/orocos-rtt/work/orocos-rtt-2.8.1/rtt/deployment/comppath.cpp [ 50%] Building CXX object rtt/CMakeFiles/orocos-rtt-gnulinux_dynamic.dir/extras/FileDescriptorActivity.cpp.o cd /local/robotpkg/var/tmp/robotpkg/middleware/orocos-rtt/work/orocos-rtt-2.8.1/rtt && /usr/bin/g++ -DOROCOS_TARGET=gnulinux -DRTT_DLL_EXPORT -I/local/robotpkg/var/tmp/robotpkg/middleware/orocos-rtt/work/orocos-rtt-2.8.1/rtt/os/gnulinux -I/local/robotpkg/var/tmp/robotpkg/middleware/orocos-rtt/work/orocos-rtt-2.8.1/rtt/os -I/local/robotpkg/var/tmp/robotpkg/middleware/orocos-rtt/work/orocos-rtt-2.8.1/rtt -I/local/robotpkg/var/tmp/robotpkg/middleware/orocos-rtt/work/orocos-rtt-2.8.1 -pipe -O3 -DNDEBUG -fmessage-length=0 -fPIC -Wall -o CMakeFiles/orocos-rtt-gnulinux_dynamic.dir/extras/FileDescriptorActivity.cpp.o -c /local/robotpkg/var/tmp/robotpkg/middleware/orocos-rtt/work/orocos-rtt-2.8.1/rtt/extras/FileDescriptorActivity.cpp [ 50%] Building CXX object rtt/CMakeFiles/orocos-rtt-gnulinux_dynamic.dir/extras/IRQActivity.cpp.o cd /local/robotpkg/var/tmp/robotpkg/middleware/orocos-rtt/work/orocos-rtt-2.8.1/rtt && /usr/bin/g++ -DOROCOS_TARGET=gnulinux -DRTT_DLL_EXPORT -I/local/robotpkg/var/tmp/robotpkg/middleware/orocos-rtt/work/orocos-rtt-2.8.1/rtt/os/gnulinux -I/local/robotpkg/var/tmp/robotpkg/middleware/orocos-rtt/work/orocos-rtt-2.8.1/rtt/os -I/local/robotpkg/var/tmp/robotpkg/middleware/orocos-rtt/work/orocos-rtt-2.8.1/rtt -I/local/robotpkg/var/tmp/robotpkg/middleware/orocos-rtt/work/orocos-rtt-2.8.1 -pipe -O3 -DNDEBUG -fmessage-length=0 -fPIC -Wall -o CMakeFiles/orocos-rtt-gnulinux_dynamic.dir/extras/IRQActivity.cpp.o -c /local/robotpkg/var/tmp/robotpkg/middleware/orocos-rtt/work/orocos-rtt-2.8.1/rtt/extras/IRQActivity.cpp [ 51%] Building CXX object rtt/CMakeFiles/orocos-rtt-gnulinux_dynamic.dir/extras/MultiVector.cpp.o cd /local/robotpkg/var/tmp/robotpkg/middleware/orocos-rtt/work/orocos-rtt-2.8.1/rtt && /usr/bin/g++ -DOROCOS_TARGET=gnulinux -DRTT_DLL_EXPORT -I/local/robotpkg/var/tmp/robotpkg/middleware/orocos-rtt/work/orocos-rtt-2.8.1/rtt/os/gnulinux -I/local/robotpkg/var/tmp/robotpkg/middleware/orocos-rtt/work/orocos-rtt-2.8.1/rtt/os -I/local/robotpkg/var/tmp/robotpkg/middleware/orocos-rtt/work/orocos-rtt-2.8.1/rtt -I/local/robotpkg/var/tmp/robotpkg/middleware/orocos-rtt/work/orocos-rtt-2.8.1 -pipe -O3 -DNDEBUG -fmessage-length=0 -fPIC -Wall -o CMakeFiles/orocos-rtt-gnulinux_dynamic.dir/extras/MultiVector.cpp.o -c /local/robotpkg/var/tmp/robotpkg/middleware/orocos-rtt/work/orocos-rtt-2.8.1/rtt/extras/MultiVector.cpp [ 51%] Building CXX object rtt/CMakeFiles/orocos-rtt-gnulinux_dynamic.dir/extras/PeriodicActivity.cpp.o cd /local/robotpkg/var/tmp/robotpkg/middleware/orocos-rtt/work/orocos-rtt-2.8.1/rtt && /usr/bin/g++ -DOROCOS_TARGET=gnulinux -DRTT_DLL_EXPORT -I/local/robotpkg/var/tmp/robotpkg/middleware/orocos-rtt/work/orocos-rtt-2.8.1/rtt/os/gnulinux -I/local/robotpkg/var/tmp/robotpkg/middleware/orocos-rtt/work/orocos-rtt-2.8.1/rtt/os -I/local/robotpkg/var/tmp/robotpkg/middleware/orocos-rtt/work/orocos-rtt-2.8.1/rtt -I/local/robotpkg/var/tmp/robotpkg/middleware/orocos-rtt/work/orocos-rtt-2.8.1 -pipe -O3 -DNDEBUG -fmessage-length=0 -fPIC -Wall -o CMakeFiles/orocos-rtt-gnulinux_dynamic.dir/extras/PeriodicActivity.cpp.o -c /local/robotpkg/var/tmp/robotpkg/middleware/orocos-rtt/work/orocos-rtt-2.8.1/rtt/extras/PeriodicActivity.cpp [ 51%] Building CXX object rtt/CMakeFiles/orocos-rtt-gnulinux_dynamic.dir/extras/SequentialActivity.cpp.o cd /local/robotpkg/var/tmp/robotpkg/middleware/orocos-rtt/work/orocos-rtt-2.8.1/rtt && /usr/bin/g++ -DOROCOS_TARGET=gnulinux -DRTT_DLL_EXPORT -I/local/robotpkg/var/tmp/robotpkg/middleware/orocos-rtt/work/orocos-rtt-2.8.1/rtt/os/gnulinux -I/local/robotpkg/var/tmp/robotpkg/middleware/orocos-rtt/work/orocos-rtt-2.8.1/rtt/os -I/local/robotpkg/var/tmp/robotpkg/middleware/orocos-rtt/work/orocos-rtt-2.8.1/rtt -I/local/robotpkg/var/tmp/robotpkg/middleware/orocos-rtt/work/orocos-rtt-2.8.1 -pipe -O3 -DNDEBUG -fmessage-length=0 -fPIC -Wall -o CMakeFiles/orocos-rtt-gnulinux_dynamic.dir/extras/SequentialActivity.cpp.o -c /local/robotpkg/var/tmp/robotpkg/middleware/orocos-rtt/work/orocos-rtt-2.8.1/rtt/extras/SequentialActivity.cpp [ 52%] Building CXX object rtt/CMakeFiles/orocos-rtt-gnulinux_dynamic.dir/extras/SimulationActivity.cpp.o cd /local/robotpkg/var/tmp/robotpkg/middleware/orocos-rtt/work/orocos-rtt-2.8.1/rtt && /usr/bin/g++ -DOROCOS_TARGET=gnulinux -DRTT_DLL_EXPORT -I/local/robotpkg/var/tmp/robotpkg/middleware/orocos-rtt/work/orocos-rtt-2.8.1/rtt/os/gnulinux -I/local/robotpkg/var/tmp/robotpkg/middleware/orocos-rtt/work/orocos-rtt-2.8.1/rtt/os -I/local/robotpkg/var/tmp/robotpkg/middleware/orocos-rtt/work/orocos-rtt-2.8.1/rtt -I/local/robotpkg/var/tmp/robotpkg/middleware/orocos-rtt/work/orocos-rtt-2.8.1 -pipe -O3 -DNDEBUG -fmessage-length=0 -fPIC -Wall -o CMakeFiles/orocos-rtt-gnulinux_dynamic.dir/extras/SimulationActivity.cpp.o -c /local/robotpkg/var/tmp/robotpkg/middleware/orocos-rtt/work/orocos-rtt-2.8.1/rtt/extras/SimulationActivity.cpp [ 52%] Building CXX object rtt/CMakeFiles/orocos-rtt-gnulinux_dynamic.dir/extras/SimulationThread.cpp.o cd /local/robotpkg/var/tmp/robotpkg/middleware/orocos-rtt/work/orocos-rtt-2.8.1/rtt && /usr/bin/g++ -DOROCOS_TARGET=gnulinux -DRTT_DLL_EXPORT -I/local/robotpkg/var/tmp/robotpkg/middleware/orocos-rtt/work/orocos-rtt-2.8.1/rtt/os/gnulinux -I/local/robotpkg/var/tmp/robotpkg/middleware/orocos-rtt/work/orocos-rtt-2.8.1/rtt/os -I/local/robotpkg/var/tmp/robotpkg/middleware/orocos-rtt/work/orocos-rtt-2.8.1/rtt -I/local/robotpkg/var/tmp/robotpkg/middleware/orocos-rtt/work/orocos-rtt-2.8.1 -pipe -O3 -DNDEBUG -fmessage-length=0 -fPIC -Wall -o CMakeFiles/orocos-rtt-gnulinux_dynamic.dir/extras/SimulationThread.cpp.o -c /local/robotpkg/var/tmp/robotpkg/middleware/orocos-rtt/work/orocos-rtt-2.8.1/rtt/extras/SimulationThread.cpp [ 54%] Building CXX object rtt/CMakeFiles/orocos-rtt-gnulinux_dynamic.dir/extras/SlaveActivity.cpp.o cd /local/robotpkg/var/tmp/robotpkg/middleware/orocos-rtt/work/orocos-rtt-2.8.1/rtt && /usr/bin/g++ -DOROCOS_TARGET=gnulinux -DRTT_DLL_EXPORT -I/local/robotpkg/var/tmp/robotpkg/middleware/orocos-rtt/work/orocos-rtt-2.8.1/rtt/os/gnulinux -I/local/robotpkg/var/tmp/robotpkg/middleware/orocos-rtt/work/orocos-rtt-2.8.1/rtt/os -I/local/robotpkg/var/tmp/robotpkg/middleware/orocos-rtt/work/orocos-rtt-2.8.1/rtt -I/local/robotpkg/var/tmp/robotpkg/middleware/orocos-rtt/work/orocos-rtt-2.8.1 -pipe -O3 -DNDEBUG -fmessage-length=0 -fPIC -Wall -o CMakeFiles/orocos-rtt-gnulinux_dynamic.dir/extras/SlaveActivity.cpp.o -c /local/robotpkg/var/tmp/robotpkg/middleware/orocos-rtt/work/orocos-rtt-2.8.1/rtt/extras/SlaveActivity.cpp [ 54%] Building CXX object rtt/CMakeFiles/orocos-rtt-gnulinux_dynamic.dir/extras/TimerThread.cpp.o cd /local/robotpkg/var/tmp/robotpkg/middleware/orocos-rtt/work/orocos-rtt-2.8.1/rtt && /usr/bin/g++ -DOROCOS_TARGET=gnulinux -DRTT_DLL_EXPORT -I/local/robotpkg/var/tmp/robotpkg/middleware/orocos-rtt/work/orocos-rtt-2.8.1/rtt/os/gnulinux -I/local/robotpkg/var/tmp/robotpkg/middleware/orocos-rtt/work/orocos-rtt-2.8.1/rtt/os -I/local/robotpkg/var/tmp/robotpkg/middleware/orocos-rtt/work/orocos-rtt-2.8.1/rtt -I/local/robotpkg/var/tmp/robotpkg/middleware/orocos-rtt/work/orocos-rtt-2.8.1 -pipe -O3 -DNDEBUG -fmessage-length=0 -fPIC -Wall -o CMakeFiles/orocos-rtt-gnulinux_dynamic.dir/extras/TimerThread.cpp.o -c /local/robotpkg/var/tmp/robotpkg/middleware/orocos-rtt/work/orocos-rtt-2.8.1/rtt/extras/TimerThread.cpp [ 55%] Building CXX object rtt/CMakeFiles/orocos-rtt-gnulinux_dynamic.dir/extras/dev/AxisInterface.cpp.o cd /local/robotpkg/var/tmp/robotpkg/middleware/orocos-rtt/work/orocos-rtt-2.8.1/rtt && /usr/bin/g++ -DOROCOS_TARGET=gnulinux -DRTT_DLL_EXPORT -I/local/robotpkg/var/tmp/robotpkg/middleware/orocos-rtt/work/orocos-rtt-2.8.1/rtt/os/gnulinux -I/local/robotpkg/var/tmp/robotpkg/middleware/orocos-rtt/work/orocos-rtt-2.8.1/rtt/os -I/local/robotpkg/var/tmp/robotpkg/middleware/orocos-rtt/work/orocos-rtt-2.8.1/rtt -I/local/robotpkg/var/tmp/robotpkg/middleware/orocos-rtt/work/orocos-rtt-2.8.1 -pipe -O3 -DNDEBUG -fmessage-length=0 -fPIC -Wall -o CMakeFiles/orocos-rtt-gnulinux_dynamic.dir/extras/dev/AxisInterface.cpp.o -c /local/robotpkg/var/tmp/robotpkg/middleware/orocos-rtt/work/orocos-rtt-2.8.1/rtt/extras/dev/AxisInterface.cpp [ 55%] Building CXX object rtt/CMakeFiles/orocos-rtt-gnulinux_dynamic.dir/extras/dev/EncoderInterface.cpp.o cd /local/robotpkg/var/tmp/robotpkg/middleware/orocos-rtt/work/orocos-rtt-2.8.1/rtt && /usr/bin/g++ -DOROCOS_TARGET=gnulinux -DRTT_DLL_EXPORT -I/local/robotpkg/var/tmp/robotpkg/middleware/orocos-rtt/work/orocos-rtt-2.8.1/rtt/os/gnulinux -I/local/robotpkg/var/tmp/robotpkg/middleware/orocos-rtt/work/orocos-rtt-2.8.1/rtt/os -I/local/robotpkg/var/tmp/robotpkg/middleware/orocos-rtt/work/orocos-rtt-2.8.1/rtt -I/local/robotpkg/var/tmp/robotpkg/middleware/orocos-rtt/work/orocos-rtt-2.8.1 -pipe -O3 -DNDEBUG -fmessage-length=0 -fPIC -Wall -o CMakeFiles/orocos-rtt-gnulinux_dynamic.dir/extras/dev/EncoderInterface.cpp.o -c /local/robotpkg/var/tmp/robotpkg/middleware/orocos-rtt/work/orocos-rtt-2.8.1/rtt/extras/dev/EncoderInterface.cpp [ 55%] Building CXX object rtt/CMakeFiles/orocos-rtt-gnulinux_dynamic.dir/extras/dev/HomingInterface.cpp.o cd /local/robotpkg/var/tmp/robotpkg/middleware/orocos-rtt/work/orocos-rtt-2.8.1/rtt && /usr/bin/g++ -DOROCOS_TARGET=gnulinux -DRTT_DLL_EXPORT -I/local/robotpkg/var/tmp/robotpkg/middleware/orocos-rtt/work/orocos-rtt-2.8.1/rtt/os/gnulinux -I/local/robotpkg/var/tmp/robotpkg/middleware/orocos-rtt/work/orocos-rtt-2.8.1/rtt/os -I/local/robotpkg/var/tmp/robotpkg/middleware/orocos-rtt/work/orocos-rtt-2.8.1/rtt -I/local/robotpkg/var/tmp/robotpkg/middleware/orocos-rtt/work/orocos-rtt-2.8.1 -pipe -O3 -DNDEBUG -fmessage-length=0 -fPIC -Wall -o CMakeFiles/orocos-rtt-gnulinux_dynamic.dir/extras/dev/HomingInterface.cpp.o -c /local/robotpkg/var/tmp/robotpkg/middleware/orocos-rtt/work/orocos-rtt-2.8.1/rtt/extras/dev/HomingInterface.cpp [ 56%] Building CXX object rtt/CMakeFiles/orocos-rtt-gnulinux_dynamic.dir/extras/dev/PulseTrainGeneratorInterface.cpp.o cd /local/robotpkg/var/tmp/robotpkg/middleware/orocos-rtt/work/orocos-rtt-2.8.1/rtt && /usr/bin/g++ -DOROCOS_TARGET=gnulinux -DRTT_DLL_EXPORT -I/local/robotpkg/var/tmp/robotpkg/middleware/orocos-rtt/work/orocos-rtt-2.8.1/rtt/os/gnulinux -I/local/robotpkg/var/tmp/robotpkg/middleware/orocos-rtt/work/orocos-rtt-2.8.1/rtt/os -I/local/robotpkg/var/tmp/robotpkg/middleware/orocos-rtt/work/orocos-rtt-2.8.1/rtt -I/local/robotpkg/var/tmp/robotpkg/middleware/orocos-rtt/work/orocos-rtt-2.8.1 -pipe -O3 -DNDEBUG -fmessage-length=0 -fPIC -Wall -o CMakeFiles/orocos-rtt-gnulinux_dynamic.dir/extras/dev/PulseTrainGeneratorInterface.cpp.o -c /local/robotpkg/var/tmp/robotpkg/middleware/orocos-rtt/work/orocos-rtt-2.8.1/rtt/extras/dev/PulseTrainGeneratorInterface.cpp [ 56%] Building CXX object rtt/CMakeFiles/orocos-rtt-gnulinux_dynamic.dir/extras/dev/SensorInterface.cpp.o cd /local/robotpkg/var/tmp/robotpkg/middleware/orocos-rtt/work/orocos-rtt-2.8.1/rtt && /usr/bin/g++ -DOROCOS_TARGET=gnulinux -DRTT_DLL_EXPORT -I/local/robotpkg/var/tmp/robotpkg/middleware/orocos-rtt/work/orocos-rtt-2.8.1/rtt/os/gnulinux -I/local/robotpkg/var/tmp/robotpkg/middleware/orocos-rtt/work/orocos-rtt-2.8.1/rtt/os -I/local/robotpkg/var/tmp/robotpkg/middleware/orocos-rtt/work/orocos-rtt-2.8.1/rtt -I/local/robotpkg/var/tmp/robotpkg/middleware/orocos-rtt/work/orocos-rtt-2.8.1 -pipe -O3 -DNDEBUG -fmessage-length=0 -fPIC -Wall -o CMakeFiles/orocos-rtt-gnulinux_dynamic.dir/extras/dev/SensorInterface.cpp.o -c /local/robotpkg/var/tmp/robotpkg/middleware/orocos-rtt/work/orocos-rtt-2.8.1/rtt/extras/dev/SensorInterface.cpp [ 58%] Building CXX object rtt/CMakeFiles/orocos-rtt-gnulinux_dynamic.dir/extras/dev/io.cpp.o cd /local/robotpkg/var/tmp/robotpkg/middleware/orocos-rtt/work/orocos-rtt-2.8.1/rtt && /usr/bin/g++ -DOROCOS_TARGET=gnulinux -DRTT_DLL_EXPORT -I/local/robotpkg/var/tmp/robotpkg/middleware/orocos-rtt/work/orocos-rtt-2.8.1/rtt/os/gnulinux -I/local/robotpkg/var/tmp/robotpkg/middleware/orocos-rtt/work/orocos-rtt-2.8.1/rtt/os -I/local/robotpkg/var/tmp/robotpkg/middleware/orocos-rtt/work/orocos-rtt-2.8.1/rtt -I/local/robotpkg/var/tmp/robotpkg/middleware/orocos-rtt/work/orocos-rtt-2.8.1 -pipe -O3 -DNDEBUG -fmessage-length=0 -fPIC -Wall -o CMakeFiles/orocos-rtt-gnulinux_dynamic.dir/extras/dev/io.cpp.o -c /local/robotpkg/var/tmp/robotpkg/middleware/orocos-rtt/work/orocos-rtt-2.8.1/rtt/extras/dev/io.cpp [ 58%] Linking CXX shared library liborocos-rtt-gnulinux.so cd /local/robotpkg/var/tmp/robotpkg/middleware/orocos-rtt/work/orocos-rtt-2.8.1/rtt && /usr/bin/cmake -E cmake_link_script CMakeFiles/orocos-rtt-gnulinux_dynamic.dir/link.txt --verbose=1 /usr/bin/g++ -fPIC -pipe -O3 -DNDEBUG -fmessage-length=0 -Wl,-zdefs -shared -Wl,-soname,liborocos-rtt-gnulinux.so.2.8 -o liborocos-rtt-gnulinux.so.2.8.1 CMakeFiles/orocos-rtt-gnulinux_dynamic.dir/Activity.cpp.o CMakeFiles/orocos-rtt-gnulinux_dynamic.dir/ArgumentDescription.cpp.o CMakeFiles/orocos-rtt-gnulinux_dynamic.dir/Attribute.cpp.o CMakeFiles/orocos-rtt-gnulinux_dynamic.dir/ConfigurationInterface.cpp.o CMakeFiles/orocos-rtt-gnulinux_dynamic.dir/ConnPolicy.cpp.o CMakeFiles/orocos-rtt-gnulinux_dynamic.dir/DataFlowInterface.cpp.o CMakeFiles/orocos-rtt-gnulinux_dynamic.dir/ExecutionEngine.cpp.o CMakeFiles/orocos-rtt-gnulinux_dynamic.dir/FactoryExceptions.cpp.o CMakeFiles/orocos-rtt-gnulinux_dynamic.dir/FlowStatus.cpp.o CMakeFiles/orocos-rtt-gnulinux_dynamic.dir/Handle.cpp.o CMakeFiles/orocos-rtt-gnulinux_dynamic.dir/Logger.cpp.o CMakeFiles/orocos-rtt-gnulinux_dynamic.dir/Operation.cpp.o CMakeFiles/orocos-rtt-gnulinux_dynamic.dir/OperationInterface.cpp.o CMakeFiles/orocos-rtt-gnulinux_dynamic.dir/Property.cpp.o CMakeFiles/orocos-rtt-gnulinux_dynamic.dir/PropertyBag.cpp.o CMakeFiles/orocos-rtt-gnulinux_dynamic.dir/SendStatus.cpp.o CMakeFiles/orocos-rtt-gnulinux_dynamic.dir/Service.cpp.o CMakeFiles/orocos-rtt-gnulinux_dynamic.dir/ServiceRequester.cpp.o CMakeFiles/orocos-rtt-gnulinux_dynamic.dir/TaskContext.cpp.o CMakeFiles/orocos-rtt-gnulinux_dynamic.dir/os/tlsf/tlsf.c.o CMakeFiles/orocos-rtt-gnulinux_dynamic.dir/os/MainThread.cpp.o CMakeFiles/orocos-rtt-gnulinux_dynamic.dir/os/Mutex.cpp.o CMakeFiles/orocos-rtt-gnulinux_dynamic.dir/os/StartStopManager.cpp.o CMakeFiles/orocos-rtt-gnulinux_dynamic.dir/os/Thread.cpp.o CMakeFiles/orocos-rtt-gnulinux_dynamic.dir/os/ThreadInterface.cpp.o CMakeFiles/orocos-rtt-gnulinux_dynamic.dir/os/TimeService.cpp.o CMakeFiles/orocos-rtt-gnulinux_dynamic.dir/os/Timer.cpp.o CMakeFiles/orocos-rtt-gnulinux_dynamic.dir/os/exceptions.cpp.o CMakeFiles/orocos-rtt-gnulinux_dynamic.dir/os/rint.cpp.o CMakeFiles/orocos-rtt-gnulinux_dynamic.dir/os/rtconversions.cpp.o CMakeFiles/orocos-rtt-gnulinux_dynamic.dir/os/rtstreams.cpp.o CMakeFiles/orocos-rtt-gnulinux_dynamic.dir/os/startstop.cpp.o CMakeFiles/orocos-rtt-gnulinux_dynamic.dir/os/threads.cpp.o CMakeFiles/orocos-rtt-gnulinux_dynamic.dir/os/gnulinux/fosi_internal.cpp.o CMakeFiles/orocos-rtt-gnulinux_dynamic.dir/os/gnulinux/gnuthreads.cpp.o CMakeFiles/orocos-rtt-gnulinux_dynamic.dir/os/gnulinux/fosi.c.o CMakeFiles/orocos-rtt-gnulinux_dynamic.dir/base/ActionInterface.cpp.o CMakeFiles/orocos-rtt-gnulinux_dynamic.dir/base/ActivityInterface.cpp.o CMakeFiles/orocos-rtt-gnulinux_dynamic.dir/base/BufferBase.cpp.o CMakeFiles/orocos-rtt-gnulinux_dynamic.dir/base/BufferLockFree.cpp.o CMakeFiles/orocos-rtt-gnulinux_dynamic.dir/base/ChannelInterface.cpp.o CMakeFiles/orocos-rtt-gnulinux_dynamic.dir/base/CoreRunnableInterface.cpp.o CMakeFiles/orocos-rtt-gnulinux_dynamic.dir/base/InputPortInterface.cpp.o CMakeFiles/orocos-rtt-gnulinux_dynamic.dir/base/OperationBase.cpp.o CMakeFiles/orocos-rtt-gnulinux_dynamic.dir/base/OperationCallerInterface.cpp.o CMakeFiles/orocos-rtt-gnulinux_dynamic.dir/base/OutputPortInterface.cpp.o CMakeFiles/orocos-rtt-gnulinux_dynamic.dir/base/PortInterface.cpp.o CMakeFiles/orocos-rtt-gnulinux_dynamic.dir/base/PropertyBagVisitor.cpp.o CMakeFiles/orocos-rtt-gnulinux_dynamic.dir/base/PropertyBase.cpp.o CMakeFiles/orocos-rtt-gnulinux_dynamic.dir/base/TaskCore.cpp.o CMakeFiles/orocos-rtt-gnulinux_dynamic.dir/internal/CatchConfig.cpp.o CMakeFiles/orocos-rtt-gnulinux_dynamic.dir/internal/ConnFactory.cpp.o CMakeFiles/orocos-rtt-gnulinux_dynamic.dir/internal/ConnID.cpp.o CMakeFiles/orocos-rtt-gnulinux_dynamic.dir/internal/ConnectionManager.cpp.o CMakeFiles/orocos-rtt-gnulinux_dynamic.dir/internal/DataSource.cpp.o CMakeFiles/orocos-rtt-gnulinux_dynamic.dir/internal/DataSourceCommand.cpp.o CMakeFiles/orocos-rtt-gnulinux_dynamic.dir/internal/DataSources.cpp.o CMakeFiles/orocos-rtt-gnulinux_dynamic.dir/internal/GlobalEngine.cpp.o CMakeFiles/orocos-rtt-gnulinux_dynamic.dir/internal/GlobalService.cpp.o CMakeFiles/orocos-rtt-gnulinux_dynamic.dir/internal/ListLockFree.cpp.o CMakeFiles/orocos-rtt-gnulinux_dynamic.dir/internal/OperationCallerC.cpp.o CMakeFiles/orocos-rtt-gnulinux_dynamic.dir/internal/OperationInterfacePartFused.cpp.o CMakeFiles/orocos-rtt-gnulinux_dynamic.dir/internal/SendHandleC.cpp.o CMakeFiles/orocos-rtt-gnulinux_dynamic.dir/internal/SignalBase.cpp.o CMakeFiles/orocos-rtt-gnulinux_dynamic.dir/types/CompositionFactory.cpp.o CMakeFiles/orocos-rtt-gnulinux_dynamic.dir/types/GlobalsRepository.cpp.o CMakeFiles/orocos-rtt-gnulinux_dynamic.dir/types/MemberFactory.cpp.o CMakeFiles/orocos-rtt-gnulinux_dynamic.dir/types/Operators.cpp.o CMakeFiles/orocos-rtt-gnulinux_dynamic.dir/types/PropertyComposition.cpp.o CMakeFiles/orocos-rtt-gnulinux_dynamic.dir/types/PropertyDecomposition.cpp.o CMakeFiles/orocos-rtt-gnulinux_dynamic.dir/types/SequenceTypeInfoBase.cpp.o CMakeFiles/orocos-rtt-gnulinux_dynamic.dir/types/StreamFactory.cpp.o CMakeFiles/orocos-rtt-gnulinux_dynamic.dir/types/TypeConstructor.cpp.o CMakeFiles/orocos-rtt-gnulinux_dynamic.dir/types/TypeInfo.cpp.o CMakeFiles/orocos-rtt-gnulinux_dynamic.dir/types/TypeInfoRepository.cpp.o CMakeFiles/orocos-rtt-gnulinux_dynamic.dir/types/TypeStream-io.cpp.o CMakeFiles/orocos-rtt-gnulinux_dynamic.dir/types/TypeStream.cpp.o CMakeFiles/orocos-rtt-gnulinux_dynamic.dir/types/TypekitRepository.cpp.o CMakeFiles/orocos-rtt-gnulinux_dynamic.dir/types/Types.cpp.o CMakeFiles/orocos-rtt-gnulinux_dynamic.dir/types/ValueFactory.cpp.o CMakeFiles/orocos-rtt-gnulinux_dynamic.dir/plugin/Plugin.cpp.o CMakeFiles/orocos-rtt-gnulinux_dynamic.dir/plugin/PluginLoader.cpp.o CMakeFiles/orocos-rtt-gnulinux_dynamic.dir/plugin/pluginpath.cpp.o CMakeFiles/orocos-rtt-gnulinux_dynamic.dir/deployment/ComponentLoader.cpp.o CMakeFiles/orocos-rtt-gnulinux_dynamic.dir/deployment/comppath.cpp.o CMakeFiles/orocos-rtt-gnulinux_dynamic.dir/extras/FileDescriptorActivity.cpp.o CMakeFiles/orocos-rtt-gnulinux_dynamic.dir/extras/IRQActivity.cpp.o CMakeFiles/orocos-rtt-gnulinux_dynamic.dir/extras/MultiVector.cpp.o CMakeFiles/orocos-rtt-gnulinux_dynamic.dir/extras/PeriodicActivity.cpp.o CMakeFiles/orocos-rtt-gnulinux_dynamic.dir/extras/SequentialActivity.cpp.o CMakeFiles/orocos-rtt-gnulinux_dynamic.dir/extras/SimulationActivity.cpp.o CMakeFiles/orocos-rtt-gnulinux_dynamic.dir/extras/SimulationThread.cpp.o CMakeFiles/orocos-rtt-gnulinux_dynamic.dir/extras/SlaveActivity.cpp.o CMakeFiles/orocos-rtt-gnulinux_dynamic.dir/extras/TimerThread.cpp.o CMakeFiles/orocos-rtt-gnulinux_dynamic.dir/extras/dev/AxisInterface.cpp.o CMakeFiles/orocos-rtt-gnulinux_dynamic.dir/extras/dev/EncoderInterface.cpp.o CMakeFiles/orocos-rtt-gnulinux_dynamic.dir/extras/dev/HomingInterface.cpp.o CMakeFiles/orocos-rtt-gnulinux_dynamic.dir/extras/dev/PulseTrainGeneratorInterface.cpp.o CMakeFiles/orocos-rtt-gnulinux_dynamic.dir/extras/dev/SensorInterface.cpp.o CMakeFiles/orocos-rtt-gnulinux_dynamic.dir/extras/dev/io.cpp.o -lboost_filesystem -lboost_system -lboost_serialization -lxerces-c -lpthread -lrt -ldl cd /local/robotpkg/var/tmp/robotpkg/middleware/orocos-rtt/work/orocos-rtt-2.8.1/rtt && /usr/bin/cmake -E cmake_symlink_library liborocos-rtt-gnulinux.so.2.8.1 liborocos-rtt-gnulinux.so.2.8 liborocos-rtt-gnulinux.so make[2]: Leaving directory '/local/robotpkg/var/tmp/robotpkg/middleware/orocos-rtt/work/orocos-rtt-2.8.1' [ 58%] Built target orocos-rtt-gnulinux_dynamic make -f rtt/typekit/CMakeFiles/rtt-typekit-gnulinux_plugin.dir/build.make rtt/typekit/CMakeFiles/rtt-typekit-gnulinux_plugin.dir/depend make -f rtt/transports/mqueue/CMakeFiles/orocos-rtt-mqueue-gnulinux_dynamic.dir/build.make rtt/transports/mqueue/CMakeFiles/orocos-rtt-mqueue-gnulinux_dynamic.dir/depend make -f rtt/scripting/CMakeFiles/rtt-scripting-gnulinux_plugin.dir/build.make rtt/scripting/CMakeFiles/rtt-scripting-gnulinux_plugin.dir/depend make -f rtt/marsh/CMakeFiles/rtt-marshalling-gnulinux_plugin.dir/build.make rtt/marsh/CMakeFiles/rtt-marshalling-gnulinux_plugin.dir/depend make[2]: Entering directory '/local/robotpkg/var/tmp/robotpkg/middleware/orocos-rtt/work/orocos-rtt-2.8.1' cd /local/robotpkg/var/tmp/robotpkg/middleware/orocos-rtt/work/orocos-rtt-2.8.1 && /usr/bin/cmake -E cmake_depends "Unix Makefiles" /local/robotpkg/var/tmp/robotpkg/middleware/orocos-rtt/work/orocos-rtt-2.8.1 /local/robotpkg/var/tmp/robotpkg/middleware/orocos-rtt/work/orocos-rtt-2.8.1/rtt/transports/mqueue /local/robotpkg/var/tmp/robotpkg/middleware/orocos-rtt/work/orocos-rtt-2.8.1 /local/robotpkg/var/tmp/robotpkg/middleware/orocos-rtt/work/orocos-rtt-2.8.1/rtt/transports/mqueue /local/robotpkg/var/tmp/robotpkg/middleware/orocos-rtt/work/orocos-rtt-2.8.1/rtt/transports/mqueue/CMakeFiles/orocos-rtt-mqueue-gnulinux_dynamic.dir/DependInfo.cmake --color= make[2]: Entering directory '/local/robotpkg/var/tmp/robotpkg/middleware/orocos-rtt/work/orocos-rtt-2.8.1' cd /local/robotpkg/var/tmp/robotpkg/middleware/orocos-rtt/work/orocos-rtt-2.8.1 && /usr/bin/cmake -E cmake_depends "Unix Makefiles" /local/robotpkg/var/tmp/robotpkg/middleware/orocos-rtt/work/orocos-rtt-2.8.1 /local/robotpkg/var/tmp/robotpkg/middleware/orocos-rtt/work/orocos-rtt-2.8.1/rtt/scripting /local/robotpkg/var/tmp/robotpkg/middleware/orocos-rtt/work/orocos-rtt-2.8.1 /local/robotpkg/var/tmp/robotpkg/middleware/orocos-rtt/work/orocos-rtt-2.8.1/rtt/scripting /local/robotpkg/var/tmp/robotpkg/middleware/orocos-rtt/work/orocos-rtt-2.8.1/rtt/scripting/CMakeFiles/rtt-scripting-gnulinux_plugin.dir/DependInfo.cmake --color= make[2]: Entering directory '/local/robotpkg/var/tmp/robotpkg/middleware/orocos-rtt/work/orocos-rtt-2.8.1' cd /local/robotpkg/var/tmp/robotpkg/middleware/orocos-rtt/work/orocos-rtt-2.8.1 && /usr/bin/cmake -E cmake_depends "Unix Makefiles" /local/robotpkg/var/tmp/robotpkg/middleware/orocos-rtt/work/orocos-rtt-2.8.1 /local/robotpkg/var/tmp/robotpkg/middleware/orocos-rtt/work/orocos-rtt-2.8.1/rtt/typekit /local/robotpkg/var/tmp/robotpkg/middleware/orocos-rtt/work/orocos-rtt-2.8.1 /local/robotpkg/var/tmp/robotpkg/middleware/orocos-rtt/work/orocos-rtt-2.8.1/rtt/typekit /local/robotpkg/var/tmp/robotpkg/middleware/orocos-rtt/work/orocos-rtt-2.8.1/rtt/typekit/CMakeFiles/rtt-typekit-gnulinux_plugin.dir/DependInfo.cmake --color= make[2]: Entering directory '/local/robotpkg/var/tmp/robotpkg/middleware/orocos-rtt/work/orocos-rtt-2.8.1' cd /local/robotpkg/var/tmp/robotpkg/middleware/orocos-rtt/work/orocos-rtt-2.8.1 && /usr/bin/cmake -E cmake_depends "Unix Makefiles" /local/robotpkg/var/tmp/robotpkg/middleware/orocos-rtt/work/orocos-rtt-2.8.1 /local/robotpkg/var/tmp/robotpkg/middleware/orocos-rtt/work/orocos-rtt-2.8.1/rtt/marsh /local/robotpkg/var/tmp/robotpkg/middleware/orocos-rtt/work/orocos-rtt-2.8.1 /local/robotpkg/var/tmp/robotpkg/middleware/orocos-rtt/work/orocos-rtt-2.8.1/rtt/marsh /local/robotpkg/var/tmp/robotpkg/middleware/orocos-rtt/work/orocos-rtt-2.8.1/rtt/marsh/CMakeFiles/rtt-marshalling-gnulinux_plugin.dir/DependInfo.cmake --color= Scanning dependencies of target rtt-typekit-gnulinux_plugin make[2]: Leaving directory '/local/robotpkg/var/tmp/robotpkg/middleware/orocos-rtt/work/orocos-rtt-2.8.1' make -f rtt/typekit/CMakeFiles/rtt-typekit-gnulinux_plugin.dir/build.make rtt/typekit/CMakeFiles/rtt-typekit-gnulinux_plugin.dir/build Scanning dependencies of target orocos-rtt-mqueue-gnulinux_dynamic make[2]: Leaving directory '/local/robotpkg/var/tmp/robotpkg/middleware/orocos-rtt/work/orocos-rtt-2.8.1' make -f rtt/transports/mqueue/CMakeFiles/orocos-rtt-mqueue-gnulinux_dynamic.dir/build.make rtt/transports/mqueue/CMakeFiles/orocos-rtt-mqueue-gnulinux_dynamic.dir/build make[2]: Entering directory '/local/robotpkg/var/tmp/robotpkg/middleware/orocos-rtt/work/orocos-rtt-2.8.1' make[2]: Entering directory '/local/robotpkg/var/tmp/robotpkg/middleware/orocos-rtt/work/orocos-rtt-2.8.1' [ 59%] Building CXX object rtt/transports/mqueue/CMakeFiles/orocos-rtt-mqueue-gnulinux_dynamic.dir/Dispatcher.cpp.o cd /local/robotpkg/var/tmp/robotpkg/middleware/orocos-rtt/work/orocos-rtt-2.8.1/rtt/transports/mqueue && /usr/bin/g++ -DOROCOS_TARGET=gnulinux -DRTT_MQ_DLL_EXPORT -I/local/robotpkg/var/tmp/robotpkg/middleware/orocos-rtt/work/orocos-rtt-2.8.1/rtt/typekit -I/local/robotpkg/var/tmp/robotpkg/middleware/orocos-rtt/work/orocos-rtt-2.8.1/rtt/transports/mqueue -I/local/robotpkg/var/tmp/robotpkg/middleware/orocos-rtt/work/orocos-rtt-2.8.1/rtt/os/gnulinux -I/local/robotpkg/var/tmp/robotpkg/middleware/orocos-rtt/work/orocos-rtt-2.8.1/rtt/os -I/local/robotpkg/var/tmp/robotpkg/middleware/orocos-rtt/work/orocos-rtt-2.8.1/rtt -I/local/robotpkg/var/tmp/robotpkg/middleware/orocos-rtt/work/orocos-rtt-2.8.1 -pipe -O3 -DNDEBUG -fmessage-length=0 -fPIC -Wall -o CMakeFiles/orocos-rtt-mqueue-gnulinux_dynamic.dir/Dispatcher.cpp.o -c /local/robotpkg/var/tmp/robotpkg/middleware/orocos-rtt/work/orocos-rtt-2.8.1/rtt/transports/mqueue/Dispatcher.cpp [ 61%] Building CXX object rtt/typekit/CMakeFiles/rtt-typekit-gnulinux_plugin.dir/RealTimeTypekit.cpp.o cd /local/robotpkg/var/tmp/robotpkg/middleware/orocos-rtt/work/orocos-rtt-2.8.1/rtt/typekit && /usr/bin/g++ -DOROCOS_TARGET=gnulinux -DRTT_TYPEKIT_DLL_EXPORT -I/local/robotpkg/var/tmp/robotpkg/middleware/orocos-rtt/work/orocos-rtt-2.8.1/rtt/typekit -I/local/robotpkg/var/tmp/robotpkg/middleware/orocos-rtt/work/orocos-rtt-2.8.1/rtt/os/gnulinux -I/local/robotpkg/var/tmp/robotpkg/middleware/orocos-rtt/work/orocos-rtt-2.8.1/rtt/os -I/local/robotpkg/var/tmp/robotpkg/middleware/orocos-rtt/work/orocos-rtt-2.8.1/rtt -I/local/robotpkg/var/tmp/robotpkg/middleware/orocos-rtt/work/orocos-rtt-2.8.1 -pipe -O3 -DNDEBUG -fmessage-length=0 -fPIC -Wall -o CMakeFiles/rtt-typekit-gnulinux_plugin.dir/RealTimeTypekit.cpp.o -c /local/robotpkg/var/tmp/robotpkg/middleware/orocos-rtt/work/orocos-rtt-2.8.1/rtt/typekit/RealTimeTypekit.cpp Scanning dependencies of target rtt-marshalling-gnulinux_plugin make[2]: Leaving directory '/local/robotpkg/var/tmp/robotpkg/middleware/orocos-rtt/work/orocos-rtt-2.8.1' make -f rtt/marsh/CMakeFiles/rtt-marshalling-gnulinux_plugin.dir/build.make rtt/marsh/CMakeFiles/rtt-marshalling-gnulinux_plugin.dir/build make[2]: Entering directory '/local/robotpkg/var/tmp/robotpkg/middleware/orocos-rtt/work/orocos-rtt-2.8.1' [ 62%] Building CXX object rtt/marsh/CMakeFiles/rtt-marshalling-gnulinux_plugin.dir/PropertyMarshaller.cpp.o cd /local/robotpkg/var/tmp/robotpkg/middleware/orocos-rtt/work/orocos-rtt-2.8.1/rtt/marsh && /usr/bin/g++ -DOROCOS_TARGET=gnulinux -DRTT_MARSH_DLL_EXPORT -I/local/robotpkg/var/tmp/robotpkg/middleware/orocos-rtt/work/orocos-rtt-2.8.1/rtt/typekit -I/local/robotpkg/var/tmp/robotpkg/middleware/orocos-rtt/work/orocos-rtt-2.8.1/rtt/marsh -I/local/robotpkg/var/tmp/robotpkg/middleware/orocos-rtt/work/orocos-rtt-2.8.1/rtt/os/gnulinux -I/local/robotpkg/var/tmp/robotpkg/middleware/orocos-rtt/work/orocos-rtt-2.8.1/rtt/os -I/local/robotpkg/var/tmp/robotpkg/middleware/orocos-rtt/work/orocos-rtt-2.8.1/rtt -I/local/robotpkg/var/tmp/robotpkg/middleware/orocos-rtt/work/orocos-rtt-2.8.1 -pipe -O3 -DNDEBUG -fmessage-length=0 -fPIC -Wall -o CMakeFiles/rtt-marshalling-gnulinux_plugin.dir/PropertyMarshaller.cpp.o -c /local/robotpkg/var/tmp/robotpkg/middleware/orocos-rtt/work/orocos-rtt-2.8.1/rtt/marsh/PropertyMarshaller.cpp Scanning dependencies of target rtt-scripting-gnulinux_plugin make[2]: Leaving directory '/local/robotpkg/var/tmp/robotpkg/middleware/orocos-rtt/work/orocos-rtt-2.8.1' make -f rtt/scripting/CMakeFiles/rtt-scripting-gnulinux_plugin.dir/build.make rtt/scripting/CMakeFiles/rtt-scripting-gnulinux_plugin.dir/build make[2]: Entering directory '/local/robotpkg/var/tmp/robotpkg/middleware/orocos-rtt/work/orocos-rtt-2.8.1' [ 62%] Building CXX object rtt/scripting/CMakeFiles/rtt-scripting-gnulinux_plugin.dir/ArgumentsParser.cpp.o cd /local/robotpkg/var/tmp/robotpkg/middleware/orocos-rtt/work/orocos-rtt-2.8.1/rtt/scripting && /usr/bin/g++ -DOROCOS_TARGET=gnulinux -DRTT_SCRIPTING_DLL_EXPORT -I/local/robotpkg/var/tmp/robotpkg/middleware/orocos-rtt/work/orocos-rtt-2.8.1/rtt/typekit -I/local/robotpkg/var/tmp/robotpkg/middleware/orocos-rtt/work/orocos-rtt-2.8.1/rtt/scripting -I/local/robotpkg/var/tmp/robotpkg/middleware/orocos-rtt/work/orocos-rtt-2.8.1/rtt/os/gnulinux -I/local/robotpkg/var/tmp/robotpkg/middleware/orocos-rtt/work/orocos-rtt-2.8.1/rtt/os -I/local/robotpkg/var/tmp/robotpkg/middleware/orocos-rtt/work/orocos-rtt-2.8.1/rtt -I/local/robotpkg/var/tmp/robotpkg/middleware/orocos-rtt/work/orocos-rtt-2.8.1 -pipe -O3 -DNDEBUG -fmessage-length=0 -fPIC -Wall -o CMakeFiles/rtt-scripting-gnulinux_plugin.dir/ArgumentsParser.cpp.o -c /local/robotpkg/var/tmp/robotpkg/middleware/orocos-rtt/work/orocos-rtt-2.8.1/rtt/scripting/ArgumentsParser.cpp [ 62%] Building CXX object rtt/typekit/CMakeFiles/rtt-typekit-gnulinux_plugin.dir/RealTimeTypekitConstructors.cpp.o cd /local/robotpkg/var/tmp/robotpkg/middleware/orocos-rtt/work/orocos-rtt-2.8.1/rtt/typekit && /usr/bin/g++ -DOROCOS_TARGET=gnulinux -DRTT_TYPEKIT_DLL_EXPORT -I/local/robotpkg/var/tmp/robotpkg/middleware/orocos-rtt/work/orocos-rtt-2.8.1/rtt/typekit -I/local/robotpkg/var/tmp/robotpkg/middleware/orocos-rtt/work/orocos-rtt-2.8.1/rtt/os/gnulinux -I/local/robotpkg/var/tmp/robotpkg/middleware/orocos-rtt/work/orocos-rtt-2.8.1/rtt/os -I/local/robotpkg/var/tmp/robotpkg/middleware/orocos-rtt/work/orocos-rtt-2.8.1/rtt -I/local/robotpkg/var/tmp/robotpkg/middleware/orocos-rtt/work/orocos-rtt-2.8.1 -pipe -O3 -DNDEBUG -fmessage-length=0 -fPIC -Wall -o CMakeFiles/rtt-typekit-gnulinux_plugin.dir/RealTimeTypekitConstructors.cpp.o -c /local/robotpkg/var/tmp/robotpkg/middleware/orocos-rtt/work/orocos-rtt-2.8.1/rtt/typekit/RealTimeTypekitConstructors.cpp [ 62%] Building CXX object rtt/transports/mqueue/CMakeFiles/orocos-rtt-mqueue-gnulinux_dynamic.dir/MQSendRecv.cpp.o cd /local/robotpkg/var/tmp/robotpkg/middleware/orocos-rtt/work/orocos-rtt-2.8.1/rtt/transports/mqueue && /usr/bin/g++ -DOROCOS_TARGET=gnulinux -DRTT_MQ_DLL_EXPORT -I/local/robotpkg/var/tmp/robotpkg/middleware/orocos-rtt/work/orocos-rtt-2.8.1/rtt/typekit -I/local/robotpkg/var/tmp/robotpkg/middleware/orocos-rtt/work/orocos-rtt-2.8.1/rtt/transports/mqueue -I/local/robotpkg/var/tmp/robotpkg/middleware/orocos-rtt/work/orocos-rtt-2.8.1/rtt/os/gnulinux -I/local/robotpkg/var/tmp/robotpkg/middleware/orocos-rtt/work/orocos-rtt-2.8.1/rtt/os -I/local/robotpkg/var/tmp/robotpkg/middleware/orocos-rtt/work/orocos-rtt-2.8.1/rtt -I/local/robotpkg/var/tmp/robotpkg/middleware/orocos-rtt/work/orocos-rtt-2.8.1 -pipe -O3 -DNDEBUG -fmessage-length=0 -fPIC -Wall -o CMakeFiles/orocos-rtt-mqueue-gnulinux_dynamic.dir/MQSendRecv.cpp.o -c /local/robotpkg/var/tmp/robotpkg/middleware/orocos-rtt/work/orocos-rtt-2.8.1/rtt/transports/mqueue/MQSendRecv.cpp [ 62%] Building CXX object rtt/marsh/CMakeFiles/rtt-marshalling-gnulinux_plugin.dir/PropertyDemarshaller.cpp.o cd /local/robotpkg/var/tmp/robotpkg/middleware/orocos-rtt/work/orocos-rtt-2.8.1/rtt/marsh && /usr/bin/g++ -DOROCOS_TARGET=gnulinux -DRTT_MARSH_DLL_EXPORT -I/local/robotpkg/var/tmp/robotpkg/middleware/orocos-rtt/work/orocos-rtt-2.8.1/rtt/typekit -I/local/robotpkg/var/tmp/robotpkg/middleware/orocos-rtt/work/orocos-rtt-2.8.1/rtt/marsh -I/local/robotpkg/var/tmp/robotpkg/middleware/orocos-rtt/work/orocos-rtt-2.8.1/rtt/os/gnulinux -I/local/robotpkg/var/tmp/robotpkg/middleware/orocos-rtt/work/orocos-rtt-2.8.1/rtt/os -I/local/robotpkg/var/tmp/robotpkg/middleware/orocos-rtt/work/orocos-rtt-2.8.1/rtt -I/local/robotpkg/var/tmp/robotpkg/middleware/orocos-rtt/work/orocos-rtt-2.8.1 -pipe -O3 -DNDEBUG -fmessage-length=0 -fPIC -Wall -o CMakeFiles/rtt-marshalling-gnulinux_plugin.dir/PropertyDemarshaller.cpp.o -c /local/robotpkg/var/tmp/robotpkg/middleware/orocos-rtt/work/orocos-rtt-2.8.1/rtt/marsh/PropertyDemarshaller.cpp [ 63%] Building CXX object rtt/marsh/CMakeFiles/rtt-marshalling-gnulinux_plugin.dir/PropertyBagIntrospector.cpp.o cd /local/robotpkg/var/tmp/robotpkg/middleware/orocos-rtt/work/orocos-rtt-2.8.1/rtt/marsh && /usr/bin/g++ -DOROCOS_TARGET=gnulinux -DRTT_MARSH_DLL_EXPORT -I/local/robotpkg/var/tmp/robotpkg/middleware/orocos-rtt/work/orocos-rtt-2.8.1/rtt/typekit -I/local/robotpkg/var/tmp/robotpkg/middleware/orocos-rtt/work/orocos-rtt-2.8.1/rtt/marsh -I/local/robotpkg/var/tmp/robotpkg/middleware/orocos-rtt/work/orocos-rtt-2.8.1/rtt/os/gnulinux -I/local/robotpkg/var/tmp/robotpkg/middleware/orocos-rtt/work/orocos-rtt-2.8.1/rtt/os -I/local/robotpkg/var/tmp/robotpkg/middleware/orocos-rtt/work/orocos-rtt-2.8.1/rtt -I/local/robotpkg/var/tmp/robotpkg/middleware/orocos-rtt/work/orocos-rtt-2.8.1 -pipe -O3 -DNDEBUG -fmessage-length=0 -fPIC -Wall -o CMakeFiles/rtt-marshalling-gnulinux_plugin.dir/PropertyBagIntrospector.cpp.o -c /local/robotpkg/var/tmp/robotpkg/middleware/orocos-rtt/work/orocos-rtt-2.8.1/rtt/marsh/PropertyBagIntrospector.cpp [ 63%] Building CXX object rtt/marsh/CMakeFiles/rtt-marshalling-gnulinux_plugin.dir/CPFDTD.cpp.o cd /local/robotpkg/var/tmp/robotpkg/middleware/orocos-rtt/work/orocos-rtt-2.8.1/rtt/marsh && /usr/bin/g++ -DOROCOS_TARGET=gnulinux -DRTT_MARSH_DLL_EXPORT -I/local/robotpkg/var/tmp/robotpkg/middleware/orocos-rtt/work/orocos-rtt-2.8.1/rtt/typekit -I/local/robotpkg/var/tmp/robotpkg/middleware/orocos-rtt/work/orocos-rtt-2.8.1/rtt/marsh -I/local/robotpkg/var/tmp/robotpkg/middleware/orocos-rtt/work/orocos-rtt-2.8.1/rtt/os/gnulinux -I/local/robotpkg/var/tmp/robotpkg/middleware/orocos-rtt/work/orocos-rtt-2.8.1/rtt/os -I/local/robotpkg/var/tmp/robotpkg/middleware/orocos-rtt/work/orocos-rtt-2.8.1/rtt -I/local/robotpkg/var/tmp/robotpkg/middleware/orocos-rtt/work/orocos-rtt-2.8.1 -pipe -O3 -DNDEBUG -fmessage-length=0 -fPIC -Wall -o CMakeFiles/rtt-marshalling-gnulinux_plugin.dir/CPFDTD.cpp.o -c /local/robotpkg/var/tmp/robotpkg/middleware/orocos-rtt/work/orocos-rtt-2.8.1/rtt/marsh/CPFDTD.cpp [ 63%] Building CXX object rtt/marsh/CMakeFiles/rtt-marshalling-gnulinux_plugin.dir/CPFMarshaller.cpp.o cd /local/robotpkg/var/tmp/robotpkg/middleware/orocos-rtt/work/orocos-rtt-2.8.1/rtt/marsh && /usr/bin/g++ -DOROCOS_TARGET=gnulinux -DRTT_MARSH_DLL_EXPORT -I/local/robotpkg/var/tmp/robotpkg/middleware/orocos-rtt/work/orocos-rtt-2.8.1/rtt/typekit -I/local/robotpkg/var/tmp/robotpkg/middleware/orocos-rtt/work/orocos-rtt-2.8.1/rtt/marsh -I/local/robotpkg/var/tmp/robotpkg/middleware/orocos-rtt/work/orocos-rtt-2.8.1/rtt/os/gnulinux -I/local/robotpkg/var/tmp/robotpkg/middleware/orocos-rtt/work/orocos-rtt-2.8.1/rtt/os -I/local/robotpkg/var/tmp/robotpkg/middleware/orocos-rtt/work/orocos-rtt-2.8.1/rtt -I/local/robotpkg/var/tmp/robotpkg/middleware/orocos-rtt/work/orocos-rtt-2.8.1 -pipe -O3 -DNDEBUG -fmessage-length=0 -fPIC -Wall -o CMakeFiles/rtt-marshalling-gnulinux_plugin.dir/CPFMarshaller.cpp.o -c /local/robotpkg/var/tmp/robotpkg/middleware/orocos-rtt/work/orocos-rtt-2.8.1/rtt/marsh/CPFMarshaller.cpp [ 63%] Linking CXX shared library liborocos-rtt-mqueue-gnulinux.so cd /local/robotpkg/var/tmp/robotpkg/middleware/orocos-rtt/work/orocos-rtt-2.8.1/rtt/transports/mqueue && /usr/bin/cmake -E cmake_link_script CMakeFiles/orocos-rtt-mqueue-gnulinux_dynamic.dir/link.txt --verbose=1 /usr/bin/g++ -fPIC -pipe -O3 -DNDEBUG -fmessage-length=0 -shared -Wl,-soname,liborocos-rtt-mqueue-gnulinux.so.2.8 -o liborocos-rtt-mqueue-gnulinux.so.2.8.1 CMakeFiles/orocos-rtt-mqueue-gnulinux_dynamic.dir/Dispatcher.cpp.o CMakeFiles/orocos-rtt-mqueue-gnulinux_dynamic.dir/MQSendRecv.cpp.o -Wl,-rpath,/local/robotpkg/var/tmp/robotpkg/middleware/orocos-rtt/work/orocos-rtt-2.8.1/rtt: ../../liborocos-rtt-gnulinux.so.2.8.1 -lboost_serialization -lboost_filesystem -lboost_system -lboost_serialization -lxerces-c -lpthread -lrt -ldl cd /local/robotpkg/var/tmp/robotpkg/middleware/orocos-rtt/work/orocos-rtt-2.8.1/rtt/transports/mqueue && /usr/bin/cmake -E cmake_symlink_library liborocos-rtt-mqueue-gnulinux.so.2.8.1 liborocos-rtt-mqueue-gnulinux.so.2.8 liborocos-rtt-mqueue-gnulinux.so make[2]: Leaving directory '/local/robotpkg/var/tmp/robotpkg/middleware/orocos-rtt/work/orocos-rtt-2.8.1' [ 63%] Built target orocos-rtt-mqueue-gnulinux_dynamic [ 65%] Building CXX object rtt/marsh/CMakeFiles/rtt-marshalling-gnulinux_plugin.dir/Marshalling.cpp.o cd /local/robotpkg/var/tmp/robotpkg/middleware/orocos-rtt/work/orocos-rtt-2.8.1/rtt/marsh && /usr/bin/g++ -DOROCOS_TARGET=gnulinux -DRTT_MARSH_DLL_EXPORT -I/local/robotpkg/var/tmp/robotpkg/middleware/orocos-rtt/work/orocos-rtt-2.8.1/rtt/typekit -I/local/robotpkg/var/tmp/robotpkg/middleware/orocos-rtt/work/orocos-rtt-2.8.1/rtt/marsh -I/local/robotpkg/var/tmp/robotpkg/middleware/orocos-rtt/work/orocos-rtt-2.8.1/rtt/os/gnulinux -I/local/robotpkg/var/tmp/robotpkg/middleware/orocos-rtt/work/orocos-rtt-2.8.1/rtt/os -I/local/robotpkg/var/tmp/robotpkg/middleware/orocos-rtt/work/orocos-rtt-2.8.1/rtt -I/local/robotpkg/var/tmp/robotpkg/middleware/orocos-rtt/work/orocos-rtt-2.8.1 -pipe -O3 -DNDEBUG -fmessage-length=0 -fPIC -Wall -o CMakeFiles/rtt-marshalling-gnulinux_plugin.dir/Marshalling.cpp.o -c /local/robotpkg/var/tmp/robotpkg/middleware/orocos-rtt/work/orocos-rtt-2.8.1/rtt/marsh/Marshalling.cpp make -f rtt/transports/mqueue/CMakeFiles/rtt-transport-mqueue-gnulinux_plugin.dir/build.make rtt/transports/mqueue/CMakeFiles/rtt-transport-mqueue-gnulinux_plugin.dir/depend make[2]: Entering directory '/local/robotpkg/var/tmp/robotpkg/middleware/orocos-rtt/work/orocos-rtt-2.8.1' cd /local/robotpkg/var/tmp/robotpkg/middleware/orocos-rtt/work/orocos-rtt-2.8.1 && /usr/bin/cmake -E cmake_depends "Unix Makefiles" /local/robotpkg/var/tmp/robotpkg/middleware/orocos-rtt/work/orocos-rtt-2.8.1 /local/robotpkg/var/tmp/robotpkg/middleware/orocos-rtt/work/orocos-rtt-2.8.1/rtt/transports/mqueue /local/robotpkg/var/tmp/robotpkg/middleware/orocos-rtt/work/orocos-rtt-2.8.1 /local/robotpkg/var/tmp/robotpkg/middleware/orocos-rtt/work/orocos-rtt-2.8.1/rtt/transports/mqueue /local/robotpkg/var/tmp/robotpkg/middleware/orocos-rtt/work/orocos-rtt-2.8.1/rtt/transports/mqueue/CMakeFiles/rtt-transport-mqueue-gnulinux_plugin.dir/DependInfo.cmake --color= Scanning dependencies of target rtt-transport-mqueue-gnulinux_plugin make[2]: Leaving directory '/local/robotpkg/var/tmp/robotpkg/middleware/orocos-rtt/work/orocos-rtt-2.8.1' make -f rtt/transports/mqueue/CMakeFiles/rtt-transport-mqueue-gnulinux_plugin.dir/build.make rtt/transports/mqueue/CMakeFiles/rtt-transport-mqueue-gnulinux_plugin.dir/build make[2]: Entering directory '/local/robotpkg/var/tmp/robotpkg/middleware/orocos-rtt/work/orocos-rtt-2.8.1' [ 66%] Building CXX object rtt/transports/mqueue/CMakeFiles/rtt-transport-mqueue-gnulinux_plugin.dir/MQLib.cpp.o cd /local/robotpkg/var/tmp/robotpkg/middleware/orocos-rtt/work/orocos-rtt-2.8.1/rtt/transports/mqueue && /usr/bin/g++ -DOROCOS_TARGET=gnulinux -Drtt_transport_mqueue_gnulinux_plugin_EXPORTS -I/local/robotpkg/var/tmp/robotpkg/middleware/orocos-rtt/work/orocos-rtt-2.8.1/rtt/typekit -I/local/robotpkg/var/tmp/robotpkg/middleware/orocos-rtt/work/orocos-rtt-2.8.1/rtt/transports/mqueue -I/local/robotpkg/var/tmp/robotpkg/middleware/orocos-rtt/work/orocos-rtt-2.8.1/rtt/os/gnulinux -I/local/robotpkg/var/tmp/robotpkg/middleware/orocos-rtt/work/orocos-rtt-2.8.1/rtt/os -I/local/robotpkg/var/tmp/robotpkg/middleware/orocos-rtt/work/orocos-rtt-2.8.1/rtt -I/local/robotpkg/var/tmp/robotpkg/middleware/orocos-rtt/work/orocos-rtt-2.8.1 -pipe -O3 -DNDEBUG -fmessage-length=0 -fPIC -Wall -o CMakeFiles/rtt-transport-mqueue-gnulinux_plugin.dir/MQLib.cpp.o -c /local/robotpkg/var/tmp/robotpkg/middleware/orocos-rtt/work/orocos-rtt-2.8.1/rtt/transports/mqueue/MQLib.cpp [ 66%] Building CXX object rtt/typekit/CMakeFiles/rtt-typekit-gnulinux_plugin.dir/RealTimeTypekitGlobals.cpp.o cd /local/robotpkg/var/tmp/robotpkg/middleware/orocos-rtt/work/orocos-rtt-2.8.1/rtt/typekit && /usr/bin/g++ -DOROCOS_TARGET=gnulinux -DRTT_TYPEKIT_DLL_EXPORT -I/local/robotpkg/var/tmp/robotpkg/middleware/orocos-rtt/work/orocos-rtt-2.8.1/rtt/typekit -I/local/robotpkg/var/tmp/robotpkg/middleware/orocos-rtt/work/orocos-rtt-2.8.1/rtt/os/gnulinux -I/local/robotpkg/var/tmp/robotpkg/middleware/orocos-rtt/work/orocos-rtt-2.8.1/rtt/os -I/local/robotpkg/var/tmp/robotpkg/middleware/orocos-rtt/work/orocos-rtt-2.8.1/rtt -I/local/robotpkg/var/tmp/robotpkg/middleware/orocos-rtt/work/orocos-rtt-2.8.1 -pipe -O3 -DNDEBUG -fmessage-length=0 -fPIC -Wall -o CMakeFiles/rtt-typekit-gnulinux_plugin.dir/RealTimeTypekitGlobals.cpp.o -c /local/robotpkg/var/tmp/robotpkg/middleware/orocos-rtt/work/orocos-rtt-2.8.1/rtt/typekit/RealTimeTypekitGlobals.cpp In file included from /usr/include/boost/iostreams/detail/is_dereferenceable.hpp:12:0, from /usr/include/boost/iostreams/detail/resolve.hpp:26, from /usr/include/boost/iostreams/detail/push.hpp:24, from /usr/include/boost/iostreams/detail/streambuf/indirect_streambuf.hpp:31, from /usr/include/boost/iostreams/stream_buffer.hpp:22, from /usr/include/boost/iostreams/stream.hpp:21, from /local/robotpkg/var/tmp/robotpkg/middleware/orocos-rtt/work/orocos-rtt-2.8.1/rtt/transports/mqueue/MQSerializationProtocol.hpp:51, from /local/robotpkg/var/tmp/robotpkg/middleware/orocos-rtt/work/orocos-rtt-2.8.1/rtt/transports/mqueue/MQLib.cpp:42: /usr/include/boost/type_traits/detail/bool_trait_def.hpp:18:79: note: #pragma message: NOTE: Use of this header (bool_trait_def.hpp) is deprecated # pragma message("NOTE: Use of this header (bool_trait_def.hpp) is deprecated") ^ In file included from /usr/include/boost/type_traits/detail/bool_trait_def.hpp:21:0, from /usr/include/boost/iostreams/detail/is_dereferenceable.hpp:12, from /usr/include/boost/iostreams/detail/resolve.hpp:26, from /usr/include/boost/iostreams/detail/push.hpp:24, from /usr/include/boost/iostreams/detail/streambuf/indirect_streambuf.hpp:31, from /usr/include/boost/iostreams/stream_buffer.hpp:22, from /usr/include/boost/iostreams/stream.hpp:21, from /local/robotpkg/var/tmp/robotpkg/middleware/orocos-rtt/work/orocos-rtt-2.8.1/rtt/transports/mqueue/MQSerializationProtocol.hpp:51, from /local/robotpkg/var/tmp/robotpkg/middleware/orocos-rtt/work/orocos-rtt-2.8.1/rtt/transports/mqueue/MQLib.cpp:42: /usr/include/boost/type_traits/detail/template_arity_spec.hpp:13:84: note: #pragma message: NOTE: Use of this header (template_arity_spec.hpp) is deprecated # pragma message("NOTE: Use of this header (template_arity_spec.hpp) is deprecated") ^ In file included from /usr/include/boost/iostreams/detail/is_dereferenceable.hpp:13:0, from /usr/include/boost/iostreams/detail/resolve.hpp:26, from /usr/include/boost/iostreams/detail/push.hpp:24, from /usr/include/boost/iostreams/detail/streambuf/indirect_streambuf.hpp:31, from /usr/include/boost/iostreams/stream_buffer.hpp:22, from /usr/include/boost/iostreams/stream.hpp:21, from /local/robotpkg/var/tmp/robotpkg/middleware/orocos-rtt/work/orocos-rtt-2.8.1/rtt/transports/mqueue/MQSerializationProtocol.hpp:51, from /local/robotpkg/var/tmp/robotpkg/middleware/orocos-rtt/work/orocos-rtt-2.8.1/rtt/transports/mqueue/MQLib.cpp:42: /usr/include/boost/type_traits/detail/template_arity_spec.hpp:13:84: note: #pragma message: NOTE: Use of this header (template_arity_spec.hpp) is deprecated # pragma message("NOTE: Use of this header (template_arity_spec.hpp) is deprecated") ^ [ 66%] Building CXX object rtt/scripting/CMakeFiles/rtt-scripting-gnulinux_plugin.dir/CommandCounter.cpp.o cd /local/robotpkg/var/tmp/robotpkg/middleware/orocos-rtt/work/orocos-rtt-2.8.1/rtt/scripting && /usr/bin/g++ -DOROCOS_TARGET=gnulinux -DRTT_SCRIPTING_DLL_EXPORT -I/local/robotpkg/var/tmp/robotpkg/middleware/orocos-rtt/work/orocos-rtt-2.8.1/rtt/typekit -I/local/robotpkg/var/tmp/robotpkg/middleware/orocos-rtt/work/orocos-rtt-2.8.1/rtt/scripting -I/local/robotpkg/var/tmp/robotpkg/middleware/orocos-rtt/work/orocos-rtt-2.8.1/rtt/os/gnulinux -I/local/robotpkg/var/tmp/robotpkg/middleware/orocos-rtt/work/orocos-rtt-2.8.1/rtt/os -I/local/robotpkg/var/tmp/robotpkg/middleware/orocos-rtt/work/orocos-rtt-2.8.1/rtt -I/local/robotpkg/var/tmp/robotpkg/middleware/orocos-rtt/work/orocos-rtt-2.8.1 -pipe -O3 -DNDEBUG -fmessage-length=0 -fPIC -Wall -o CMakeFiles/rtt-scripting-gnulinux_plugin.dir/CommandCounter.cpp.o -c /local/robotpkg/var/tmp/robotpkg/middleware/orocos-rtt/work/orocos-rtt-2.8.1/rtt/scripting/CommandCounter.cpp [ 68%] Building CXX object rtt/typekit/CMakeFiles/rtt-typekit-gnulinux_plugin.dir/RealTimeTypekitOperators.cpp.o cd /local/robotpkg/var/tmp/robotpkg/middleware/orocos-rtt/work/orocos-rtt-2.8.1/rtt/typekit && /usr/bin/g++ -DOROCOS_TARGET=gnulinux -DRTT_TYPEKIT_DLL_EXPORT -I/local/robotpkg/var/tmp/robotpkg/middleware/orocos-rtt/work/orocos-rtt-2.8.1/rtt/typekit -I/local/robotpkg/var/tmp/robotpkg/middleware/orocos-rtt/work/orocos-rtt-2.8.1/rtt/os/gnulinux -I/local/robotpkg/var/tmp/robotpkg/middleware/orocos-rtt/work/orocos-rtt-2.8.1/rtt/os -I/local/robotpkg/var/tmp/robotpkg/middleware/orocos-rtt/work/orocos-rtt-2.8.1/rtt -I/local/robotpkg/var/tmp/robotpkg/middleware/orocos-rtt/work/orocos-rtt-2.8.1 -pipe -O3 -DNDEBUG -fmessage-length=0 -fPIC -Wall -o CMakeFiles/rtt-typekit-gnulinux_plugin.dir/RealTimeTypekitOperators.cpp.o -c /local/robotpkg/var/tmp/robotpkg/middleware/orocos-rtt/work/orocos-rtt-2.8.1/rtt/typekit/RealTimeTypekitOperators.cpp [ 69%] Building CXX object rtt/scripting/CMakeFiles/rtt-scripting-gnulinux_plugin.dir/CommandIllegal.cpp.o cd /local/robotpkg/var/tmp/robotpkg/middleware/orocos-rtt/work/orocos-rtt-2.8.1/rtt/scripting && /usr/bin/g++ -DOROCOS_TARGET=gnulinux -DRTT_SCRIPTING_DLL_EXPORT -I/local/robotpkg/var/tmp/robotpkg/middleware/orocos-rtt/work/orocos-rtt-2.8.1/rtt/typekit -I/local/robotpkg/var/tmp/robotpkg/middleware/orocos-rtt/work/orocos-rtt-2.8.1/rtt/scripting -I/local/robotpkg/var/tmp/robotpkg/middleware/orocos-rtt/work/orocos-rtt-2.8.1/rtt/os/gnulinux -I/local/robotpkg/var/tmp/robotpkg/middleware/orocos-rtt/work/orocos-rtt-2.8.1/rtt/os -I/local/robotpkg/var/tmp/robotpkg/middleware/orocos-rtt/work/orocos-rtt-2.8.1/rtt -I/local/robotpkg/var/tmp/robotpkg/middleware/orocos-rtt/work/orocos-rtt-2.8.1 -pipe -O3 -DNDEBUG -fmessage-length=0 -fPIC -Wall -o CMakeFiles/rtt-scripting-gnulinux_plugin.dir/CommandIllegal.cpp.o -c /local/robotpkg/var/tmp/robotpkg/middleware/orocos-rtt/work/orocos-rtt-2.8.1/rtt/scripting/CommandIllegal.cpp [ 69%] Building CXX object rtt/scripting/CMakeFiles/rtt-scripting-gnulinux_plugin.dir/CommandNOP.cpp.o cd /local/robotpkg/var/tmp/robotpkg/middleware/orocos-rtt/work/orocos-rtt-2.8.1/rtt/scripting && /usr/bin/g++ -DOROCOS_TARGET=gnulinux -DRTT_SCRIPTING_DLL_EXPORT -I/local/robotpkg/var/tmp/robotpkg/middleware/orocos-rtt/work/orocos-rtt-2.8.1/rtt/typekit -I/local/robotpkg/var/tmp/robotpkg/middleware/orocos-rtt/work/orocos-rtt-2.8.1/rtt/scripting -I/local/robotpkg/var/tmp/robotpkg/middleware/orocos-rtt/work/orocos-rtt-2.8.1/rtt/os/gnulinux -I/local/robotpkg/var/tmp/robotpkg/middleware/orocos-rtt/work/orocos-rtt-2.8.1/rtt/os -I/local/robotpkg/var/tmp/robotpkg/middleware/orocos-rtt/work/orocos-rtt-2.8.1/rtt -I/local/robotpkg/var/tmp/robotpkg/middleware/orocos-rtt/work/orocos-rtt-2.8.1 -pipe -O3 -DNDEBUG -fmessage-length=0 -fPIC -Wall -o CMakeFiles/rtt-scripting-gnulinux_plugin.dir/CommandNOP.cpp.o -c /local/robotpkg/var/tmp/robotpkg/middleware/orocos-rtt/work/orocos-rtt-2.8.1/rtt/scripting/CommandNOP.cpp [ 69%] Building CXX object rtt/marsh/CMakeFiles/rtt-marshalling-gnulinux_plugin.dir/MarshallingService.cpp.o cd /local/robotpkg/var/tmp/robotpkg/middleware/orocos-rtt/work/orocos-rtt-2.8.1/rtt/marsh && /usr/bin/g++ -DOROCOS_TARGET=gnulinux -DRTT_MARSH_DLL_EXPORT -I/local/robotpkg/var/tmp/robotpkg/middleware/orocos-rtt/work/orocos-rtt-2.8.1/rtt/typekit -I/local/robotpkg/var/tmp/robotpkg/middleware/orocos-rtt/work/orocos-rtt-2.8.1/rtt/marsh -I/local/robotpkg/var/tmp/robotpkg/middleware/orocos-rtt/work/orocos-rtt-2.8.1/rtt/os/gnulinux -I/local/robotpkg/var/tmp/robotpkg/middleware/orocos-rtt/work/orocos-rtt-2.8.1/rtt/os -I/local/robotpkg/var/tmp/robotpkg/middleware/orocos-rtt/work/orocos-rtt-2.8.1/rtt -I/local/robotpkg/var/tmp/robotpkg/middleware/orocos-rtt/work/orocos-rtt-2.8.1 -pipe -O3 -DNDEBUG -fmessage-length=0 -fPIC -Wall -o CMakeFiles/rtt-marshalling-gnulinux_plugin.dir/MarshallingService.cpp.o -c /local/robotpkg/var/tmp/robotpkg/middleware/orocos-rtt/work/orocos-rtt-2.8.1/rtt/marsh/MarshallingService.cpp [ 70%] Building CXX object rtt/scripting/CMakeFiles/rtt-scripting-gnulinux_plugin.dir/CommandString.cpp.o cd /local/robotpkg/var/tmp/robotpkg/middleware/orocos-rtt/work/orocos-rtt-2.8.1/rtt/scripting && /usr/bin/g++ -DOROCOS_TARGET=gnulinux -DRTT_SCRIPTING_DLL_EXPORT -I/local/robotpkg/var/tmp/robotpkg/middleware/orocos-rtt/work/orocos-rtt-2.8.1/rtt/typekit -I/local/robotpkg/var/tmp/robotpkg/middleware/orocos-rtt/work/orocos-rtt-2.8.1/rtt/scripting -I/local/robotpkg/var/tmp/robotpkg/middleware/orocos-rtt/work/orocos-rtt-2.8.1/rtt/os/gnulinux -I/local/robotpkg/var/tmp/robotpkg/middleware/orocos-rtt/work/orocos-rtt-2.8.1/rtt/os -I/local/robotpkg/var/tmp/robotpkg/middleware/orocos-rtt/work/orocos-rtt-2.8.1/rtt -I/local/robotpkg/var/tmp/robotpkg/middleware/orocos-rtt/work/orocos-rtt-2.8.1 -pipe -O3 -DNDEBUG -fmessage-length=0 -fPIC -Wall -o CMakeFiles/rtt-scripting-gnulinux_plugin.dir/CommandString.cpp.o -c /local/robotpkg/var/tmp/robotpkg/middleware/orocos-rtt/work/orocos-rtt-2.8.1/rtt/scripting/CommandString.cpp [ 70%] Building CXX object rtt/scripting/CMakeFiles/rtt-scripting-gnulinux_plugin.dir/CommonParser.cpp.o cd /local/robotpkg/var/tmp/robotpkg/middleware/orocos-rtt/work/orocos-rtt-2.8.1/rtt/scripting && /usr/bin/g++ -DOROCOS_TARGET=gnulinux -DRTT_SCRIPTING_DLL_EXPORT -I/local/robotpkg/var/tmp/robotpkg/middleware/orocos-rtt/work/orocos-rtt-2.8.1/rtt/typekit -I/local/robotpkg/var/tmp/robotpkg/middleware/orocos-rtt/work/orocos-rtt-2.8.1/rtt/scripting -I/local/robotpkg/var/tmp/robotpkg/middleware/orocos-rtt/work/orocos-rtt-2.8.1/rtt/os/gnulinux -I/local/robotpkg/var/tmp/robotpkg/middleware/orocos-rtt/work/orocos-rtt-2.8.1/rtt/os -I/local/robotpkg/var/tmp/robotpkg/middleware/orocos-rtt/work/orocos-rtt-2.8.1/rtt -I/local/robotpkg/var/tmp/robotpkg/middleware/orocos-rtt/work/orocos-rtt-2.8.1 -pipe -O3 -DNDEBUG -fmessage-length=0 -fPIC -Wall -o CMakeFiles/rtt-scripting-gnulinux_plugin.dir/CommonParser.cpp.o -c /local/robotpkg/var/tmp/robotpkg/middleware/orocos-rtt/work/orocos-rtt-2.8.1/rtt/scripting/CommonParser.cpp [ 70%] Linking CXX shared library librtt-transport-mqueue-gnulinux.so cd /local/robotpkg/var/tmp/robotpkg/middleware/orocos-rtt/work/orocos-rtt-2.8.1/rtt/transports/mqueue && /usr/bin/cmake -E cmake_link_script CMakeFiles/rtt-transport-mqueue-gnulinux_plugin.dir/link.txt --verbose=1 /usr/bin/g++ -fPIC -pipe -O3 -DNDEBUG -fmessage-length=0 -shared -Wl,-soname,librtt-transport-mqueue-gnulinux.so.2.8 -o librtt-transport-mqueue-gnulinux.so.2.8.1 CMakeFiles/rtt-transport-mqueue-gnulinux_plugin.dir/MQLib.cpp.o -Wl,-rpath,/local/robotpkg/var/tmp/robotpkg/middleware/orocos-rtt/work/orocos-rtt-2.8.1/rtt/transports/mqueue:/local/robotpkg/var/tmp/robotpkg/middleware/orocos-rtt/work/orocos-rtt-2.8.1/rtt: liborocos-rtt-mqueue-gnulinux.so.2.8.1 ../../liborocos-rtt-gnulinux.so.2.8.1 -lboost_filesystem -lboost_system -lxerces-c -lpthread -lrt -ldl -lboost_serialization cd /local/robotpkg/var/tmp/robotpkg/middleware/orocos-rtt/work/orocos-rtt-2.8.1/rtt/transports/mqueue && /usr/bin/cmake -E cmake_symlink_library librtt-transport-mqueue-gnulinux.so.2.8.1 librtt-transport-mqueue-gnulinux.so.2.8 librtt-transport-mqueue-gnulinux.so Copying /local/robotpkg/var/tmp/robotpkg/middleware/orocos-rtt/work/orocos-rtt-2.8.1/rtt/transports/mqueue/librtt-transport-mqueue-gnulinux.so to /local/robotpkg/var/tmp/robotpkg/middleware/orocos-rtt/work/orocos-rtt-2.8.1/rtt/types cd /local/robotpkg/var/tmp/robotpkg/middleware/orocos-rtt/work/orocos-rtt-2.8.1/rtt/transports/mqueue && /usr/bin/cmake -E make_directory /local/robotpkg/var/tmp/robotpkg/middleware/orocos-rtt/work/orocos-rtt-2.8.1/rtt/types cd /local/robotpkg/var/tmp/robotpkg/middleware/orocos-rtt/work/orocos-rtt-2.8.1/rtt/transports/mqueue && /usr/bin/cmake -E copy /local/robotpkg/var/tmp/robotpkg/middleware/orocos-rtt/work/orocos-rtt-2.8.1/rtt/transports/mqueue/librtt-transport-mqueue-gnulinux.so /local/robotpkg/var/tmp/robotpkg/middleware/orocos-rtt/work/orocos-rtt-2.8.1/rtt/types make[2]: Leaving directory '/local/robotpkg/var/tmp/robotpkg/middleware/orocos-rtt/work/orocos-rtt-2.8.1' [ 70%] Built target rtt-transport-mqueue-gnulinux_plugin [ 72%] Building CXX object rtt/marsh/CMakeFiles/rtt-marshalling-gnulinux_plugin.dir/PropertyLoader.cpp.o cd /local/robotpkg/var/tmp/robotpkg/middleware/orocos-rtt/work/orocos-rtt-2.8.1/rtt/marsh && /usr/bin/g++ -DOROCOS_TARGET=gnulinux -DRTT_MARSH_DLL_EXPORT -I/local/robotpkg/var/tmp/robotpkg/middleware/orocos-rtt/work/orocos-rtt-2.8.1/rtt/typekit -I/local/robotpkg/var/tmp/robotpkg/middleware/orocos-rtt/work/orocos-rtt-2.8.1/rtt/marsh -I/local/robotpkg/var/tmp/robotpkg/middleware/orocos-rtt/work/orocos-rtt-2.8.1/rtt/os/gnulinux -I/local/robotpkg/var/tmp/robotpkg/middleware/orocos-rtt/work/orocos-rtt-2.8.1/rtt/os -I/local/robotpkg/var/tmp/robotpkg/middleware/orocos-rtt/work/orocos-rtt-2.8.1/rtt -I/local/robotpkg/var/tmp/robotpkg/middleware/orocos-rtt/work/orocos-rtt-2.8.1 -pipe -O3 -DNDEBUG -fmessage-length=0 -fPIC -Wall -o CMakeFiles/rtt-marshalling-gnulinux_plugin.dir/PropertyLoader.cpp.o -c /local/robotpkg/var/tmp/robotpkg/middleware/orocos-rtt/work/orocos-rtt-2.8.1/rtt/marsh/PropertyLoader.cpp [ 72%] Building CXX object rtt/scripting/CMakeFiles/rtt-scripting-gnulinux_plugin.dir/ConditionBool.cpp.o cd /local/robotpkg/var/tmp/robotpkg/middleware/orocos-rtt/work/orocos-rtt-2.8.1/rtt/scripting && /usr/bin/g++ -DOROCOS_TARGET=gnulinux -DRTT_SCRIPTING_DLL_EXPORT -I/local/robotpkg/var/tmp/robotpkg/middleware/orocos-rtt/work/orocos-rtt-2.8.1/rtt/typekit -I/local/robotpkg/var/tmp/robotpkg/middleware/orocos-rtt/work/orocos-rtt-2.8.1/rtt/scripting -I/local/robotpkg/var/tmp/robotpkg/middleware/orocos-rtt/work/orocos-rtt-2.8.1/rtt/os/gnulinux -I/local/robotpkg/var/tmp/robotpkg/middleware/orocos-rtt/work/orocos-rtt-2.8.1/rtt/os -I/local/robotpkg/var/tmp/robotpkg/middleware/orocos-rtt/work/orocos-rtt-2.8.1/rtt -I/local/robotpkg/var/tmp/robotpkg/middleware/orocos-rtt/work/orocos-rtt-2.8.1 -pipe -O3 -DNDEBUG -fmessage-length=0 -fPIC -Wall -o CMakeFiles/rtt-scripting-gnulinux_plugin.dir/ConditionBool.cpp.o -c /local/robotpkg/var/tmp/robotpkg/middleware/orocos-rtt/work/orocos-rtt-2.8.1/rtt/scripting/ConditionBool.cpp [ 72%] Building CXX object rtt/typekit/CMakeFiles/rtt-typekit-gnulinux_plugin.dir/RealTimeTypekitStdTypes.cpp.o cd /local/robotpkg/var/tmp/robotpkg/middleware/orocos-rtt/work/orocos-rtt-2.8.1/rtt/typekit && /usr/bin/g++ -DOROCOS_TARGET=gnulinux -DRTT_TYPEKIT_DLL_EXPORT -I/local/robotpkg/var/tmp/robotpkg/middleware/orocos-rtt/work/orocos-rtt-2.8.1/rtt/typekit -I/local/robotpkg/var/tmp/robotpkg/middleware/orocos-rtt/work/orocos-rtt-2.8.1/rtt/os/gnulinux -I/local/robotpkg/var/tmp/robotpkg/middleware/orocos-rtt/work/orocos-rtt-2.8.1/rtt/os -I/local/robotpkg/var/tmp/robotpkg/middleware/orocos-rtt/work/orocos-rtt-2.8.1/rtt -I/local/robotpkg/var/tmp/robotpkg/middleware/orocos-rtt/work/orocos-rtt-2.8.1 -pipe -O3 -DNDEBUG -fmessage-length=0 -fPIC -Wall -o CMakeFiles/rtt-typekit-gnulinux_plugin.dir/RealTimeTypekitStdTypes.cpp.o -c /local/robotpkg/var/tmp/robotpkg/middleware/orocos-rtt/work/orocos-rtt-2.8.1/rtt/typekit/RealTimeTypekitStdTypes.cpp [ 73%] Building CXX object rtt/scripting/CMakeFiles/rtt-scripting-gnulinux_plugin.dir/ConditionBoolDataSource.cpp.o cd /local/robotpkg/var/tmp/robotpkg/middleware/orocos-rtt/work/orocos-rtt-2.8.1/rtt/scripting && /usr/bin/g++ -DOROCOS_TARGET=gnulinux -DRTT_SCRIPTING_DLL_EXPORT -I/local/robotpkg/var/tmp/robotpkg/middleware/orocos-rtt/work/orocos-rtt-2.8.1/rtt/typekit -I/local/robotpkg/var/tmp/robotpkg/middleware/orocos-rtt/work/orocos-rtt-2.8.1/rtt/scripting -I/local/robotpkg/var/tmp/robotpkg/middleware/orocos-rtt/work/orocos-rtt-2.8.1/rtt/os/gnulinux -I/local/robotpkg/var/tmp/robotpkg/middleware/orocos-rtt/work/orocos-rtt-2.8.1/rtt/os -I/local/robotpkg/var/tmp/robotpkg/middleware/orocos-rtt/work/orocos-rtt-2.8.1/rtt -I/local/robotpkg/var/tmp/robotpkg/middleware/orocos-rtt/work/orocos-rtt-2.8.1 -pipe -O3 -DNDEBUG -fmessage-length=0 -fPIC -Wall -o CMakeFiles/rtt-scripting-gnulinux_plugin.dir/ConditionBoolDataSource.cpp.o -c /local/robotpkg/var/tmp/robotpkg/middleware/orocos-rtt/work/orocos-rtt-2.8.1/rtt/scripting/ConditionBoolDataSource.cpp [ 73%] Building CXX object rtt/scripting/CMakeFiles/rtt-scripting-gnulinux_plugin.dir/ConditionBoolProperty.cpp.o cd /local/robotpkg/var/tmp/robotpkg/middleware/orocos-rtt/work/orocos-rtt-2.8.1/rtt/scripting && /usr/bin/g++ -DOROCOS_TARGET=gnulinux -DRTT_SCRIPTING_DLL_EXPORT -I/local/robotpkg/var/tmp/robotpkg/middleware/orocos-rtt/work/orocos-rtt-2.8.1/rtt/typekit -I/local/robotpkg/var/tmp/robotpkg/middleware/orocos-rtt/work/orocos-rtt-2.8.1/rtt/scripting -I/local/robotpkg/var/tmp/robotpkg/middleware/orocos-rtt/work/orocos-rtt-2.8.1/rtt/os/gnulinux -I/local/robotpkg/var/tmp/robotpkg/middleware/orocos-rtt/work/orocos-rtt-2.8.1/rtt/os -I/local/robotpkg/var/tmp/robotpkg/middleware/orocos-rtt/work/orocos-rtt-2.8.1/rtt -I/local/robotpkg/var/tmp/robotpkg/middleware/orocos-rtt/work/orocos-rtt-2.8.1 -pipe -O3 -DNDEBUG -fmessage-length=0 -fPIC -Wall -o CMakeFiles/rtt-scripting-gnulinux_plugin.dir/ConditionBoolProperty.cpp.o -c /local/robotpkg/var/tmp/robotpkg/middleware/orocos-rtt/work/orocos-rtt-2.8.1/rtt/scripting/ConditionBoolProperty.cpp [ 75%] Building CXX object rtt/scripting/CMakeFiles/rtt-scripting-gnulinux_plugin.dir/ConditionComposite.cpp.o cd /local/robotpkg/var/tmp/robotpkg/middleware/orocos-rtt/work/orocos-rtt-2.8.1/rtt/scripting && /usr/bin/g++ -DOROCOS_TARGET=gnulinux -DRTT_SCRIPTING_DLL_EXPORT -I/local/robotpkg/var/tmp/robotpkg/middleware/orocos-rtt/work/orocos-rtt-2.8.1/rtt/typekit -I/local/robotpkg/var/tmp/robotpkg/middleware/orocos-rtt/work/orocos-rtt-2.8.1/rtt/scripting -I/local/robotpkg/var/tmp/robotpkg/middleware/orocos-rtt/work/orocos-rtt-2.8.1/rtt/os/gnulinux -I/local/robotpkg/var/tmp/robotpkg/middleware/orocos-rtt/work/orocos-rtt-2.8.1/rtt/os -I/local/robotpkg/var/tmp/robotpkg/middleware/orocos-rtt/work/orocos-rtt-2.8.1/rtt -I/local/robotpkg/var/tmp/robotpkg/middleware/orocos-rtt/work/orocos-rtt-2.8.1 -pipe -O3 -DNDEBUG -fmessage-length=0 -fPIC -Wall -o CMakeFiles/rtt-scripting-gnulinux_plugin.dir/ConditionComposite.cpp.o -c /local/robotpkg/var/tmp/robotpkg/middleware/orocos-rtt/work/orocos-rtt-2.8.1/rtt/scripting/ConditionComposite.cpp [ 75%] Building CXX object rtt/marsh/CMakeFiles/rtt-marshalling-gnulinux_plugin.dir/CPFDemarshaller.cpp.o cd /local/robotpkg/var/tmp/robotpkg/middleware/orocos-rtt/work/orocos-rtt-2.8.1/rtt/marsh && /usr/bin/g++ -DOROCOS_TARGET=gnulinux -DRTT_MARSH_DLL_EXPORT -I/local/robotpkg/var/tmp/robotpkg/middleware/orocos-rtt/work/orocos-rtt-2.8.1/rtt/typekit -I/local/robotpkg/var/tmp/robotpkg/middleware/orocos-rtt/work/orocos-rtt-2.8.1/rtt/marsh -I/local/robotpkg/var/tmp/robotpkg/middleware/orocos-rtt/work/orocos-rtt-2.8.1/rtt/os/gnulinux -I/local/robotpkg/var/tmp/robotpkg/middleware/orocos-rtt/work/orocos-rtt-2.8.1/rtt/os -I/local/robotpkg/var/tmp/robotpkg/middleware/orocos-rtt/work/orocos-rtt-2.8.1/rtt -I/local/robotpkg/var/tmp/robotpkg/middleware/orocos-rtt/work/orocos-rtt-2.8.1 -pipe -O3 -DNDEBUG -fmessage-length=0 -fPIC -Wall -o CMakeFiles/rtt-marshalling-gnulinux_plugin.dir/CPFDemarshaller.cpp.o -c /local/robotpkg/var/tmp/robotpkg/middleware/orocos-rtt/work/orocos-rtt-2.8.1/rtt/marsh/CPFDemarshaller.cpp [ 75%] Building CXX object rtt/scripting/CMakeFiles/rtt-scripting-gnulinux_plugin.dir/ConditionDSDuration.cpp.o cd /local/robotpkg/var/tmp/robotpkg/middleware/orocos-rtt/work/orocos-rtt-2.8.1/rtt/scripting && /usr/bin/g++ -DOROCOS_TARGET=gnulinux -DRTT_SCRIPTING_DLL_EXPORT -I/local/robotpkg/var/tmp/robotpkg/middleware/orocos-rtt/work/orocos-rtt-2.8.1/rtt/typekit -I/local/robotpkg/var/tmp/robotpkg/middleware/orocos-rtt/work/orocos-rtt-2.8.1/rtt/scripting -I/local/robotpkg/var/tmp/robotpkg/middleware/orocos-rtt/work/orocos-rtt-2.8.1/rtt/os/gnulinux -I/local/robotpkg/var/tmp/robotpkg/middleware/orocos-rtt/work/orocos-rtt-2.8.1/rtt/os -I/local/robotpkg/var/tmp/robotpkg/middleware/orocos-rtt/work/orocos-rtt-2.8.1/rtt -I/local/robotpkg/var/tmp/robotpkg/middleware/orocos-rtt/work/orocos-rtt-2.8.1 -pipe -O3 -DNDEBUG -fmessage-length=0 -fPIC -Wall -o CMakeFiles/rtt-scripting-gnulinux_plugin.dir/ConditionDSDuration.cpp.o -c /local/robotpkg/var/tmp/robotpkg/middleware/orocos-rtt/work/orocos-rtt-2.8.1/rtt/scripting/ConditionDSDuration.cpp [ 76%] Building CXX object rtt/scripting/CMakeFiles/rtt-scripting-gnulinux_plugin.dir/ConditionDuration.cpp.o cd /local/robotpkg/var/tmp/robotpkg/middleware/orocos-rtt/work/orocos-rtt-2.8.1/rtt/scripting && /usr/bin/g++ -DOROCOS_TARGET=gnulinux -DRTT_SCRIPTING_DLL_EXPORT -I/local/robotpkg/var/tmp/robotpkg/middleware/orocos-rtt/work/orocos-rtt-2.8.1/rtt/typekit -I/local/robotpkg/var/tmp/robotpkg/middleware/orocos-rtt/work/orocos-rtt-2.8.1/rtt/scripting -I/local/robotpkg/var/tmp/robotpkg/middleware/orocos-rtt/work/orocos-rtt-2.8.1/rtt/os/gnulinux -I/local/robotpkg/var/tmp/robotpkg/middleware/orocos-rtt/work/orocos-rtt-2.8.1/rtt/os -I/local/robotpkg/var/tmp/robotpkg/middleware/orocos-rtt/work/orocos-rtt-2.8.1/rtt -I/local/robotpkg/var/tmp/robotpkg/middleware/orocos-rtt/work/orocos-rtt-2.8.1 -pipe -O3 -DNDEBUG -fmessage-length=0 -fPIC -Wall -o CMakeFiles/rtt-scripting-gnulinux_plugin.dir/ConditionDuration.cpp.o -c /local/robotpkg/var/tmp/robotpkg/middleware/orocos-rtt/work/orocos-rtt-2.8.1/rtt/scripting/ConditionDuration.cpp [ 76%] Building CXX object rtt/scripting/CMakeFiles/rtt-scripting-gnulinux_plugin.dir/ConditionInterface.cpp.o cd /local/robotpkg/var/tmp/robotpkg/middleware/orocos-rtt/work/orocos-rtt-2.8.1/rtt/scripting && /usr/bin/g++ -DOROCOS_TARGET=gnulinux -DRTT_SCRIPTING_DLL_EXPORT -I/local/robotpkg/var/tmp/robotpkg/middleware/orocos-rtt/work/orocos-rtt-2.8.1/rtt/typekit -I/local/robotpkg/var/tmp/robotpkg/middleware/orocos-rtt/work/orocos-rtt-2.8.1/rtt/scripting -I/local/robotpkg/var/tmp/robotpkg/middleware/orocos-rtt/work/orocos-rtt-2.8.1/rtt/os/gnulinux -I/local/robotpkg/var/tmp/robotpkg/middleware/orocos-rtt/work/orocos-rtt-2.8.1/rtt/os -I/local/robotpkg/var/tmp/robotpkg/middleware/orocos-rtt/work/orocos-rtt-2.8.1/rtt -I/local/robotpkg/var/tmp/robotpkg/middleware/orocos-rtt/work/orocos-rtt-2.8.1 -pipe -O3 -DNDEBUG -fmessage-length=0 -fPIC -Wall -o CMakeFiles/rtt-scripting-gnulinux_plugin.dir/ConditionInterface.cpp.o -c /local/robotpkg/var/tmp/robotpkg/middleware/orocos-rtt/work/orocos-rtt-2.8.1/rtt/scripting/ConditionInterface.cpp [ 77%] Building CXX object rtt/typekit/CMakeFiles/rtt-typekit-gnulinux_plugin.dir/RealTimeTypekitTypes.cpp.o cd /local/robotpkg/var/tmp/robotpkg/middleware/orocos-rtt/work/orocos-rtt-2.8.1/rtt/typekit && /usr/bin/g++ -DOROCOS_TARGET=gnulinux -DRTT_TYPEKIT_DLL_EXPORT -I/local/robotpkg/var/tmp/robotpkg/middleware/orocos-rtt/work/orocos-rtt-2.8.1/rtt/typekit -I/local/robotpkg/var/tmp/robotpkg/middleware/orocos-rtt/work/orocos-rtt-2.8.1/rtt/os/gnulinux -I/local/robotpkg/var/tmp/robotpkg/middleware/orocos-rtt/work/orocos-rtt-2.8.1/rtt/os -I/local/robotpkg/var/tmp/robotpkg/middleware/orocos-rtt/work/orocos-rtt-2.8.1/rtt -I/local/robotpkg/var/tmp/robotpkg/middleware/orocos-rtt/work/orocos-rtt-2.8.1 -pipe -O3 -DNDEBUG -fmessage-length=0 -fPIC -Wall -o CMakeFiles/rtt-typekit-gnulinux_plugin.dir/RealTimeTypekitTypes.cpp.o -c /local/robotpkg/var/tmp/robotpkg/middleware/orocos-rtt/work/orocos-rtt-2.8.1/rtt/typekit/RealTimeTypekitTypes.cpp [ 77%] Building CXX object rtt/scripting/CMakeFiles/rtt-scripting-gnulinux_plugin.dir/ConditionOnce.cpp.o cd /local/robotpkg/var/tmp/robotpkg/middleware/orocos-rtt/work/orocos-rtt-2.8.1/rtt/scripting && /usr/bin/g++ -DOROCOS_TARGET=gnulinux -DRTT_SCRIPTING_DLL_EXPORT -I/local/robotpkg/var/tmp/robotpkg/middleware/orocos-rtt/work/orocos-rtt-2.8.1/rtt/typekit -I/local/robotpkg/var/tmp/robotpkg/middleware/orocos-rtt/work/orocos-rtt-2.8.1/rtt/scripting -I/local/robotpkg/var/tmp/robotpkg/middleware/orocos-rtt/work/orocos-rtt-2.8.1/rtt/os/gnulinux -I/local/robotpkg/var/tmp/robotpkg/middleware/orocos-rtt/work/orocos-rtt-2.8.1/rtt/os -I/local/robotpkg/var/tmp/robotpkg/middleware/orocos-rtt/work/orocos-rtt-2.8.1/rtt -I/local/robotpkg/var/tmp/robotpkg/middleware/orocos-rtt/work/orocos-rtt-2.8.1 -pipe -O3 -DNDEBUG -fmessage-length=0 -fPIC -Wall -o CMakeFiles/rtt-scripting-gnulinux_plugin.dir/ConditionOnce.cpp.o -c /local/robotpkg/var/tmp/robotpkg/middleware/orocos-rtt/work/orocos-rtt-2.8.1/rtt/scripting/ConditionOnce.cpp [ 79%] Building CXX object rtt/scripting/CMakeFiles/rtt-scripting-gnulinux_plugin.dir/ConditionParser.cpp.o cd /local/robotpkg/var/tmp/robotpkg/middleware/orocos-rtt/work/orocos-rtt-2.8.1/rtt/scripting && /usr/bin/g++ -DOROCOS_TARGET=gnulinux -DRTT_SCRIPTING_DLL_EXPORT -I/local/robotpkg/var/tmp/robotpkg/middleware/orocos-rtt/work/orocos-rtt-2.8.1/rtt/typekit -I/local/robotpkg/var/tmp/robotpkg/middleware/orocos-rtt/work/orocos-rtt-2.8.1/rtt/scripting -I/local/robotpkg/var/tmp/robotpkg/middleware/orocos-rtt/work/orocos-rtt-2.8.1/rtt/os/gnulinux -I/local/robotpkg/var/tmp/robotpkg/middleware/orocos-rtt/work/orocos-rtt-2.8.1/rtt/os -I/local/robotpkg/var/tmp/robotpkg/middleware/orocos-rtt/work/orocos-rtt-2.8.1/rtt -I/local/robotpkg/var/tmp/robotpkg/middleware/orocos-rtt/work/orocos-rtt-2.8.1 -pipe -O3 -DNDEBUG -fmessage-length=0 -fPIC -Wall -o CMakeFiles/rtt-scripting-gnulinux_plugin.dir/ConditionParser.cpp.o -c /local/robotpkg/var/tmp/robotpkg/middleware/orocos-rtt/work/orocos-rtt-2.8.1/rtt/scripting/ConditionParser.cpp [ 80%] Linking CXX shared library librtt-marshalling-gnulinux.so cd /local/robotpkg/var/tmp/robotpkg/middleware/orocos-rtt/work/orocos-rtt-2.8.1/rtt/marsh && /usr/bin/cmake -E cmake_link_script CMakeFiles/rtt-marshalling-gnulinux_plugin.dir/link.txt --verbose=1 /usr/bin/g++ -fPIC -pipe -O3 -DNDEBUG -fmessage-length=0 -Wl,-zdefs -shared -Wl,-soname,librtt-marshalling-gnulinux.so.2.8 -o librtt-marshalling-gnulinux.so.2.8.1 CMakeFiles/rtt-marshalling-gnulinux_plugin.dir/PropertyMarshaller.cpp.o CMakeFiles/rtt-marshalling-gnulinux_plugin.dir/PropertyDemarshaller.cpp.o CMakeFiles/rtt-marshalling-gnulinux_plugin.dir/PropertyBagIntrospector.cpp.o CMakeFiles/rtt-marshalling-gnulinux_plugin.dir/CPFDTD.cpp.o CMakeFiles/rtt-marshalling-gnulinux_plugin.dir/CPFMarshaller.cpp.o CMakeFiles/rtt-marshalling-gnulinux_plugin.dir/Marshalling.cpp.o CMakeFiles/rtt-marshalling-gnulinux_plugin.dir/MarshallingService.cpp.o CMakeFiles/rtt-marshalling-gnulinux_plugin.dir/PropertyLoader.cpp.o CMakeFiles/rtt-marshalling-gnulinux_plugin.dir/CPFDemarshaller.cpp.o -Wl,-rpath,/local/robotpkg/var/tmp/robotpkg/middleware/orocos-rtt/work/orocos-rtt-2.8.1/rtt: ../liborocos-rtt-gnulinux.so.2.8.1 -lboost_filesystem -lboost_system -lboost_serialization -lxerces-c -lpthread -lrt -ldl cd /local/robotpkg/var/tmp/robotpkg/middleware/orocos-rtt/work/orocos-rtt-2.8.1/rtt/marsh && /usr/bin/cmake -E cmake_symlink_library librtt-marshalling-gnulinux.so.2.8.1 librtt-marshalling-gnulinux.so.2.8 librtt-marshalling-gnulinux.so Copying /local/robotpkg/var/tmp/robotpkg/middleware/orocos-rtt/work/orocos-rtt-2.8.1/rtt/marsh/librtt-marshalling-gnulinux.so to /local/robotpkg/var/tmp/robotpkg/middleware/orocos-rtt/work/orocos-rtt-2.8.1/rtt/plugins cd /local/robotpkg/var/tmp/robotpkg/middleware/orocos-rtt/work/orocos-rtt-2.8.1/rtt/marsh && /usr/bin/cmake -E make_directory /local/robotpkg/var/tmp/robotpkg/middleware/orocos-rtt/work/orocos-rtt-2.8.1/rtt/plugins cd /local/robotpkg/var/tmp/robotpkg/middleware/orocos-rtt/work/orocos-rtt-2.8.1/rtt/marsh && /usr/bin/cmake -E copy /local/robotpkg/var/tmp/robotpkg/middleware/orocos-rtt/work/orocos-rtt-2.8.1/rtt/marsh/librtt-marshalling-gnulinux.so /local/robotpkg/var/tmp/robotpkg/middleware/orocos-rtt/work/orocos-rtt-2.8.1/rtt/plugins make[2]: Leaving directory '/local/robotpkg/var/tmp/robotpkg/middleware/orocos-rtt/work/orocos-rtt-2.8.1' In file included from /local/robotpkg/var/tmp/robotpkg/middleware/orocos-rtt/work/orocos-rtt-2.8.1/rtt/typekit/RealTimeTypekitTypes.cpp:42:0: /local/robotpkg/var/tmp/robotpkg/middleware/orocos-rtt/work/orocos-rtt-2.8.1/rtt/typekit/Types.inc:30:31: warning: type attributes ignored after type is already defined [-Wattributes] template class RTT_EXPORT DataSource< TYPE >; ^~~~~~~~~~~~~~~~~~ /local/robotpkg/var/tmp/robotpkg/middleware/orocos-rtt/work/orocos-rtt-2.8.1/rtt/typekit/Types.inc:30:31: note: in definition of macro 'RTT_EXPORT_TEMPLATE_TYPE' template class RTT_EXPORT DataSource< TYPE >; ^~~~~~~~~~ /local/robotpkg/var/tmp/robotpkg/middleware/orocos-rtt/work/orocos-rtt-2.8.1/rtt/typekit/Types.inc:31:31: warning: type attributes ignored after type is already defined [-Wattributes] template class RTT_EXPORT AssignableDataSource< TYPE >; ^~~~~~~~~~~~~~~~~~~~~~~~~~~~ /local/robotpkg/var/tmp/robotpkg/middleware/orocos-rtt/work/orocos-rtt-2.8.1/rtt/typekit/Types.inc:31:31: note: in definition of macro 'RTT_EXPORT_TEMPLATE_TYPE' template class RTT_EXPORT AssignableDataSource< TYPE >; ^~~~~~~~~~~~~~~~~~~~ /local/robotpkg/var/tmp/robotpkg/middleware/orocos-rtt/work/orocos-rtt-2.8.1/rtt/typekit/Types.inc:32:31: warning: type attributes ignored after type is already defined [-Wattributes] template class RTT_EXPORT ValueDataSource< TYPE >; ^~~~~~~~~~~~~~~~~~~~~~~ /local/robotpkg/var/tmp/robotpkg/middleware/orocos-rtt/work/orocos-rtt-2.8.1/rtt/typekit/Types.inc:32:31: note: in definition of macro 'RTT_EXPORT_TEMPLATE_TYPE' template class RTT_EXPORT ValueDataSource< TYPE >; ^~~~~~~~~~~~~~~ [ 80%] Built target rtt-marshalling-gnulinux_plugin [ 80%] Building CXX object rtt/scripting/CMakeFiles/rtt-scripting-gnulinux_plugin.dir/DataSourceCondition.cpp.o cd /local/robotpkg/var/tmp/robotpkg/middleware/orocos-rtt/work/orocos-rtt-2.8.1/rtt/scripting && /usr/bin/g++ -DOROCOS_TARGET=gnulinux -DRTT_SCRIPTING_DLL_EXPORT -I/local/robotpkg/var/tmp/robotpkg/middleware/orocos-rtt/work/orocos-rtt-2.8.1/rtt/typekit -I/local/robotpkg/var/tmp/robotpkg/middleware/orocos-rtt/work/orocos-rtt-2.8.1/rtt/scripting -I/local/robotpkg/var/tmp/robotpkg/middleware/orocos-rtt/work/orocos-rtt-2.8.1/rtt/os/gnulinux -I/local/robotpkg/var/tmp/robotpkg/middleware/orocos-rtt/work/orocos-rtt-2.8.1/rtt/os -I/local/robotpkg/var/tmp/robotpkg/middleware/orocos-rtt/work/orocos-rtt-2.8.1/rtt -I/local/robotpkg/var/tmp/robotpkg/middleware/orocos-rtt/work/orocos-rtt-2.8.1 -pipe -O3 -DNDEBUG -fmessage-length=0 -fPIC -Wall -o CMakeFiles/rtt-scripting-gnulinux_plugin.dir/DataSourceCondition.cpp.o -c /local/robotpkg/var/tmp/robotpkg/middleware/orocos-rtt/work/orocos-rtt-2.8.1/rtt/scripting/DataSourceCondition.cpp [ 80%] Building CXX object rtt/typekit/CMakeFiles/rtt-typekit-gnulinux_plugin.dir/RealTimeTypekitTypes2.cpp.o cd /local/robotpkg/var/tmp/robotpkg/middleware/orocos-rtt/work/orocos-rtt-2.8.1/rtt/typekit && /usr/bin/g++ -DOROCOS_TARGET=gnulinux -DRTT_TYPEKIT_DLL_EXPORT -I/local/robotpkg/var/tmp/robotpkg/middleware/orocos-rtt/work/orocos-rtt-2.8.1/rtt/typekit -I/local/robotpkg/var/tmp/robotpkg/middleware/orocos-rtt/work/orocos-rtt-2.8.1/rtt/os/gnulinux -I/local/robotpkg/var/tmp/robotpkg/middleware/orocos-rtt/work/orocos-rtt-2.8.1/rtt/os -I/local/robotpkg/var/tmp/robotpkg/middleware/orocos-rtt/work/orocos-rtt-2.8.1/rtt -I/local/robotpkg/var/tmp/robotpkg/middleware/orocos-rtt/work/orocos-rtt-2.8.1 -pipe -O3 -DNDEBUG -fmessage-length=0 -fPIC -Wall -o CMakeFiles/rtt-typekit-gnulinux_plugin.dir/RealTimeTypekitTypes2.cpp.o -c /local/robotpkg/var/tmp/robotpkg/middleware/orocos-rtt/work/orocos-rtt-2.8.1/rtt/typekit/RealTimeTypekitTypes2.cpp [ 81%] Building CXX object rtt/scripting/CMakeFiles/rtt-scripting-gnulinux_plugin.dir/DumpObject.cpp.o cd /local/robotpkg/var/tmp/robotpkg/middleware/orocos-rtt/work/orocos-rtt-2.8.1/rtt/scripting && /usr/bin/g++ -DOROCOS_TARGET=gnulinux -DRTT_SCRIPTING_DLL_EXPORT -I/local/robotpkg/var/tmp/robotpkg/middleware/orocos-rtt/work/orocos-rtt-2.8.1/rtt/typekit -I/local/robotpkg/var/tmp/robotpkg/middleware/orocos-rtt/work/orocos-rtt-2.8.1/rtt/scripting -I/local/robotpkg/var/tmp/robotpkg/middleware/orocos-rtt/work/orocos-rtt-2.8.1/rtt/os/gnulinux -I/local/robotpkg/var/tmp/robotpkg/middleware/orocos-rtt/work/orocos-rtt-2.8.1/rtt/os -I/local/robotpkg/var/tmp/robotpkg/middleware/orocos-rtt/work/orocos-rtt-2.8.1/rtt -I/local/robotpkg/var/tmp/robotpkg/middleware/orocos-rtt/work/orocos-rtt-2.8.1 -pipe -O3 -DNDEBUG -fmessage-length=0 -fPIC -Wall -o CMakeFiles/rtt-scripting-gnulinux_plugin.dir/DumpObject.cpp.o -c /local/robotpkg/var/tmp/robotpkg/middleware/orocos-rtt/work/orocos-rtt-2.8.1/rtt/scripting/DumpObject.cpp [ 81%] Building CXX object rtt/scripting/CMakeFiles/rtt-scripting-gnulinux_plugin.dir/EdgeCondition.cpp.o cd /local/robotpkg/var/tmp/robotpkg/middleware/orocos-rtt/work/orocos-rtt-2.8.1/rtt/scripting && /usr/bin/g++ -DOROCOS_TARGET=gnulinux -DRTT_SCRIPTING_DLL_EXPORT -I/local/robotpkg/var/tmp/robotpkg/middleware/orocos-rtt/work/orocos-rtt-2.8.1/rtt/typekit -I/local/robotpkg/var/tmp/robotpkg/middleware/orocos-rtt/work/orocos-rtt-2.8.1/rtt/scripting -I/local/robotpkg/var/tmp/robotpkg/middleware/orocos-rtt/work/orocos-rtt-2.8.1/rtt/os/gnulinux -I/local/robotpkg/var/tmp/robotpkg/middleware/orocos-rtt/work/orocos-rtt-2.8.1/rtt/os -I/local/robotpkg/var/tmp/robotpkg/middleware/orocos-rtt/work/orocos-rtt-2.8.1/rtt -I/local/robotpkg/var/tmp/robotpkg/middleware/orocos-rtt/work/orocos-rtt-2.8.1 -pipe -O3 -DNDEBUG -fmessage-length=0 -fPIC -Wall -o CMakeFiles/rtt-scripting-gnulinux_plugin.dir/EdgeCondition.cpp.o -c /local/robotpkg/var/tmp/robotpkg/middleware/orocos-rtt/work/orocos-rtt-2.8.1/rtt/scripting/EdgeCondition.cpp [ 83%] Building CXX object rtt/scripting/CMakeFiles/rtt-scripting-gnulinux_plugin.dir/ExpressionParser.cpp.o cd /local/robotpkg/var/tmp/robotpkg/middleware/orocos-rtt/work/orocos-rtt-2.8.1/rtt/scripting && /usr/bin/g++ -DOROCOS_TARGET=gnulinux -DRTT_SCRIPTING_DLL_EXPORT -I/local/robotpkg/var/tmp/robotpkg/middleware/orocos-rtt/work/orocos-rtt-2.8.1/rtt/typekit -I/local/robotpkg/var/tmp/robotpkg/middleware/orocos-rtt/work/orocos-rtt-2.8.1/rtt/scripting -I/local/robotpkg/var/tmp/robotpkg/middleware/orocos-rtt/work/orocos-rtt-2.8.1/rtt/os/gnulinux -I/local/robotpkg/var/tmp/robotpkg/middleware/orocos-rtt/work/orocos-rtt-2.8.1/rtt/os -I/local/robotpkg/var/tmp/robotpkg/middleware/orocos-rtt/work/orocos-rtt-2.8.1/rtt -I/local/robotpkg/var/tmp/robotpkg/middleware/orocos-rtt/work/orocos-rtt-2.8.1 -pipe -O3 -DNDEBUG -fmessage-length=0 -fPIC -Wall -o CMakeFiles/rtt-scripting-gnulinux_plugin.dir/ExpressionParser.cpp.o -c /local/robotpkg/var/tmp/robotpkg/middleware/orocos-rtt/work/orocos-rtt-2.8.1/rtt/scripting/ExpressionParser.cpp [ 83%] Building CXX object rtt/scripting/CMakeFiles/rtt-scripting-gnulinux_plugin.dir/FunctionFactory.cpp.o cd /local/robotpkg/var/tmp/robotpkg/middleware/orocos-rtt/work/orocos-rtt-2.8.1/rtt/scripting && /usr/bin/g++ -DOROCOS_TARGET=gnulinux -DRTT_SCRIPTING_DLL_EXPORT -I/local/robotpkg/var/tmp/robotpkg/middleware/orocos-rtt/work/orocos-rtt-2.8.1/rtt/typekit -I/local/robotpkg/var/tmp/robotpkg/middleware/orocos-rtt/work/orocos-rtt-2.8.1/rtt/scripting -I/local/robotpkg/var/tmp/robotpkg/middleware/orocos-rtt/work/orocos-rtt-2.8.1/rtt/os/gnulinux -I/local/robotpkg/var/tmp/robotpkg/middleware/orocos-rtt/work/orocos-rtt-2.8.1/rtt/os -I/local/robotpkg/var/tmp/robotpkg/middleware/orocos-rtt/work/orocos-rtt-2.8.1/rtt -I/local/robotpkg/var/tmp/robotpkg/middleware/orocos-rtt/work/orocos-rtt-2.8.1 -pipe -O3 -DNDEBUG -fmessage-length=0 -fPIC -Wall -o CMakeFiles/rtt-scripting-gnulinux_plugin.dir/FunctionFactory.cpp.o -c /local/robotpkg/var/tmp/robotpkg/middleware/orocos-rtt/work/orocos-rtt-2.8.1/rtt/scripting/FunctionFactory.cpp [ 83%] Building CXX object rtt/scripting/CMakeFiles/rtt-scripting-gnulinux_plugin.dir/FunctionGraph.cpp.o cd /local/robotpkg/var/tmp/robotpkg/middleware/orocos-rtt/work/orocos-rtt-2.8.1/rtt/scripting && /usr/bin/g++ -DOROCOS_TARGET=gnulinux -DRTT_SCRIPTING_DLL_EXPORT -I/local/robotpkg/var/tmp/robotpkg/middleware/orocos-rtt/work/orocos-rtt-2.8.1/rtt/typekit -I/local/robotpkg/var/tmp/robotpkg/middleware/orocos-rtt/work/orocos-rtt-2.8.1/rtt/scripting -I/local/robotpkg/var/tmp/robotpkg/middleware/orocos-rtt/work/orocos-rtt-2.8.1/rtt/os/gnulinux -I/local/robotpkg/var/tmp/robotpkg/middleware/orocos-rtt/work/orocos-rtt-2.8.1/rtt/os -I/local/robotpkg/var/tmp/robotpkg/middleware/orocos-rtt/work/orocos-rtt-2.8.1/rtt -I/local/robotpkg/var/tmp/robotpkg/middleware/orocos-rtt/work/orocos-rtt-2.8.1 -pipe -O3 -DNDEBUG -fmessage-length=0 -fPIC -Wall -o CMakeFiles/rtt-scripting-gnulinux_plugin.dir/FunctionGraph.cpp.o -c /local/robotpkg/var/tmp/robotpkg/middleware/orocos-rtt/work/orocos-rtt-2.8.1/rtt/scripting/FunctionGraph.cpp [ 84%] Building CXX object rtt/scripting/CMakeFiles/rtt-scripting-gnulinux_plugin.dir/FunctionGraphBuilder.cpp.o cd /local/robotpkg/var/tmp/robotpkg/middleware/orocos-rtt/work/orocos-rtt-2.8.1/rtt/scripting && /usr/bin/g++ -DOROCOS_TARGET=gnulinux -DRTT_SCRIPTING_DLL_EXPORT -I/local/robotpkg/var/tmp/robotpkg/middleware/orocos-rtt/work/orocos-rtt-2.8.1/rtt/typekit -I/local/robotpkg/var/tmp/robotpkg/middleware/orocos-rtt/work/orocos-rtt-2.8.1/rtt/scripting -I/local/robotpkg/var/tmp/robotpkg/middleware/orocos-rtt/work/orocos-rtt-2.8.1/rtt/os/gnulinux -I/local/robotpkg/var/tmp/robotpkg/middleware/orocos-rtt/work/orocos-rtt-2.8.1/rtt/os -I/local/robotpkg/var/tmp/robotpkg/middleware/orocos-rtt/work/orocos-rtt-2.8.1/rtt -I/local/robotpkg/var/tmp/robotpkg/middleware/orocos-rtt/work/orocos-rtt-2.8.1 -pipe -O3 -DNDEBUG -fmessage-length=0 -fPIC -Wall -o CMakeFiles/rtt-scripting-gnulinux_plugin.dir/FunctionGraphBuilder.cpp.o -c /local/robotpkg/var/tmp/robotpkg/middleware/orocos-rtt/work/orocos-rtt-2.8.1/rtt/scripting/FunctionGraphBuilder.cpp [ 84%] Building CXX object rtt/scripting/CMakeFiles/rtt-scripting-gnulinux_plugin.dir/ParsedStateMachine.cpp.o cd /local/robotpkg/var/tmp/robotpkg/middleware/orocos-rtt/work/orocos-rtt-2.8.1/rtt/scripting && /usr/bin/g++ -DOROCOS_TARGET=gnulinux -DRTT_SCRIPTING_DLL_EXPORT -I/local/robotpkg/var/tmp/robotpkg/middleware/orocos-rtt/work/orocos-rtt-2.8.1/rtt/typekit -I/local/robotpkg/var/tmp/robotpkg/middleware/orocos-rtt/work/orocos-rtt-2.8.1/rtt/scripting -I/local/robotpkg/var/tmp/robotpkg/middleware/orocos-rtt/work/orocos-rtt-2.8.1/rtt/os/gnulinux -I/local/robotpkg/var/tmp/robotpkg/middleware/orocos-rtt/work/orocos-rtt-2.8.1/rtt/os -I/local/robotpkg/var/tmp/robotpkg/middleware/orocos-rtt/work/orocos-rtt-2.8.1/rtt -I/local/robotpkg/var/tmp/robotpkg/middleware/orocos-rtt/work/orocos-rtt-2.8.1 -pipe -O3 -DNDEBUG -fmessage-length=0 -fPIC -Wall -o CMakeFiles/rtt-scripting-gnulinux_plugin.dir/ParsedStateMachine.cpp.o -c /local/robotpkg/var/tmp/robotpkg/middleware/orocos-rtt/work/orocos-rtt-2.8.1/rtt/scripting/ParsedStateMachine.cpp [ 86%] Building CXX object rtt/scripting/CMakeFiles/rtt-scripting-gnulinux_plugin.dir/Parser.cpp.o cd /local/robotpkg/var/tmp/robotpkg/middleware/orocos-rtt/work/orocos-rtt-2.8.1/rtt/scripting && /usr/bin/g++ -DOROCOS_TARGET=gnulinux -DRTT_SCRIPTING_DLL_EXPORT -I/local/robotpkg/var/tmp/robotpkg/middleware/orocos-rtt/work/orocos-rtt-2.8.1/rtt/typekit -I/local/robotpkg/var/tmp/robotpkg/middleware/orocos-rtt/work/orocos-rtt-2.8.1/rtt/scripting -I/local/robotpkg/var/tmp/robotpkg/middleware/orocos-rtt/work/orocos-rtt-2.8.1/rtt/os/gnulinux -I/local/robotpkg/var/tmp/robotpkg/middleware/orocos-rtt/work/orocos-rtt-2.8.1/rtt/os -I/local/robotpkg/var/tmp/robotpkg/middleware/orocos-rtt/work/orocos-rtt-2.8.1/rtt -I/local/robotpkg/var/tmp/robotpkg/middleware/orocos-rtt/work/orocos-rtt-2.8.1 -pipe -O3 -DNDEBUG -fmessage-length=0 -fPIC -Wall -o CMakeFiles/rtt-scripting-gnulinux_plugin.dir/Parser.cpp.o -c /local/robotpkg/var/tmp/robotpkg/middleware/orocos-rtt/work/orocos-rtt-2.8.1/rtt/scripting/Parser.cpp [ 86%] Building CXX object rtt/scripting/CMakeFiles/rtt-scripting-gnulinux_plugin.dir/PeerParser.cpp.o cd /local/robotpkg/var/tmp/robotpkg/middleware/orocos-rtt/work/orocos-rtt-2.8.1/rtt/scripting && /usr/bin/g++ -DOROCOS_TARGET=gnulinux -DRTT_SCRIPTING_DLL_EXPORT -I/local/robotpkg/var/tmp/robotpkg/middleware/orocos-rtt/work/orocos-rtt-2.8.1/rtt/typekit -I/local/robotpkg/var/tmp/robotpkg/middleware/orocos-rtt/work/orocos-rtt-2.8.1/rtt/scripting -I/local/robotpkg/var/tmp/robotpkg/middleware/orocos-rtt/work/orocos-rtt-2.8.1/rtt/os/gnulinux -I/local/robotpkg/var/tmp/robotpkg/middleware/orocos-rtt/work/orocos-rtt-2.8.1/rtt/os -I/local/robotpkg/var/tmp/robotpkg/middleware/orocos-rtt/work/orocos-rtt-2.8.1/rtt -I/local/robotpkg/var/tmp/robotpkg/middleware/orocos-rtt/work/orocos-rtt-2.8.1 -pipe -O3 -DNDEBUG -fmessage-length=0 -fPIC -Wall -o CMakeFiles/rtt-scripting-gnulinux_plugin.dir/PeerParser.cpp.o -c /local/robotpkg/var/tmp/robotpkg/middleware/orocos-rtt/work/orocos-rtt-2.8.1/rtt/scripting/PeerParser.cpp [ 86%] Building CXX object rtt/scripting/CMakeFiles/rtt-scripting-gnulinux_plugin.dir/ProgramGraphParser.cpp.o cd /local/robotpkg/var/tmp/robotpkg/middleware/orocos-rtt/work/orocos-rtt-2.8.1/rtt/scripting && /usr/bin/g++ -DOROCOS_TARGET=gnulinux -DRTT_SCRIPTING_DLL_EXPORT -I/local/robotpkg/var/tmp/robotpkg/middleware/orocos-rtt/work/orocos-rtt-2.8.1/rtt/typekit -I/local/robotpkg/var/tmp/robotpkg/middleware/orocos-rtt/work/orocos-rtt-2.8.1/rtt/scripting -I/local/robotpkg/var/tmp/robotpkg/middleware/orocos-rtt/work/orocos-rtt-2.8.1/rtt/os/gnulinux -I/local/robotpkg/var/tmp/robotpkg/middleware/orocos-rtt/work/orocos-rtt-2.8.1/rtt/os -I/local/robotpkg/var/tmp/robotpkg/middleware/orocos-rtt/work/orocos-rtt-2.8.1/rtt -I/local/robotpkg/var/tmp/robotpkg/middleware/orocos-rtt/work/orocos-rtt-2.8.1 -pipe -O3 -DNDEBUG -fmessage-length=0 -fPIC -Wall -o CMakeFiles/rtt-scripting-gnulinux_plugin.dir/ProgramGraphParser.cpp.o -c /local/robotpkg/var/tmp/robotpkg/middleware/orocos-rtt/work/orocos-rtt-2.8.1/rtt/scripting/ProgramGraphParser.cpp [ 87%] Building CXX object rtt/scripting/CMakeFiles/rtt-scripting-gnulinux_plugin.dir/ProgramGraphParser2.cpp.o cd /local/robotpkg/var/tmp/robotpkg/middleware/orocos-rtt/work/orocos-rtt-2.8.1/rtt/scripting && /usr/bin/g++ -DOROCOS_TARGET=gnulinux -DRTT_SCRIPTING_DLL_EXPORT -I/local/robotpkg/var/tmp/robotpkg/middleware/orocos-rtt/work/orocos-rtt-2.8.1/rtt/typekit -I/local/robotpkg/var/tmp/robotpkg/middleware/orocos-rtt/work/orocos-rtt-2.8.1/rtt/scripting -I/local/robotpkg/var/tmp/robotpkg/middleware/orocos-rtt/work/orocos-rtt-2.8.1/rtt/os/gnulinux -I/local/robotpkg/var/tmp/robotpkg/middleware/orocos-rtt/work/orocos-rtt-2.8.1/rtt/os -I/local/robotpkg/var/tmp/robotpkg/middleware/orocos-rtt/work/orocos-rtt-2.8.1/rtt -I/local/robotpkg/var/tmp/robotpkg/middleware/orocos-rtt/work/orocos-rtt-2.8.1 -pipe -O3 -DNDEBUG -fmessage-length=0 -fPIC -Wall -o CMakeFiles/rtt-scripting-gnulinux_plugin.dir/ProgramGraphParser2.cpp.o -c /local/robotpkg/var/tmp/robotpkg/middleware/orocos-rtt/work/orocos-rtt-2.8.1/rtt/scripting/ProgramGraphParser2.cpp [ 87%] Building CXX object rtt/scripting/CMakeFiles/rtt-scripting-gnulinux_plugin.dir/ProgramInterface.cpp.o cd /local/robotpkg/var/tmp/robotpkg/middleware/orocos-rtt/work/orocos-rtt-2.8.1/rtt/scripting && /usr/bin/g++ -DOROCOS_TARGET=gnulinux -DRTT_SCRIPTING_DLL_EXPORT -I/local/robotpkg/var/tmp/robotpkg/middleware/orocos-rtt/work/orocos-rtt-2.8.1/rtt/typekit -I/local/robotpkg/var/tmp/robotpkg/middleware/orocos-rtt/work/orocos-rtt-2.8.1/rtt/scripting -I/local/robotpkg/var/tmp/robotpkg/middleware/orocos-rtt/work/orocos-rtt-2.8.1/rtt/os/gnulinux -I/local/robotpkg/var/tmp/robotpkg/middleware/orocos-rtt/work/orocos-rtt-2.8.1/rtt/os -I/local/robotpkg/var/tmp/robotpkg/middleware/orocos-rtt/work/orocos-rtt-2.8.1/rtt -I/local/robotpkg/var/tmp/robotpkg/middleware/orocos-rtt/work/orocos-rtt-2.8.1 -pipe -O3 -DNDEBUG -fmessage-length=0 -fPIC -Wall -o CMakeFiles/rtt-scripting-gnulinux_plugin.dir/ProgramInterface.cpp.o -c /local/robotpkg/var/tmp/robotpkg/middleware/orocos-rtt/work/orocos-rtt-2.8.1/rtt/scripting/ProgramInterface.cpp [ 88%] Building CXX object rtt/scripting/CMakeFiles/rtt-scripting-gnulinux_plugin.dir/ProgramService.cpp.o cd /local/robotpkg/var/tmp/robotpkg/middleware/orocos-rtt/work/orocos-rtt-2.8.1/rtt/scripting && /usr/bin/g++ -DOROCOS_TARGET=gnulinux -DRTT_SCRIPTING_DLL_EXPORT -I/local/robotpkg/var/tmp/robotpkg/middleware/orocos-rtt/work/orocos-rtt-2.8.1/rtt/typekit -I/local/robotpkg/var/tmp/robotpkg/middleware/orocos-rtt/work/orocos-rtt-2.8.1/rtt/scripting -I/local/robotpkg/var/tmp/robotpkg/middleware/orocos-rtt/work/orocos-rtt-2.8.1/rtt/os/gnulinux -I/local/robotpkg/var/tmp/robotpkg/middleware/orocos-rtt/work/orocos-rtt-2.8.1/rtt/os -I/local/robotpkg/var/tmp/robotpkg/middleware/orocos-rtt/work/orocos-rtt-2.8.1/rtt -I/local/robotpkg/var/tmp/robotpkg/middleware/orocos-rtt/work/orocos-rtt-2.8.1 -pipe -O3 -DNDEBUG -fmessage-length=0 -fPIC -Wall -o CMakeFiles/rtt-scripting-gnulinux_plugin.dir/ProgramService.cpp.o -c /local/robotpkg/var/tmp/robotpkg/middleware/orocos-rtt/work/orocos-rtt-2.8.1/rtt/scripting/ProgramService.cpp [ 90%] Linking CXX shared library librtt-typekit-gnulinux.so cd /local/robotpkg/var/tmp/robotpkg/middleware/orocos-rtt/work/orocos-rtt-2.8.1/rtt/typekit && /usr/bin/cmake -E cmake_link_script CMakeFiles/rtt-typekit-gnulinux_plugin.dir/link.txt --verbose=1 /usr/bin/g++ -fPIC -pipe -O3 -DNDEBUG -fmessage-length=0 -Wl,-zdefs -shared -Wl,-soname,librtt-typekit-gnulinux.so.2.8 -o librtt-typekit-gnulinux.so.2.8.1 CMakeFiles/rtt-typekit-gnulinux_plugin.dir/RealTimeTypekit.cpp.o CMakeFiles/rtt-typekit-gnulinux_plugin.dir/RealTimeTypekitConstructors.cpp.o CMakeFiles/rtt-typekit-gnulinux_plugin.dir/RealTimeTypekitGlobals.cpp.o CMakeFiles/rtt-typekit-gnulinux_plugin.dir/RealTimeTypekitOperators.cpp.o CMakeFiles/rtt-typekit-gnulinux_plugin.dir/RealTimeTypekitStdTypes.cpp.o CMakeFiles/rtt-typekit-gnulinux_plugin.dir/RealTimeTypekitTypes.cpp.o CMakeFiles/rtt-typekit-gnulinux_plugin.dir/RealTimeTypekitTypes2.cpp.o -Wl,-rpath,/local/robotpkg/var/tmp/robotpkg/middleware/orocos-rtt/work/orocos-rtt-2.8.1/rtt: ../liborocos-rtt-gnulinux.so.2.8.1 -lboost_filesystem -lboost_system -lboost_serialization -lxerces-c -lpthread -lrt -ldl [ 90%] Building CXX object rtt/scripting/CMakeFiles/rtt-scripting-gnulinux_plugin.dir/PropertyParser.cpp.o cd /local/robotpkg/var/tmp/robotpkg/middleware/orocos-rtt/work/orocos-rtt-2.8.1/rtt/scripting && /usr/bin/g++ -DOROCOS_TARGET=gnulinux -DRTT_SCRIPTING_DLL_EXPORT -I/local/robotpkg/var/tmp/robotpkg/middleware/orocos-rtt/work/orocos-rtt-2.8.1/rtt/typekit -I/local/robotpkg/var/tmp/robotpkg/middleware/orocos-rtt/work/orocos-rtt-2.8.1/rtt/scripting -I/local/robotpkg/var/tmp/robotpkg/middleware/orocos-rtt/work/orocos-rtt-2.8.1/rtt/os/gnulinux -I/local/robotpkg/var/tmp/robotpkg/middleware/orocos-rtt/work/orocos-rtt-2.8.1/rtt/os -I/local/robotpkg/var/tmp/robotpkg/middleware/orocos-rtt/work/orocos-rtt-2.8.1/rtt -I/local/robotpkg/var/tmp/robotpkg/middleware/orocos-rtt/work/orocos-rtt-2.8.1 -pipe -O3 -DNDEBUG -fmessage-length=0 -fPIC -Wall -o CMakeFiles/rtt-scripting-gnulinux_plugin.dir/PropertyParser.cpp.o -c /local/robotpkg/var/tmp/robotpkg/middleware/orocos-rtt/work/orocos-rtt-2.8.1/rtt/scripting/PropertyParser.cpp cd /local/robotpkg/var/tmp/robotpkg/middleware/orocos-rtt/work/orocos-rtt-2.8.1/rtt/typekit && /usr/bin/cmake -E cmake_symlink_library librtt-typekit-gnulinux.so.2.8.1 librtt-typekit-gnulinux.so.2.8 librtt-typekit-gnulinux.so Copying /local/robotpkg/var/tmp/robotpkg/middleware/orocos-rtt/work/orocos-rtt-2.8.1/rtt/typekit/librtt-typekit-gnulinux.so to /local/robotpkg/var/tmp/robotpkg/middleware/orocos-rtt/work/orocos-rtt-2.8.1/rtt/types cd /local/robotpkg/var/tmp/robotpkg/middleware/orocos-rtt/work/orocos-rtt-2.8.1/rtt/typekit && /usr/bin/cmake -E make_directory /local/robotpkg/var/tmp/robotpkg/middleware/orocos-rtt/work/orocos-rtt-2.8.1/rtt/types cd /local/robotpkg/var/tmp/robotpkg/middleware/orocos-rtt/work/orocos-rtt-2.8.1/rtt/typekit && /usr/bin/cmake -E copy /local/robotpkg/var/tmp/robotpkg/middleware/orocos-rtt/work/orocos-rtt-2.8.1/rtt/typekit/librtt-typekit-gnulinux.so /local/robotpkg/var/tmp/robotpkg/middleware/orocos-rtt/work/orocos-rtt-2.8.1/rtt/types make[2]: Leaving directory '/local/robotpkg/var/tmp/robotpkg/middleware/orocos-rtt/work/orocos-rtt-2.8.1' [ 90%] Built target rtt-typekit-gnulinux_plugin [ 91%] Building CXX object rtt/scripting/CMakeFiles/rtt-scripting-gnulinux_plugin.dir/ScriptParser.cpp.o cd /local/robotpkg/var/tmp/robotpkg/middleware/orocos-rtt/work/orocos-rtt-2.8.1/rtt/scripting && /usr/bin/g++ -DOROCOS_TARGET=gnulinux -DRTT_SCRIPTING_DLL_EXPORT -I/local/robotpkg/var/tmp/robotpkg/middleware/orocos-rtt/work/orocos-rtt-2.8.1/rtt/typekit -I/local/robotpkg/var/tmp/robotpkg/middleware/orocos-rtt/work/orocos-rtt-2.8.1/rtt/scripting -I/local/robotpkg/var/tmp/robotpkg/middleware/orocos-rtt/work/orocos-rtt-2.8.1/rtt/os/gnulinux -I/local/robotpkg/var/tmp/robotpkg/middleware/orocos-rtt/work/orocos-rtt-2.8.1/rtt/os -I/local/robotpkg/var/tmp/robotpkg/middleware/orocos-rtt/work/orocos-rtt-2.8.1/rtt -I/local/robotpkg/var/tmp/robotpkg/middleware/orocos-rtt/work/orocos-rtt-2.8.1 -pipe -O3 -DNDEBUG -fmessage-length=0 -fPIC -Wall -o CMakeFiles/rtt-scripting-gnulinux_plugin.dir/ScriptParser.cpp.o -c /local/robotpkg/var/tmp/robotpkg/middleware/orocos-rtt/work/orocos-rtt-2.8.1/rtt/scripting/ScriptParser.cpp In file included from /usr/include/boost/function/detail/maybe_include.hpp:18:0, from /usr/include/boost/function/detail/function_iterate.hpp:14, from /usr/include/boost/preprocessor/iteration/detail/iter/forward1.hpp:52, from /usr/include/boost/function.hpp:64, from /local/robotpkg/var/tmp/robotpkg/middleware/orocos-rtt/work/orocos-rtt-2.8.1/rtt/scripting/../DataFlowInterface.hpp:48, from /local/robotpkg/var/tmp/robotpkg/middleware/orocos-rtt/work/orocos-rtt-2.8.1/rtt/scripting/../Service.hpp:44, from /local/robotpkg/var/tmp/robotpkg/middleware/orocos-rtt/work/orocos-rtt-2.8.1/rtt/scripting/ProgramService.hpp:43, from /local/robotpkg/var/tmp/robotpkg/middleware/orocos-rtt/work/orocos-rtt-2.8.1/rtt/scripting/ProgramService.cpp:40: /usr/include/boost/function/function_template.hpp: In instantiation of 'static R boost::detail::function::function_obj_invoker1::invoke(boost::detail::function::function_buffer&, T0) [with FunctionObj = boost::fusion::unfused)>, boost::fusion::cons, boost::fusion::nil_> >, boost::_bi::list2)> > >, boost::arg<1> > >, true>; R = bool; T0 = boost::shared_ptr]': /usr/include/boost/function/function_template.hpp:937:38: required from 'void boost::function1::assign_to(Functor) [with Functor = boost::fusion::unfused)>, boost::fusion::cons, boost::fusion::nil_> >, boost::_bi::list2)> > >, boost::arg<1> > >, true>; R = bool; T0 = boost::shared_ptr]' /usr/include/boost/function/function_template.hpp:727:7: required from 'boost::function1::function1(Functor, typename boost::enable_if_c<(! boost::is_integral::value), int>::type) [with Functor = boost::fusion::unfused)>, boost::fusion::cons, boost::fusion::nil_> >, boost::_bi::list2)> > >, boost::arg<1> > >, true>; R = bool; T0 = boost::shared_ptr; typename boost::enable_if_c<(! boost::is_integral::value), int>::type = int]' /usr/include/boost/function/function_template.hpp:1073:16: required from 'boost::function::function(Functor, typename boost::enable_if_c<(! boost::is_integral::value), int>::type) [with Functor = boost::fusion::unfused)>, boost::fusion::cons, boost::fusion::nil_> >, boost::_bi::list2)> > >, boost::arg<1> > >, true>; R = bool; T0 = boost::shared_ptr; typename boost::enable_if_c<(! boost::is_integral::value), int>::type = int]' /local/robotpkg/var/tmp/robotpkg/middleware/orocos-rtt/work/orocos-rtt-2.8.1/rtt/scripting/../internal/OperationInterfacePartFused.hpp:444:40: required from 'RTT::Handle RTT::internal::OperationInterfacePartFusedDS::produceSignal(RTT::base::ActionInterface*, const std::vector >&, RTT::ExecutionEngine*) const [with Signature = bool(boost::shared_ptr); ObjT = RTT::scripting::ProgramInterface]' /local/robotpkg/var/tmp/robotpkg/middleware/orocos-rtt/work/orocos-rtt-2.8.1/rtt/scripting/ProgramService.cpp:83:1: required from here /usr/include/boost/function/function_template.hpp:138:22: error: no match for call to '(boost::fusion::unfused)>, boost::fusion::cons, boost::fusion::nil_> >, boost::_bi::list2)> > >, boost::arg<1> > >, true>) (boost::shared_ptr)' return (*f)(BOOST_FUNCTION_ARGS); ~~~~^~~~~~~~~~~~~~~~~~~~~ In file included from /usr/include/boost/fusion/functional/generation/make_unfused.hpp:13:0, from /local/robotpkg/var/tmp/robotpkg/middleware/orocos-rtt/work/orocos-rtt-2.8.1/rtt/scripting/../internal/OperationInterfacePartFused.hpp:53, from /local/robotpkg/var/tmp/robotpkg/middleware/orocos-rtt/work/orocos-rtt-2.8.1/rtt/scripting/../Service.hpp:45, from /local/robotpkg/var/tmp/robotpkg/middleware/orocos-rtt/work/orocos-rtt-2.8.1/rtt/scripting/ProgramService.hpp:43, from /local/robotpkg/var/tmp/robotpkg/middleware/orocos-rtt/work/orocos-rtt-2.8.1/rtt/scripting/ProgramService.cpp:40: /usr/include/boost/fusion/functional/adapter/unfused.hpp:59:36: note: candidate: constexpr boost::fusion::unfused::call_const_0_result boost::fusion::unfused::operator()() const [with Function = boost::_bi::bind_t)>, boost::fusion::cons, boost::fusion::nil_> >, boost::_bi::list2)> > >, boost::arg<1> > >; boost::fusion::unfused::call_const_0_result = bool] inline call_const_0_result operator()() const ^~~~~~~~ /usr/include/boost/fusion/functional/adapter/unfused.hpp:59:36: note: candidate expects 0 arguments, 1 provided /usr/include/boost/fusion/functional/adapter/unfused.hpp:69:30: note: candidate: constexpr boost::fusion::unfused::call_0_result boost::fusion::unfused::operator()() [with Function = boost::_bi::bind_t)>, boost::fusion::cons, boost::fusion::nil_> >, boost::_bi::list2)> > >, boost::arg<1> > >; boost::fusion::unfused::call_0_result = bool] inline call_0_result operator()() ^~~~~~~~ /usr/include/boost/fusion/functional/adapter/unfused.hpp:69:30: note: candidate expects 0 arguments, 1 provided In file included from /usr/include/boost/preprocessor/iteration/detail/iter/forward1.hpp:82:0, from /usr/include/boost/fusion/functional/adapter/unfused.hpp:97, from /usr/include/boost/fusion/functional/generation/make_unfused.hpp:13, from /local/robotpkg/var/tmp/robotpkg/middleware/orocos-rtt/work/orocos-rtt-2.8.1/rtt/scripting/../internal/OperationInterfacePartFused.hpp:53, from /local/robotpkg/var/tmp/robotpkg/middleware/orocos-rtt/work/orocos-rtt-2.8.1/rtt/scripting/../Service.hpp:45, from /local/robotpkg/var/tmp/robotpkg/middleware/orocos-rtt/work/orocos-rtt-2.8.1/rtt/scripting/ProgramService.hpp:43, from /local/robotpkg/var/tmp/robotpkg/middleware/orocos-rtt/work/orocos-rtt-2.8.1/rtt/scripting/ProgramService.cpp:40: /usr/include/boost/fusion/functional/adapter/unfused.hpp:170:9: note: candidate: template constexpr typename boost::result_of::type(boost::fusion::vector&)>::type boost::fusion::unfused::operator()(T0&, T1&, T2&, T3&, T4&, T5&, T6&) [with T0 = T0; T1 = T1; T2 = T2; T3 = T3; T4 = T4; T5 = T5; T6 = T6; Function = boost::_bi::bind_t)>, boost::fusion::cons, boost::fusion::nil_> >, boost::_bi::list2)> > >, boost::arg<1> > >] operator()(BOOST_PP_ENUM_BINARY_PARAMS(N,T,& a)) ^~~~~~~~ /usr/include/boost/fusion/functional/adapter/unfused.hpp:170:9: note: template argument deduction/substitution failed: In file included from /usr/include/boost/function/detail/maybe_include.hpp:18:0, from /usr/include/boost/function/detail/function_iterate.hpp:14, from /usr/include/boost/preprocessor/iteration/detail/iter/forward1.hpp:52, from /usr/include/boost/function.hpp:64, from /local/robotpkg/var/tmp/robotpkg/middleware/orocos-rtt/work/orocos-rtt-2.8.1/rtt/scripting/../DataFlowInterface.hpp:48, from /local/robotpkg/var/tmp/robotpkg/middleware/orocos-rtt/work/orocos-rtt-2.8.1/rtt/scripting/../Service.hpp:44, from /local/robotpkg/var/tmp/robotpkg/middleware/orocos-rtt/work/orocos-rtt-2.8.1/rtt/scripting/ProgramService.hpp:43, from /local/robotpkg/var/tmp/robotpkg/middleware/orocos-rtt/work/orocos-rtt-2.8.1/rtt/scripting/ProgramService.cpp:40: /usr/include/boost/function/function_template.hpp:138:22: note: candidate expects 7 arguments, 1 provided return (*f)(BOOST_FUNCTION_ARGS); ~~~~^~~~~~~~~~~~~~~~~~~~~ In file included from /usr/include/boost/preprocessor/iteration/detail/iter/forward1.hpp:82:0, from /usr/include/boost/fusion/functional/adapter/unfused.hpp:97, from /usr/include/boost/fusion/functional/generation/make_unfused.hpp:13, from /local/robotpkg/var/tmp/robotpkg/middleware/orocos-rtt/work/orocos-rtt-2.8.1/rtt/scripting/../internal/OperationInterfacePartFused.hpp:53, from /local/robotpkg/var/tmp/robotpkg/middleware/orocos-rtt/work/orocos-rtt-2.8.1/rtt/scripting/../Service.hpp:45, from /local/robotpkg/var/tmp/robotpkg/middleware/orocos-rtt/work/orocos-rtt-2.8.1/rtt/scripting/ProgramService.hpp:43, from /local/robotpkg/var/tmp/robotpkg/middleware/orocos-rtt/work/orocos-rtt-2.8.1/rtt/scripting/ProgramService.cpp:40: /usr/include/boost/fusion/functional/adapter/unfused.hpp:158:9: note: candidate: template constexpr typename boost::result_of::type(boost::fusion::vector&)>::type boost::fusion::unfused::operator()(T0&, T1&, T2&, T3&, T4&, T5&, T6&) const [with T0 = T0; T1 = T1; T2 = T2; T3 = T3; T4 = T4; T5 = T5; T6 = T6; Function = boost::_bi::bind_t)>, boost::fusion::cons, boost::fusion::nil_> >, boost::_bi::list2)> > >, boost::arg<1> > >] operator()(BOOST_PP_ENUM_BINARY_PARAMS(N,T,& a)) const ^~~~~~~~ /usr/include/boost/fusion/functional/adapter/unfused.hpp:158:9: note: template argument deduction/substitution failed: In file included from /usr/include/boost/function/detail/maybe_include.hpp:18:0, from /usr/include/boost/function/detail/function_iterate.hpp:14, from /usr/include/boost/preprocessor/iteration/detail/iter/forward1.hpp:52, from /usr/include/boost/function.hpp:64, from /local/robotpkg/var/tmp/robotpkg/middleware/orocos-rtt/work/orocos-rtt-2.8.1/rtt/scripting/../DataFlowInterface.hpp:48, from /local/robotpkg/var/tmp/robotpkg/middleware/orocos-rtt/work/orocos-rtt-2.8.1/rtt/scripting/../Service.hpp:44, from /local/robotpkg/var/tmp/robotpkg/middleware/orocos-rtt/work/orocos-rtt-2.8.1/rtt/scripting/ProgramService.hpp:43, from /local/robotpkg/var/tmp/robotpkg/middleware/orocos-rtt/work/orocos-rtt-2.8.1/rtt/scripting/ProgramService.cpp:40: /usr/include/boost/function/function_template.hpp:138:22: note: candidate expects 7 arguments, 1 provided return (*f)(BOOST_FUNCTION_ARGS); ~~~~^~~~~~~~~~~~~~~~~~~~~ In file included from /usr/include/boost/preprocessor/iteration/detail/iter/forward1.hpp:77:0, from /usr/include/boost/fusion/functional/adapter/unfused.hpp:97, from /usr/include/boost/fusion/functional/generation/make_unfused.hpp:13, from /local/robotpkg/var/tmp/robotpkg/middleware/orocos-rtt/work/orocos-rtt-2.8.1/rtt/scripting/../internal/OperationInterfacePartFused.hpp:53, from /local/robotpkg/var/tmp/robotpkg/middleware/orocos-rtt/work/orocos-rtt-2.8.1/rtt/scripting/../Service.hpp:45, from /local/robotpkg/var/tmp/robotpkg/middleware/orocos-rtt/work/orocos-rtt-2.8.1/rtt/scripting/ProgramService.hpp:43, from /local/robotpkg/var/tmp/robotpkg/middleware/orocos-rtt/work/orocos-rtt-2.8.1/rtt/scripting/ProgramService.cpp:40: /usr/include/boost/fusion/functional/adapter/unfused.hpp:170:9: note: candidate: template constexpr typename boost::result_of::type(boost::fusion::vector&)>::type boost::fusion::unfused::operator()(T0&, T1&, T2&, T3&, T4&, T5&) [with T0 = T0; T1 = T1; T2 = T2; T3 = T3; T4 = T4; T5 = T5; Function = boost::_bi::bind_t)>, boost::fusion::cons, boost::fusion::nil_> >, boost::_bi::list2)> > >, boost::arg<1> > >] operator()(BOOST_PP_ENUM_BINARY_PARAMS(N,T,& a)) ^~~~~~~~ /usr/include/boost/fusion/functional/adapter/unfused.hpp:170:9: note: template argument deduction/substitution failed: In file included from /usr/include/boost/function/detail/maybe_include.hpp:18:0, from /usr/include/boost/function/detail/function_iterate.hpp:14, from /usr/include/boost/preprocessor/iteration/detail/iter/forward1.hpp:52, from /usr/include/boost/function.hpp:64, from /local/robotpkg/var/tmp/robotpkg/middleware/orocos-rtt/work/orocos-rtt-2.8.1/rtt/scripting/../DataFlowInterface.hpp:48, from /local/robotpkg/var/tmp/robotpkg/middleware/orocos-rtt/work/orocos-rtt-2.8.1/rtt/scripting/../Service.hpp:44, from /local/robotpkg/var/tmp/robotpkg/middleware/orocos-rtt/work/orocos-rtt-2.8.1/rtt/scripting/ProgramService.hpp:43, from /local/robotpkg/var/tmp/robotpkg/middleware/orocos-rtt/work/orocos-rtt-2.8.1/rtt/scripting/ProgramService.cpp:40: /usr/include/boost/function/function_template.hpp:138:22: note: candidate expects 6 arguments, 1 provided return (*f)(BOOST_FUNCTION_ARGS); ~~~~^~~~~~~~~~~~~~~~~~~~~ In file included from /usr/include/boost/preprocessor/iteration/detail/iter/forward1.hpp:77:0, from /usr/include/boost/fusion/functional/adapter/unfused.hpp:97, from /usr/include/boost/fusion/functional/generation/make_unfused.hpp:13, from /local/robotpkg/var/tmp/robotpkg/middleware/orocos-rtt/work/orocos-rtt-2.8.1/rtt/scripting/../internal/OperationInterfacePartFused.hpp:53, from /local/robotpkg/var/tmp/robotpkg/middleware/orocos-rtt/work/orocos-rtt-2.8.1/rtt/scripting/../Service.hpp:45, from /local/robotpkg/var/tmp/robotpkg/middleware/orocos-rtt/work/orocos-rtt-2.8.1/rtt/scripting/ProgramService.hpp:43, from /local/robotpkg/var/tmp/robotpkg/middleware/orocos-rtt/work/orocos-rtt-2.8.1/rtt/scripting/ProgramService.cpp:40: /usr/include/boost/fusion/functional/adapter/unfused.hpp:158:9: note: candidate: template constexpr typename boost::result_of::type(boost::fusion::vector&)>::type boost::fusion::unfused::operator()(T0&, T1&, T2&, T3&, T4&, T5&) const [with T0 = T0; T1 = T1; T2 = T2; T3 = T3; T4 = T4; T5 = T5; Function = boost::_bi::bind_t)>, boost::fusion::cons, boost::fusion::nil_> >, boost::_bi::list2)> > >, boost::arg<1> > >] operator()(BOOST_PP_ENUM_BINARY_PARAMS(N,T,& a)) const ^~~~~~~~ /usr/include/boost/fusion/functional/adapter/unfused.hpp:158:9: note: template argument deduction/substitution failed: In file included from /usr/include/boost/function/detail/maybe_include.hpp:18:0, from /usr/include/boost/function/detail/function_iterate.hpp:14, from /usr/include/boost/preprocessor/iteration/detail/iter/forward1.hpp:52, from /usr/include/boost/function.hpp:64, from /local/robotpkg/var/tmp/robotpkg/middleware/orocos-rtt/work/orocos-rtt-2.8.1/rtt/scripting/../DataFlowInterface.hpp:48, from /local/robotpkg/var/tmp/robotpkg/middleware/orocos-rtt/work/orocos-rtt-2.8.1/rtt/scripting/../Service.hpp:44, from /local/robotpkg/var/tmp/robotpkg/middleware/orocos-rtt/work/orocos-rtt-2.8.1/rtt/scripting/ProgramService.hpp:43, from /local/robotpkg/var/tmp/robotpkg/middleware/orocos-rtt/work/orocos-rtt-2.8.1/rtt/scripting/ProgramService.cpp:40: /usr/include/boost/function/function_template.hpp:138:22: note: candidate expects 6 arguments, 1 provided return (*f)(BOOST_FUNCTION_ARGS); ~~~~^~~~~~~~~~~~~~~~~~~~~ In file included from /usr/include/boost/preprocessor/iteration/detail/iter/forward1.hpp:72:0, from /usr/include/boost/fusion/functional/adapter/unfused.hpp:97, from /usr/include/boost/fusion/functional/generation/make_unfused.hpp:13, from /local/robotpkg/var/tmp/robotpkg/middleware/orocos-rtt/work/orocos-rtt-2.8.1/rtt/scripting/../internal/OperationInterfacePartFused.hpp:53, from /local/robotpkg/var/tmp/robotpkg/middleware/orocos-rtt/work/orocos-rtt-2.8.1/rtt/scripting/../Service.hpp:45, from /local/robotpkg/var/tmp/robotpkg/middleware/orocos-rtt/work/orocos-rtt-2.8.1/rtt/scripting/ProgramService.hpp:43, from /local/robotpkg/var/tmp/robotpkg/middleware/orocos-rtt/work/orocos-rtt-2.8.1/rtt/scripting/ProgramService.cpp:40: /usr/include/boost/fusion/functional/adapter/unfused.hpp:170:9: note: candidate: template constexpr typename boost::result_of::type(boost::fusion::vector&)>::type boost::fusion::unfused::operator()(T0&, T1&, T2&, T3&, T4&) [with T0 = T0; T1 = T1; T2 = T2; T3 = T3; T4 = T4; Function = boost::_bi::bind_t)>, boost::fusion::cons, boost::fusion::nil_> >, boost::_bi::list2)> > >, boost::arg<1> > >] operator()(BOOST_PP_ENUM_BINARY_PARAMS(N,T,& a)) ^~~~~~~~ /usr/include/boost/fusion/functional/adapter/unfused.hpp:170:9: note: template argument deduction/substitution failed: In file included from /usr/include/boost/function/detail/maybe_include.hpp:18:0, from /usr/include/boost/function/detail/function_iterate.hpp:14, from /usr/include/boost/preprocessor/iteration/detail/iter/forward1.hpp:52, from /usr/include/boost/function.hpp:64, from /local/robotpkg/var/tmp/robotpkg/middleware/orocos-rtt/work/orocos-rtt-2.8.1/rtt/scripting/../DataFlowInterface.hpp:48, from /local/robotpkg/var/tmp/robotpkg/middleware/orocos-rtt/work/orocos-rtt-2.8.1/rtt/scripting/../Service.hpp:44, from /local/robotpkg/var/tmp/robotpkg/middleware/orocos-rtt/work/orocos-rtt-2.8.1/rtt/scripting/ProgramService.hpp:43, from /local/robotpkg/var/tmp/robotpkg/middleware/orocos-rtt/work/orocos-rtt-2.8.1/rtt/scripting/ProgramService.cpp:40: /usr/include/boost/function/function_template.hpp:138:22: note: candidate expects 5 arguments, 1 provided return (*f)(BOOST_FUNCTION_ARGS); ~~~~^~~~~~~~~~~~~~~~~~~~~ In file included from /usr/include/boost/preprocessor/iteration/detail/iter/forward1.hpp:72:0, from /usr/include/boost/fusion/functional/adapter/unfused.hpp:97, from /usr/include/boost/fusion/functional/generation/make_unfused.hpp:13, from /local/robotpkg/var/tmp/robotpkg/middleware/orocos-rtt/work/orocos-rtt-2.8.1/rtt/scripting/../internal/OperationInterfacePartFused.hpp:53, from /local/robotpkg/var/tmp/robotpkg/middleware/orocos-rtt/work/orocos-rtt-2.8.1/rtt/scripting/../Service.hpp:45, from /local/robotpkg/var/tmp/robotpkg/middleware/orocos-rtt/work/orocos-rtt-2.8.1/rtt/scripting/ProgramService.hpp:43, from /local/robotpkg/var/tmp/robotpkg/middleware/orocos-rtt/work/orocos-rtt-2.8.1/rtt/scripting/ProgramService.cpp:40: /usr/include/boost/fusion/functional/adapter/unfused.hpp:158:9: note: candidate: template constexpr typename boost::result_of::type(boost::fusion::vector&)>::type boost::fusion::unfused::operator()(T0&, T1&, T2&, T3&, T4&) const [with T0 = T0; T1 = T1; T2 = T2; T3 = T3; T4 = T4; Function = boost::_bi::bind_t)>, boost::fusion::cons, boost::fusion::nil_> >, boost::_bi::list2)> > >, boost::arg<1> > >] operator()(BOOST_PP_ENUM_BINARY_PARAMS(N,T,& a)) const ^~~~~~~~ /usr/include/boost/fusion/functional/adapter/unfused.hpp:158:9: note: template argument deduction/substitution failed: In file included from /usr/include/boost/function/detail/maybe_include.hpp:18:0, from /usr/include/boost/function/detail/function_iterate.hpp:14, from /usr/include/boost/preprocessor/iteration/detail/iter/forward1.hpp:52, from /usr/include/boost/function.hpp:64, from /local/robotpkg/var/tmp/robotpkg/middleware/orocos-rtt/work/orocos-rtt-2.8.1/rtt/scripting/../DataFlowInterface.hpp:48, from /local/robotpkg/var/tmp/robotpkg/middleware/orocos-rtt/work/orocos-rtt-2.8.1/rtt/scripting/../Service.hpp:44, from /local/robotpkg/var/tmp/robotpkg/middleware/orocos-rtt/work/orocos-rtt-2.8.1/rtt/scripting/ProgramService.hpp:43, from /local/robotpkg/var/tmp/robotpkg/middleware/orocos-rtt/work/orocos-rtt-2.8.1/rtt/scripting/ProgramService.cpp:40: /usr/include/boost/function/function_template.hpp:138:22: note: candidate expects 5 arguments, 1 provided return (*f)(BOOST_FUNCTION_ARGS); ~~~~^~~~~~~~~~~~~~~~~~~~~ In file included from /usr/include/boost/preprocessor/iteration/detail/iter/forward1.hpp:67:0, from /usr/include/boost/fusion/functional/adapter/unfused.hpp:97, from /usr/include/boost/fusion/functional/generation/make_unfused.hpp:13, from /local/robotpkg/var/tmp/robotpkg/middleware/orocos-rtt/work/orocos-rtt-2.8.1/rtt/scripting/../internal/OperationInterfacePartFused.hpp:53, from /local/robotpkg/var/tmp/robotpkg/middleware/orocos-rtt/work/orocos-rtt-2.8.1/rtt/scripting/../Service.hpp:45, from /local/robotpkg/var/tmp/robotpkg/middleware/orocos-rtt/work/orocos-rtt-2.8.1/rtt/scripting/ProgramService.hpp:43, from /local/robotpkg/var/tmp/robotpkg/middleware/orocos-rtt/work/orocos-rtt-2.8.1/rtt/scripting/ProgramService.cpp:40: /usr/include/boost/fusion/functional/adapter/unfused.hpp:170:9: note: candidate: template constexpr typename boost::result_of::type(boost::fusion::vector&)>::type boost::fusion::unfused::operator()(T0&, T1&, T2&, T3&) [with T0 = T0; T1 = T1; T2 = T2; T3 = T3; Function = boost::_bi::bind_t)>, boost::fusion::cons, boost::fusion::nil_> >, boost::_bi::list2)> > >, boost::arg<1> > >] operator()(BOOST_PP_ENUM_BINARY_PARAMS(N,T,& a)) ^~~~~~~~ /usr/include/boost/fusion/functional/adapter/unfused.hpp:170:9: note: template argument deduction/substitution failed: In file included from /usr/include/boost/function/detail/maybe_include.hpp:18:0, from /usr/include/boost/function/detail/function_iterate.hpp:14, from /usr/include/boost/preprocessor/iteration/detail/iter/forward1.hpp:52, from /usr/include/boost/function.hpp:64, from /local/robotpkg/var/tmp/robotpkg/middleware/orocos-rtt/work/orocos-rtt-2.8.1/rtt/scripting/../DataFlowInterface.hpp:48, from /local/robotpkg/var/tmp/robotpkg/middleware/orocos-rtt/work/orocos-rtt-2.8.1/rtt/scripting/../Service.hpp:44, from /local/robotpkg/var/tmp/robotpkg/middleware/orocos-rtt/work/orocos-rtt-2.8.1/rtt/scripting/ProgramService.hpp:43, from /local/robotpkg/var/tmp/robotpkg/middleware/orocos-rtt/work/orocos-rtt-2.8.1/rtt/scripting/ProgramService.cpp:40: /usr/include/boost/function/function_template.hpp:138:22: note: candidate expects 4 arguments, 1 provided return (*f)(BOOST_FUNCTION_ARGS); ~~~~^~~~~~~~~~~~~~~~~~~~~ In file included from /usr/include/boost/preprocessor/iteration/detail/iter/forward1.hpp:67:0, from /usr/include/boost/fusion/functional/adapter/unfused.hpp:97, from /usr/include/boost/fusion/functional/generation/make_unfused.hpp:13, from /local/robotpkg/var/tmp/robotpkg/middleware/orocos-rtt/work/orocos-rtt-2.8.1/rtt/scripting/../internal/OperationInterfacePartFused.hpp:53, from /local/robotpkg/var/tmp/robotpkg/middleware/orocos-rtt/work/orocos-rtt-2.8.1/rtt/scripting/../Service.hpp:45, from /local/robotpkg/var/tmp/robotpkg/middleware/orocos-rtt/work/orocos-rtt-2.8.1/rtt/scripting/ProgramService.hpp:43, from /local/robotpkg/var/tmp/robotpkg/middleware/orocos-rtt/work/orocos-rtt-2.8.1/rtt/scripting/ProgramService.cpp:40: /usr/include/boost/fusion/functional/adapter/unfused.hpp:158:9: note: candidate: template constexpr typename boost::result_of::type(boost::fusion::vector&)>::type boost::fusion::unfused::operator()(T0&, T1&, T2&, T3&) const [with T0 = T0; T1 = T1; T2 = T2; T3 = T3; Function = boost::_bi::bind_t)>, boost::fusion::cons, boost::fusion::nil_> >, boost::_bi::list2)> > >, boost::arg<1> > >] operator()(BOOST_PP_ENUM_BINARY_PARAMS(N,T,& a)) const ^~~~~~~~ /usr/include/boost/fusion/functional/adapter/unfused.hpp:158:9: note: template argument deduction/substitution failed: In file included from /usr/include/boost/function/detail/maybe_include.hpp:18:0, from /usr/include/boost/function/detail/function_iterate.hpp:14, from /usr/include/boost/preprocessor/iteration/detail/iter/forward1.hpp:52, from /usr/include/boost/function.hpp:64, from /local/robotpkg/var/tmp/robotpkg/middleware/orocos-rtt/work/orocos-rtt-2.8.1/rtt/scripting/../DataFlowInterface.hpp:48, from /local/robotpkg/var/tmp/robotpkg/middleware/orocos-rtt/work/orocos-rtt-2.8.1/rtt/scripting/../Service.hpp:44, from /local/robotpkg/var/tmp/robotpkg/middleware/orocos-rtt/work/orocos-rtt-2.8.1/rtt/scripting/ProgramService.hpp:43, from /local/robotpkg/var/tmp/robotpkg/middleware/orocos-rtt/work/orocos-rtt-2.8.1/rtt/scripting/ProgramService.cpp:40: /usr/include/boost/function/function_template.hpp:138:22: note: candidate expects 4 arguments, 1 provided return (*f)(BOOST_FUNCTION_ARGS); ~~~~^~~~~~~~~~~~~~~~~~~~~ In file included from /usr/include/boost/preprocessor/iteration/detail/iter/forward1.hpp:62:0, from /usr/include/boost/fusion/functional/adapter/unfused.hpp:97, from /usr/include/boost/fusion/functional/generation/make_unfused.hpp:13, from /local/robotpkg/var/tmp/robotpkg/middleware/orocos-rtt/work/orocos-rtt-2.8.1/rtt/scripting/../internal/OperationInterfacePartFused.hpp:53, from /local/robotpkg/var/tmp/robotpkg/middleware/orocos-rtt/work/orocos-rtt-2.8.1/rtt/scripting/../Service.hpp:45, from /local/robotpkg/var/tmp/robotpkg/middleware/orocos-rtt/work/orocos-rtt-2.8.1/rtt/scripting/ProgramService.hpp:43, from /local/robotpkg/var/tmp/robotpkg/middleware/orocos-rtt/work/orocos-rtt-2.8.1/rtt/scripting/ProgramService.cpp:40: /usr/include/boost/fusion/functional/adapter/unfused.hpp:170:9: note: candidate: template constexpr typename boost::result_of::type(boost::fusion::vector&)>::type boost::fusion::unfused::operator()(T0&, T1&, T2&) [with T0 = T0; T1 = T1; T2 = T2; Function = boost::_bi::bind_t)>, boost::fusion::cons, boost::fusion::nil_> >, boost::_bi::list2)> > >, boost::arg<1> > >] operator()(BOOST_PP_ENUM_BINARY_PARAMS(N,T,& a)) ^~~~~~~~ /usr/include/boost/fusion/functional/adapter/unfused.hpp:170:9: note: template argument deduction/substitution failed: In file included from /usr/include/boost/function/detail/maybe_include.hpp:18:0, from /usr/include/boost/function/detail/function_iterate.hpp:14, from /usr/include/boost/preprocessor/iteration/detail/iter/forward1.hpp:52, from /usr/include/boost/function.hpp:64, from /local/robotpkg/var/tmp/robotpkg/middleware/orocos-rtt/work/orocos-rtt-2.8.1/rtt/scripting/../DataFlowInterface.hpp:48, from /local/robotpkg/var/tmp/robotpkg/middleware/orocos-rtt/work/orocos-rtt-2.8.1/rtt/scripting/../Service.hpp:44, from /local/robotpkg/var/tmp/robotpkg/middleware/orocos-rtt/work/orocos-rtt-2.8.1/rtt/scripting/ProgramService.hpp:43, from /local/robotpkg/var/tmp/robotpkg/middleware/orocos-rtt/work/orocos-rtt-2.8.1/rtt/scripting/ProgramService.cpp:40: /usr/include/boost/function/function_template.hpp:138:22: note: candidate expects 3 arguments, 1 provided return (*f)(BOOST_FUNCTION_ARGS); ~~~~^~~~~~~~~~~~~~~~~~~~~ In file included from /usr/include/boost/preprocessor/iteration/detail/iter/forward1.hpp:62:0, from /usr/include/boost/fusion/functional/adapter/unfused.hpp:97, from /usr/include/boost/fusion/functional/generation/make_unfused.hpp:13, from /local/robotpkg/var/tmp/robotpkg/middleware/orocos-rtt/work/orocos-rtt-2.8.1/rtt/scripting/../internal/OperationInterfacePartFused.hpp:53, from /local/robotpkg/var/tmp/robotpkg/middleware/orocos-rtt/work/orocos-rtt-2.8.1/rtt/scripting/../Service.hpp:45, from /local/robotpkg/var/tmp/robotpkg/middleware/orocos-rtt/work/orocos-rtt-2.8.1/rtt/scripting/ProgramService.hpp:43, from /local/robotpkg/var/tmp/robotpkg/middleware/orocos-rtt/work/orocos-rtt-2.8.1/rtt/scripting/ProgramService.cpp:40: /usr/include/boost/fusion/functional/adapter/unfused.hpp:158:9: note: candidate: template constexpr typename boost::result_of::type(boost::fusion::vector&)>::type boost::fusion::unfused::operator()(T0&, T1&, T2&) const [with T0 = T0; T1 = T1; T2 = T2; Function = boost::_bi::bind_t)>, boost::fusion::cons, boost::fusion::nil_> >, boost::_bi::list2)> > >, boost::arg<1> > >] operator()(BOOST_PP_ENUM_BINARY_PARAMS(N,T,& a)) const ^~~~~~~~ /usr/include/boost/fusion/functional/adapter/unfused.hpp:158:9: note: template argument deduction/substitution failed: In file included from /usr/include/boost/function/detail/maybe_include.hpp:18:0, from /usr/include/boost/function/detail/function_iterate.hpp:14, from /usr/include/boost/preprocessor/iteration/detail/iter/forward1.hpp:52, from /usr/include/boost/function.hpp:64, from /local/robotpkg/var/tmp/robotpkg/middleware/orocos-rtt/work/orocos-rtt-2.8.1/rtt/scripting/../DataFlowInterface.hpp:48, from /local/robotpkg/var/tmp/robotpkg/middleware/orocos-rtt/work/orocos-rtt-2.8.1/rtt/scripting/../Service.hpp:44, from /local/robotpkg/var/tmp/robotpkg/middleware/orocos-rtt/work/orocos-rtt-2.8.1/rtt/scripting/ProgramService.hpp:43, from /local/robotpkg/var/tmp/robotpkg/middleware/orocos-rtt/work/orocos-rtt-2.8.1/rtt/scripting/ProgramService.cpp:40: /usr/include/boost/function/function_template.hpp:138:22: note: candidate expects 3 arguments, 1 provided return (*f)(BOOST_FUNCTION_ARGS); ~~~~^~~~~~~~~~~~~~~~~~~~~ In file included from /usr/include/boost/preprocessor/iteration/detail/iter/forward1.hpp:57:0, from /usr/include/boost/fusion/functional/adapter/unfused.hpp:97, from /usr/include/boost/fusion/functional/generation/make_unfused.hpp:13, from /local/robotpkg/var/tmp/robotpkg/middleware/orocos-rtt/work/orocos-rtt-2.8.1/rtt/scripting/../internal/OperationInterfacePartFused.hpp:53, from /local/robotpkg/var/tmp/robotpkg/middleware/orocos-rtt/work/orocos-rtt-2.8.1/rtt/scripting/../Service.hpp:45, from /local/robotpkg/var/tmp/robotpkg/middleware/orocos-rtt/work/orocos-rtt-2.8.1/rtt/scripting/ProgramService.hpp:43, from /local/robotpkg/var/tmp/robotpkg/middleware/orocos-rtt/work/orocos-rtt-2.8.1/rtt/scripting/ProgramService.cpp:40: /usr/include/boost/fusion/functional/adapter/unfused.hpp:170:9: note: candidate: template constexpr typename boost::result_of::type(boost::fusion::vector&)>::type boost::fusion::unfused::operator()(T0&, T1&) [with T0 = T0; T1 = T1; Function = boost::_bi::bind_t)>, boost::fusion::cons, boost::fusion::nil_> >, boost::_bi::list2)> > >, boost::arg<1> > >] operator()(BOOST_PP_ENUM_BINARY_PARAMS(N,T,& a)) ^~~~~~~~ /usr/include/boost/fusion/functional/adapter/unfused.hpp:170:9: note: template argument deduction/substitution failed: In file included from /usr/include/boost/function/detail/maybe_include.hpp:18:0, from /usr/include/boost/function/detail/function_iterate.hpp:14, from /usr/include/boost/preprocessor/iteration/detail/iter/forward1.hpp:52, from /usr/include/boost/function.hpp:64, from /local/robotpkg/var/tmp/robotpkg/middleware/orocos-rtt/work/orocos-rtt-2.8.1/rtt/scripting/../DataFlowInterface.hpp:48, from /local/robotpkg/var/tmp/robotpkg/middleware/orocos-rtt/work/orocos-rtt-2.8.1/rtt/scripting/../Service.hpp:44, from /local/robotpkg/var/tmp/robotpkg/middleware/orocos-rtt/work/orocos-rtt-2.8.1/rtt/scripting/ProgramService.hpp:43, from /local/robotpkg/var/tmp/robotpkg/middleware/orocos-rtt/work/orocos-rtt-2.8.1/rtt/scripting/ProgramService.cpp:40: /usr/include/boost/function/function_template.hpp:138:22: note: candidate expects 2 arguments, 1 provided return (*f)(BOOST_FUNCTION_ARGS); ~~~~^~~~~~~~~~~~~~~~~~~~~ In file included from /usr/include/boost/preprocessor/iteration/detail/iter/forward1.hpp:57:0, from /usr/include/boost/fusion/functional/adapter/unfused.hpp:97, from /usr/include/boost/fusion/functional/generation/make_unfused.hpp:13, from /local/robotpkg/var/tmp/robotpkg/middleware/orocos-rtt/work/orocos-rtt-2.8.1/rtt/scripting/../internal/OperationInterfacePartFused.hpp:53, from /local/robotpkg/var/tmp/robotpkg/middleware/orocos-rtt/work/orocos-rtt-2.8.1/rtt/scripting/../Service.hpp:45, from /local/robotpkg/var/tmp/robotpkg/middleware/orocos-rtt/work/orocos-rtt-2.8.1/rtt/scripting/ProgramService.hpp:43, from /local/robotpkg/var/tmp/robotpkg/middleware/orocos-rtt/work/orocos-rtt-2.8.1/rtt/scripting/ProgramService.cpp:40: /usr/include/boost/fusion/functional/adapter/unfused.hpp:158:9: note: candidate: template constexpr typename boost::result_of::type(boost::fusion::vector&)>::type boost::fusion::unfused::operator()(T0&, T1&) const [with T0 = T0; T1 = T1; Function = boost::_bi::bind_t)>, boost::fusion::cons, boost::fusion::nil_> >, boost::_bi::list2)> > >, boost::arg<1> > >] operator()(BOOST_PP_ENUM_BINARY_PARAMS(N,T,& a)) const ^~~~~~~~ /usr/include/boost/fusion/functional/adapter/unfused.hpp:158:9: note: template argument deduction/substitution failed: In file included from /usr/include/boost/function/detail/maybe_include.hpp:18:0, from /usr/include/boost/function/detail/function_iterate.hpp:14, from /usr/include/boost/preprocessor/iteration/detail/iter/forward1.hpp:52, from /usr/include/boost/function.hpp:64, from /local/robotpkg/var/tmp/robotpkg/middleware/orocos-rtt/work/orocos-rtt-2.8.1/rtt/scripting/../DataFlowInterface.hpp:48, from /local/robotpkg/var/tmp/robotpkg/middleware/orocos-rtt/work/orocos-rtt-2.8.1/rtt/scripting/../Service.hpp:44, from /local/robotpkg/var/tmp/robotpkg/middleware/orocos-rtt/work/orocos-rtt-2.8.1/rtt/scripting/ProgramService.hpp:43, from /local/robotpkg/var/tmp/robotpkg/middleware/orocos-rtt/work/orocos-rtt-2.8.1/rtt/scripting/ProgramService.cpp:40: /usr/include/boost/function/function_template.hpp:138:22: note: candidate expects 2 arguments, 1 provided return (*f)(BOOST_FUNCTION_ARGS); ~~~~^~~~~~~~~~~~~~~~~~~~~ In file included from /usr/include/boost/preprocessor/iteration/detail/iter/forward1.hpp:52:0, from /usr/include/boost/fusion/functional/adapter/unfused.hpp:97, from /usr/include/boost/fusion/functional/generation/make_unfused.hpp:13, from /local/robotpkg/var/tmp/robotpkg/middleware/orocos-rtt/work/orocos-rtt-2.8.1/rtt/scripting/../internal/OperationInterfacePartFused.hpp:53, from /local/robotpkg/var/tmp/robotpkg/middleware/orocos-rtt/work/orocos-rtt-2.8.1/rtt/scripting/../Service.hpp:45, from /local/robotpkg/var/tmp/robotpkg/middleware/orocos-rtt/work/orocos-rtt-2.8.1/rtt/scripting/ProgramService.hpp:43, from /local/robotpkg/var/tmp/robotpkg/middleware/orocos-rtt/work/orocos-rtt-2.8.1/rtt/scripting/ProgramService.cpp:40: /usr/include/boost/fusion/functional/adapter/unfused.hpp:170:9: note: candidate: constexpr typename boost::result_of::type(boost::fusion::vector&)>::type boost::fusion::unfused::operator()(T0&) [with T0 = boost::shared_ptr; Function = boost::_bi::bind_t)>, boost::fusion::cons, boost::fusion::nil_> >, boost::_bi::list2)> > >, boost::arg<1> > >; typename boost::result_of::type(boost::fusion::vector&)>::type = bool] operator()(BOOST_PP_ENUM_BINARY_PARAMS(N,T,& a)) ^~~~~~~~ /usr/include/boost/fusion/functional/adapter/unfused.hpp:170:9: note: conversion of argument 1 would be ill-formed: In file included from /usr/include/boost/function/detail/maybe_include.hpp:18:0, from /usr/include/boost/function/detail/function_iterate.hpp:14, from /usr/include/boost/preprocessor/iteration/detail/iter/forward1.hpp:52, from /usr/include/boost/function.hpp:64, from /local/robotpkg/var/tmp/robotpkg/middleware/orocos-rtt/work/orocos-rtt-2.8.1/rtt/scripting/../DataFlowInterface.hpp:48, from /local/robotpkg/var/tmp/robotpkg/middleware/orocos-rtt/work/orocos-rtt-2.8.1/rtt/scripting/../Service.hpp:44, from /local/robotpkg/var/tmp/robotpkg/middleware/orocos-rtt/work/orocos-rtt-2.8.1/rtt/scripting/ProgramService.hpp:43, from /local/robotpkg/var/tmp/robotpkg/middleware/orocos-rtt/work/orocos-rtt-2.8.1/rtt/scripting/ProgramService.cpp:40: /usr/include/boost/function/function_template.hpp:138:22: error: invalid initialization of non-const reference of type 'boost::shared_ptr&' from an rvalue of type 'boost::shared_ptr' return (*f)(BOOST_FUNCTION_ARGS); ~~~~^~~~~~~~~~~~~~~~~~~~~ In file included from /usr/include/boost/preprocessor/iteration/detail/iter/forward1.hpp:52:0, from /usr/include/boost/fusion/functional/adapter/unfused.hpp:97, from /usr/include/boost/fusion/functional/generation/make_unfused.hpp:13, from /local/robotpkg/var/tmp/robotpkg/middleware/orocos-rtt/work/orocos-rtt-2.8.1/rtt/scripting/../internal/OperationInterfacePartFused.hpp:53, from /local/robotpkg/var/tmp/robotpkg/middleware/orocos-rtt/work/orocos-rtt-2.8.1/rtt/scripting/../Service.hpp:45, from /local/robotpkg/var/tmp/robotpkg/middleware/orocos-rtt/work/orocos-rtt-2.8.1/rtt/scripting/ProgramService.hpp:43, from /local/robotpkg/var/tmp/robotpkg/middleware/orocos-rtt/work/orocos-rtt-2.8.1/rtt/scripting/ProgramService.cpp:40: /usr/include/boost/fusion/functional/adapter/unfused.hpp:158:9: note: candidate: constexpr typename boost::result_of::type(boost::fusion::vector&)>::type boost::fusion::unfused::operator()(T0&) const [with T0 = boost::shared_ptr; Function = boost::_bi::bind_t)>, boost::fusion::cons, boost::fusion::nil_> >, boost::_bi::list2)> > >, boost::arg<1> > >; typename boost::result_of::type(boost::fusion::vector&)>::type = bool] operator()(BOOST_PP_ENUM_BINARY_PARAMS(N,T,& a)) const ^~~~~~~~ /usr/include/boost/fusion/functional/adapter/unfused.hpp:158:9: note: conversion of argument 1 would be ill-formed: In file included from /usr/include/boost/function/detail/maybe_include.hpp:18:0, from /usr/include/boost/function/detail/function_iterate.hpp:14, from /usr/include/boost/preprocessor/iteration/detail/iter/forward1.hpp:52, from /usr/include/boost/function.hpp:64, from /local/robotpkg/var/tmp/robotpkg/middleware/orocos-rtt/work/orocos-rtt-2.8.1/rtt/scripting/../DataFlowInterface.hpp:48, from /local/robotpkg/var/tmp/robotpkg/middleware/orocos-rtt/work/orocos-rtt-2.8.1/rtt/scripting/../Service.hpp:44, from /local/robotpkg/var/tmp/robotpkg/middleware/orocos-rtt/work/orocos-rtt-2.8.1/rtt/scripting/ProgramService.hpp:43, from /local/robotpkg/var/tmp/robotpkg/middleware/orocos-rtt/work/orocos-rtt-2.8.1/rtt/scripting/ProgramService.cpp:40: /usr/include/boost/function/function_template.hpp:138:22: error: invalid initialization of non-const reference of type 'boost::shared_ptr&' from an rvalue of type 'boost::shared_ptr' return (*f)(BOOST_FUNCTION_ARGS); ~~~~^~~~~~~~~~~~~~~~~~~~~ make[2]: *** [rtt/scripting/CMakeFiles/rtt-scripting-gnulinux_plugin.dir/ProgramService.cpp.o] Error 1 rtt/scripting/CMakeFiles/rtt-scripting-gnulinux_plugin.dir/build.make:737: recipe for target 'rtt/scripting/CMakeFiles/rtt-scripting-gnulinux_plugin.dir/ProgramService.cpp.o' failed make[2]: *** Waiting for unfinished jobs.... make[2]: Leaving directory '/local/robotpkg/var/tmp/robotpkg/middleware/orocos-rtt/work/orocos-rtt-2.8.1' CMakeFiles/Makefile2:786: recipe for target 'rtt/scripting/CMakeFiles/rtt-scripting-gnulinux_plugin.dir/all' failed make[1]: Leaving directory '/local/robotpkg/var/tmp/robotpkg/middleware/orocos-rtt/work/orocos-rtt-2.8.1' Makefile:132: recipe for target 'all' failed make[1]: *** [rtt/scripting/CMakeFiles/rtt-scripting-gnulinux_plugin.dir/all] Error 2 make: *** [all] Error 2