robotpkg/middleware/ace bulk build results

Log for ace-6.0.4r2 on Ubuntu-17.10-x86_64: bulk.log (Back)

=> Checking for clear installation ===> Installing bootstrap dependencies for ace-6.0.4r2 => Installing digest-20080510.tgz => Installing tnftp-20130505~ssl.tgz ===> Checking bootstrap dependencies for ace-6.0.4r2 => Required robotpkg package digest>=20080510: digest-20080510 found => Required robotpkg package tnftp>=20091122: tnftp-20130505~ssl found => Required system package gnupg>=1: gnupg-2.1.15 found => Required system package gzip: gzip-1.6 found => Required system package patch>=2.0: patch-2.7.5 found => Required system package pax and tar archivers: pax found => Required system package pkg_install>=20110805.7: pkg_install-20110805.7 found => Required system package pkgrepo2deb>=1.2.1: pkgrepo2deb-1.2.1 found ===> Done bootstrap-depends for ace-6.0.4r2 ===> Installing full dependencies for ace-6.0.4r2 => Dependency digest-20080510 already installed => Dependency tnftp-20130505~ssl already installed ===> Checking build options for ace-6.0.4r2 => Building with no option. ===> Checking alternatives for ace-6.0.4r2 => Use the GNU C++ compiler: c++-compiler provided by g++>=3 => Use the GNU C compiler: c-compiler provided by gcc>=3 ===> Checking dependencies for ace-6.0.4r2 => Required system package g++>=3: g++-7 found => Required system package gcc>=3: gcc-7 found => Required system package libstdc++: libstdc++ found => Required system package pkg-config>=0.22: pkg-config-0.29.1 found ===> Done depends for ace-6.0.4r2 ===> Extracting for ace-6.0.4r2 => SHA1 checksums OK => RMD160 checksums OK ===> Patching for ace-6.0.4r2 => Applying robotpkg patches for ace-6.0.4r2 ===> Configuring for ace-6.0.4r2 /bin/mkdir -p /local/robotpkg/var/tmp/robotpkg/middleware/ace/work/ACE_wrappers/build => Modifying GNU configure scripts to avoid --recheck configure: WARNING: Optimization configure support not fully implemented yet. configure: WARNING: The generated configuration appears to be unusable. Please verify that your system path and environment variables are correct. If they appear to be correct then please send the maintainer of this configure script ace-users@list.isis.vanderbilt.edu the *COMPRESSED* 'config.log' file, the generated ace/config.h file and the following information: ACE 'configure' Script Information ================================== RCS Id: configure.ac 93402 2011-02-17 18:43:39Z johnnyw ACE Version: 6.0.4 C++ Compiler: /usr/bin/g++ C++ Preprocessor: /usr/bin/g++ -E C++ Flags: -W -Wall -Wpointer-arith -pipe -O3 -DNDEBUG -pthread -pipe Preprocessor Flags: Linker: /usr/bin/ld -m elf_x86_64 Linker Flags: Libraries: -lrt -ldl System type information: Build: x86_64-unknown-linux-gnu Host: x86_64-unknown-linux-gnu In the meantime, please use the stock ACE build procedure detailed in the file 'ACE-INSTALL.html'. ===> Building for ace-6.0.4r2 In file included from ../../ace/OS_NS_Thread.h:32:0, from ../../ace/ACE.inl:6, from ../../ace/ACE.h:886, from ../../ace/ACE_crc32.cpp:3: ../../ace/os_include/os_sched.h:47:6: error: conflicting declaration 'typedef struct cpu_set_t cpu_set_t' } cpu_set_t; ^~~~~~~~~ In file included from /usr/include/sched.h:44:0, from /usr/include/pthread.h:23, from ../../ace/os_include/os_pthread.h:54, from ../../ace/OS_NS_Thread.h:31, from ../../ace/ACE.inl:6, from ../../ace/ACE.h:886, from ../../ace/ACE_crc32.cpp:3: /usr/include/x86_64-linux-gnu/bits/cpu-set.h:42:3: note: previous declaration as 'typedef struct cpu_set_t cpu_set_t' } cpu_set_t; ^~~~~~~~~ In file included from ../../ace/config-lite.h:24:0, from ../../ace/ACE.h:25, from ../../ace/ACE_crc32.cpp:3: ../../ace/OS_NS_sys_time.inl: In function 'ACE_Time_Value ACE_OS::gettimeofday()': ../../ace/OS_NS_sys_time.inl:64:34: error: too few arguments to function 'int gettimeofday(timeval*, __timezone_ptr_t)' ACE_OSCALL (::gettimeofday (&tv), int, -1, result); ^ ../../ace/config-macros.h:297:22: note: in definition of macro 'ACE_OSCALL' RESULT = (TYPE) (X); ^ In file included from ../../ace/os_include/sys/os_time.h:30:0, from ../../ace/os_include/sys/os_resource.h:27, from ../../ace/os_include/sys/os_wait.h:28, from ../../ace/os_include/os_stdlib.h:28, from ../../ace/Basic_Types.h:59, from ../../ace/Sock_Connect.h:25, from ../../ace/ACE.h:36, from ../../ace/ACE_crc32.cpp:3: /usr/include/x86_64-linux-gnu/sys/time.h:68:12: note: declared here extern int gettimeofday (struct timeval *__restrict __tv, ^~~~~~~~~~~~ In file included from ../../ace/OS_NS_Thread.h:32:0, from ../../ace/ACE.inl:6, from ../../ace/ACE.h:886, from ../../ace/ACE_crc_ccitt.cpp:3: ../../ace/os_include/os_sched.h:47:6: error: conflicting declaration 'typedef struct cpu_set_t cpu_set_t' } cpu_set_t; ^~~~~~~~~ In file included from /usr/include/sched.h:44:0, from /usr/include/pthread.h:23, from ../../ace/os_include/os_pthread.h:54, from ../../ace/OS_NS_Thread.h:31, from ../../ace/ACE.inl:6, from ../../ace/ACE.h:886, from ../../ace/ACE_crc_ccitt.cpp:3: /usr/include/x86_64-linux-gnu/bits/cpu-set.h:42:3: note: previous declaration as 'typedef struct cpu_set_t cpu_set_t' } cpu_set_t; ^~~~~~~~~ make[3]: *** [libACE_la-ACE_crc32.lo] Error 1 make[3]: *** Waiting for unfinished jobs.... In file included from ../../ace/config-lite.h:24:0, from ../../ace/ACE.h:25, from ../../ace/ACE_crc_ccitt.cpp:3: ../../ace/OS_NS_sys_time.inl: In function 'ACE_Time_Value ACE_OS::gettimeofday()': ../../ace/OS_NS_sys_time.inl:64:34: error: too few arguments to function 'int gettimeofday(timeval*, __timezone_ptr_t)' ACE_OSCALL (::gettimeofday (&tv), int, -1, result); ^ ../../ace/config-macros.h:297:22: note: in definition of macro 'ACE_OSCALL' RESULT = (TYPE) (X); ^ In file included from ../../ace/os_include/sys/os_time.h:30:0, from ../../ace/os_include/sys/os_resource.h:27, from ../../ace/os_include/sys/os_wait.h:28, from ../../ace/os_include/os_stdlib.h:28, from ../../ace/Basic_Types.h:59, from ../../ace/Sock_Connect.h:25, from ../../ace/ACE.h:36, from ../../ace/ACE_crc_ccitt.cpp:3: /usr/include/x86_64-linux-gnu/sys/time.h:68:12: note: declared here extern int gettimeofday (struct timeval *__restrict __tv, ^~~~~~~~~~~~ make[3]: *** [libACE_la-ACE_crc_ccitt.lo] Error 1 In file included from ../../ace/OS_NS_Thread.h:32:0, from ../../ace/ACE.inl:6, from ../../ace/ACE.h:886, from ../../ace/ACE.cpp:3: ../../ace/os_include/os_sched.h:47:6: error: conflicting declaration 'typedef struct cpu_set_t cpu_set_t' } cpu_set_t; ^~~~~~~~~ In file included from /usr/include/sched.h:44:0, from /usr/include/pthread.h:23, from ../../ace/os_include/os_pthread.h:54, from ../../ace/OS_NS_Thread.h:31, from ../../ace/ACE.inl:6, from ../../ace/ACE.h:886, from ../../ace/ACE.cpp:3: /usr/include/x86_64-linux-gnu/bits/cpu-set.h:42:3: note: previous declaration as 'typedef struct cpu_set_t cpu_set_t' } cpu_set_t; ^~~~~~~~~ In file included from ../../ace/config-lite.h:24:0, from ../../ace/ACE.h:25, from ../../ace/ACE.cpp:3: ../../ace/OS_NS_sys_time.inl: In function 'ACE_Time_Value ACE_OS::gettimeofday()': ../../ace/OS_NS_sys_time.inl:64:34: error: too few arguments to function 'int gettimeofday(timeval*, __timezone_ptr_t)' ACE_OSCALL (::gettimeofday (&tv), int, -1, result); ^ ../../ace/config-macros.h:297:22: note: in definition of macro 'ACE_OSCALL' RESULT = (TYPE) (X); ^ In file included from ../../ace/os_include/sys/os_time.h:30:0, from ../../ace/os_include/sys/os_resource.h:27, from ../../ace/os_include/sys/os_wait.h:28, from ../../ace/os_include/os_stdlib.h:28, from ../../ace/Basic_Types.h:59, from ../../ace/Sock_Connect.h:25, from ../../ace/ACE.h:36, from ../../ace/ACE.cpp:3: /usr/include/x86_64-linux-gnu/sys/time.h:68:12: note: declared here extern int gettimeofday (struct timeval *__restrict __tv, ^~~~~~~~~~~~ ../../ace/ACE.cpp: In function 'pid_t ACE::fork(const ACE_TCHAR*, int)': ../../ace/ACE.cpp:2763:29: warning: this statement may fall through [-Wimplicit-fallthrough=] ACE_OS::_exit (errno); ~~~~~~~~~~~~~~^~~~~~~ ../../ace/ACE.cpp:2764:13: note: here default: // child terminates, orphaning grandchild ^~~~~~~ make[3]: *** [libACE_la-ACE.lo] Error 1 make[2]: *** [all-recursive] Error 1 make[1]: *** [all] Error 2 make: *** [all-recursive] Error 1 An unexpected error occured. The last 10 log lines are shown below. | make[3]: Leaving directory '/local/robotpkg/var/tmp/robotpkg/middleware/ace/work/ACE_wrappers/build/ace' | make[3]: *** [libACE_la-ACE.lo] Error 1 | Makefile:5125: recipe for target 'all-recursive' failed | make[2]: Leaving directory '/local/robotpkg/var/tmp/robotpkg/middleware/ace/work/ACE_wrappers/build/ace' | make[2]: *** [all-recursive] Error 1 /local/robotpkg/var/lib/robotpkg/mk/build/build.mk:196: recipe for target 'do-build' failed | Makefile:2439: recipe for target 'all' failed /local/robotpkg/var/lib/robotpkg/mk/pkg/package.mk:42: recipe for target 'pkg-check-installed' failed | make[1]: Leaving directory '/local/robotpkg/var/tmp/robotpkg/middleware/ace/work/ACE_wrappers/build/ace' => Marking ace-6.0.4r2 as broken | Makefile:360: recipe for target 'all-recursive' failed | make[1]: *** [all] Error 2 | make: *** [all-recursive] Error 1 For details or bug reports, check the complete log file in: /local/robotpkg/var/tmp/robotpkg/middleware/ace/work/build.log make[3]: *** [do-build] Error 2 make[2]: *** [pkg-check-installed] Error 2 ERROR: make: *** [package] Error 2 ===> Deinstalling for ace Removed digest-20080510 Removed tnftp-20130505~ssl