robotpkg/middleware/ace bulk build results

Log for ace-6.0.4r2 on Ubuntu-17.10-x86_64: build.log (Back)

--- Environment --- LOWER_ARCH=x86_64 OPSYS=Ubuntu GZIP_CMD=/bin/gzip _override_vars_pkgtools_pkg_install=PKGREQD PKGREQD PKGREQD LC_TIME=C OS_KERNEL_VERSION=4.13.0-25-generic PKGREPO2DEB=/local/robotpkg/sbin/pkgrepo2deb BULKBASE=/opt/openrobots ECHO_N=echo -n _overrides_pkgtools_pkg_install_PKGREQD=pkg_install>=20110805.7 pkg_install>=20110805.7 pkg_install>=20110805.7 OS_VERSION=17.10 ROBOTPKG_BASE=/local/robotpkg OLDPWD=/local/robotpkg/var/lib/robotpkg/audio/festival _override_vars_pkgtools_tnftp=PKGREQD PKGREQD PKG_DBDIR=/opt/openrobots/var/db/robotpkg hline="$bf======================================================================$rm" MACHINE_ARCH=x86_64 _overrides_pkgtools_tnftp_PKGREQD=tnftp>=20091122 tnftp>=20091122 FC=false LC_CTYPE=C EXPECT_TARGETS=fetch install package LC_MONETARY=C PATCH=/usr/bin/patch PKG_CONFIG=/usr/bin/pkg-config MAKEFLAGS= --no-print-directory -- PKGREQD.cmdline=ace-6.0.4r2 RECURSIVE_PKGPATH=middleware/ace\ tag=Ubuntu-17.10-x86_64 BULK_LOGDIR=/local/robotpkg/var/log/bulk BULKBASE=/opt/openrobots LOCALBASE=/opt/openrobots PKG_DBDIR=/opt/openrobots/var/db/robotpkg EXPECT_TARGETS=fetch\ install\ package _override_vars_pkgtools_digest=PKGREQD PKGREQD PKGREQD CPP=/usr/bin/gcc -E LOWER_OPSYS=ubuntu bf= _override_vars_pkgtools_pkgrepo2deb=PKGREQD PKGREQD _overrides_pkgtools_digest_PKGREQD=digest>=20080510 digest>=20080510 digest>=20080510 GCC=/usr/bin/gcc DIGEST=/opt/openrobots/sbin/robotpkg_digest TAR=/bin/tar LOWER_OS_VERSION=17.10 MACHINE_KERNEL=Linux-4.13.0-25-generic-x86_64 _overrides_pkgtools_pkgrepo2deb_PKGREQD=pkgrepo2deb>=1.2.1 pkgrepo2deb>=1.2.1 OWNER_GID=robots PKGTOOLS_VERSION=20110805.7 PKG_CONFIG_PATH= RECURSIVE_PKGPATH=middleware/ace GXX=/usr/bin/g++ MAKECONF=/opt/robotpkg/etc/robotpkg.conf _override_vars_archivers_pax=PKGREQD PKGREQD rm= LC_COLLATE=C OS_KERNEL=Linux ROBOTPKG_TRUSTED_ENV=robotpkg PATH=/usr/local/sbin:/usr/local/bin:/usr/sbin:/usr/bin:/sbin:/bin _overrides_archivers_pax_PKGREQD=pax pax CXXCPP=/usr/bin/g++ -E MAKELEVEL=4 DEB_HOST_MULTIARCH=x86_64-linux-gnu MACHINE_PLATFORM=Ubuntu-17.10-x86_64 ROBOTPKG_DIR=/local/robotpkg/var/lib/robotpkg TNFTP=/opt/openrobots/sbin/tnftp LANG=C MAKEOVERRIDES=PKGREQD.cmdline=ace-6.0.4r2 RECURSIVE_PKGPATH=middleware/ace\ tag=Ubuntu-17.10-x86_64 BULK_LOGDIR=/local/robotpkg/var/log/bulk BULKBASE=/opt/openrobots LOCALBASE=/opt/openrobots PKG_DBDIR=/opt/openrobots/var/db/robotpkg EXPECT_TARGETS=fetch\ install\ package LC_MESSAGES=C tag=Ubuntu-17.10-x86_64 CXX=/usr/bin/g++ LOCALBASE=/opt/openrobots _override_vars_pkgtools_pkg_config=PKGREQD PKGREQD PKGREQD OWNER_UID=rbulk BULK_LOGDIR=/local/robotpkg/var/log/bulk ZCAT=/bin/zcat PAX=/bin/pax LOWER_OS_KERNEL=linux _overrides_pkgtools_pkg_config_PKGREQD=pkg-config>=0.22 pkg-config>=0.22 pkg-config>=0.22 GPG=/usr/bin/gpg --homedir=/opt/robotpkg/etc/gnupg PWD=/local/robotpkg/var/lib/robotpkg/middleware/ace _ROBOTPKG_NOW=0119141643 _override_vars_middleware_ace=PKGREQD LC_NUMERIC=C CC=/usr/bin/gcc MFLAGS=--no-print-directory _overrides_middleware_ace_PKGREQD=ace-6.0.4r2 PKG_CONFIG_LIBDIR=/usr/lib/x86_64-linux-gnu/pkgconfig:/usr/lib/pkgconfig:/usr/share/pkgconfig NODENAME=fluffy64-ubuntu1710 --- Running set -e; \ cd /local/robotpkg/var/tmp/robotpkg/middleware/ace/work/ACE_wrappers && cd build && /usr/bin/env MAKELEVEL= MAKEOVERRIDES= MAKEFLAGS= MFLAGS= 'CPPFLAGS=' 'CFLAGS=-pipe -O3 -DNDEBUG' 'LDFLAGS=' 'CXXFLAGS=-pipe -O3 -DNDEBUG' PREFIX='/opt/openrobots' HOME=/local/robotpkg/var/tmp/robotpkg/middleware/ace/work PATH='/opt/openrobots/sbin:/usr/local/sbin:/usr/local/bin:/usr/sbin:/usr/bin:/sbin:/bin' LD_LIBRARY_PATH='' LOCALBASE=/opt/openrobots PKGMANDIR=man make -j4 -f Makefile all; Making all in ace make[1]: Entering directory '/local/robotpkg/var/tmp/robotpkg/middleware/ace/work/ACE_wrappers/build/ace' make all-recursive make[2]: Entering directory '/local/robotpkg/var/tmp/robotpkg/middleware/ace/work/ACE_wrappers/build/ace' Making all in . make[3]: Entering directory '/local/robotpkg/var/tmp/robotpkg/middleware/ace/work/ACE_wrappers/build/ace' /bin/sh ../libtool --tag=CXX --mode=compile /usr/bin/g++ -DHAVE_CONFIG_H -I../.. -I.. -DACE_BUILD_DLL -W -Wall -Wpointer-arith -pipe -O3 -DNDEBUG -pthread -pipe -I. -I.. -MT libACE_la-ACE.lo -MD -MP -MF .deps/libACE_la-ACE.Tpo -c -o libACE_la-ACE.lo `test -f 'ACE.cpp' || echo '../../ace/'`ACE.cpp /bin/sh ../libtool --tag=CXX --mode=compile /usr/bin/g++ -DHAVE_CONFIG_H -I../.. -I.. -DACE_BUILD_DLL -W -Wall -Wpointer-arith -pipe -O3 -DNDEBUG -pthread -pipe -I. -I.. -MT libACE_la-ACE_crc32.lo -MD -MP -MF .deps/libACE_la-ACE_crc32.Tpo -c -o libACE_la-ACE_crc32.lo `test -f 'ACE_crc32.cpp' || echo '../../ace/'`ACE_crc32.cpp /bin/sh ../libtool --tag=CXX --mode=compile /usr/bin/g++ -DHAVE_CONFIG_H -I../.. -I.. -DACE_BUILD_DLL -W -Wall -Wpointer-arith -pipe -O3 -DNDEBUG -pthread -pipe -I. -I.. -MT libACE_la-ACE_crc_ccitt.lo -MD -MP -MF .deps/libACE_la-ACE_crc_ccitt.Tpo -c -o libACE_la-ACE_crc_ccitt.lo `test -f 'ACE_crc_ccitt.cpp' || echo '../../ace/'`ACE_crc_ccitt.cpp /bin/sh ../libtool --tag=CXX --mode=compile /usr/bin/g++ -DHAVE_CONFIG_H -I../.. -I.. -DACE_BUILD_DLL -W -Wall -Wpointer-arith -pipe -O3 -DNDEBUG -pthread -pipe -I. -I.. -MT libACE_la-ATM_Acceptor.lo -MD -MP -MF .deps/libACE_la-ATM_Acceptor.Tpo -c -o libACE_la-ATM_Acceptor.lo `test -f 'ATM_Acceptor.cpp' || echo '../../ace/'`ATM_Acceptor.cpp libtool: compile: /usr/bin/g++ -DHAVE_CONFIG_H -I../.. -I.. -DACE_BUILD_DLL -W -Wall -Wpointer-arith -pipe -O3 -DNDEBUG -pthread -pipe -I. -I.. -MT libACE_la-ACE_crc_ccitt.lo -MD -MP -MF .deps/libACE_la-ACE_crc_ccitt.Tpo -c ../../ace/ACE_crc_ccitt.cpp -fPIC -DPIC -o .libs/libACE_la-ACE_crc_ccitt.o libtool: compile: /usr/bin/g++ -DHAVE_CONFIG_H -I../.. -I.. -DACE_BUILD_DLL -W -Wall -Wpointer-arith -pipe -O3 -DNDEBUG -pthread -pipe -I. -I.. -MT libACE_la-ACE_crc32.lo -MD -MP -MF .deps/libACE_la-ACE_crc32.Tpo -c ../../ace/ACE_crc32.cpp -fPIC -DPIC -o .libs/libACE_la-ACE_crc32.o libtool: compile: /usr/bin/g++ -DHAVE_CONFIG_H -I../.. -I.. -DACE_BUILD_DLL -W -Wall -Wpointer-arith -pipe -O3 -DNDEBUG -pthread -pipe -I. -I.. -MT libACE_la-ACE.lo -MD -MP -MF .deps/libACE_la-ACE.Tpo -c ../../ace/ACE.cpp -fPIC -DPIC -o .libs/libACE_la-ACE.o libtool: compile: /usr/bin/g++ -DHAVE_CONFIG_H -I../.. -I.. -DACE_BUILD_DLL -W -Wall -Wpointer-arith -pipe -O3 -DNDEBUG -pthread -pipe -I. -I.. -MT libACE_la-ATM_Acceptor.lo -MD -MP -MF .deps/libACE_la-ATM_Acceptor.Tpo -c ../../ace/ATM_Acceptor.cpp -fPIC -DPIC -o .libs/libACE_la-ATM_Acceptor.o mv -f .deps/libACE_la-ATM_Acceptor.Tpo .deps/libACE_la-ATM_Acceptor.Plo /bin/sh ../libtool --tag=CXX --mode=compile /usr/bin/g++ -DHAVE_CONFIG_H -I../.. -I.. -DACE_BUILD_DLL -W -Wall -Wpointer-arith -pipe -O3 -DNDEBUG -pthread -pipe -I. -I.. -MT libACE_la-ATM_Addr.lo -MD -MP -MF .deps/libACE_la-ATM_Addr.Tpo -c -o libACE_la-ATM_Addr.lo `test -f 'ATM_Addr.cpp' || echo '../../ace/'`ATM_Addr.cpp libtool: compile: /usr/bin/g++ -DHAVE_CONFIG_H -I../.. -I.. -DACE_BUILD_DLL -W -Wall -Wpointer-arith -pipe -O3 -DNDEBUG -pthread -pipe -I. -I.. -MT libACE_la-ATM_Addr.lo -MD -MP -MF .deps/libACE_la-ATM_Addr.Tpo -c ../../ace/ATM_Addr.cpp -fPIC -DPIC -o .libs/libACE_la-ATM_Addr.o mv -f .deps/libACE_la-ATM_Addr.Tpo .deps/libACE_la-ATM_Addr.Plo /bin/sh ../libtool --tag=CXX --mode=compile /usr/bin/g++ -DHAVE_CONFIG_H -I../.. -I.. -DACE_BUILD_DLL -W -Wall -Wpointer-arith -pipe -O3 -DNDEBUG -pthread -pipe -I. -I.. -MT libACE_la-ATM_Connector.lo -MD -MP -MF .deps/libACE_la-ATM_Connector.Tpo -c -o libACE_la-ATM_Connector.lo `test -f 'ATM_Connector.cpp' || echo '../../ace/'`ATM_Connector.cpp libtool: compile: /usr/bin/g++ -DHAVE_CONFIG_H -I../.. -I.. -DACE_BUILD_DLL -W -Wall -Wpointer-arith -pipe -O3 -DNDEBUG -pthread -pipe -I. -I.. -MT libACE_la-ATM_Connector.lo -MD -MP -MF .deps/libACE_la-ATM_Connector.Tpo -c ../../ace/ATM_Connector.cpp -fPIC -DPIC -o .libs/libACE_la-ATM_Connector.o mv -f .deps/libACE_la-ATM_Connector.Tpo .deps/libACE_la-ATM_Connector.Plo /bin/sh ../libtool --tag=CXX --mode=compile /usr/bin/g++ -DHAVE_CONFIG_H -I../.. -I.. -DACE_BUILD_DLL -W -Wall -Wpointer-arith -pipe -O3 -DNDEBUG -pthread -pipe -I. -I.. -MT libACE_la-ATM_Params.lo -MD -MP -MF .deps/libACE_la-ATM_Params.Tpo -c -o libACE_la-ATM_Params.lo `test -f 'ATM_Params.cpp' || echo '../../ace/'`ATM_Params.cpp libtool: compile: /usr/bin/g++ -DHAVE_CONFIG_H -I../.. -I.. -DACE_BUILD_DLL -W -Wall -Wpointer-arith -pipe -O3 -DNDEBUG -pthread -pipe -I. -I.. -MT libACE_la-ATM_Params.lo -MD -MP -MF .deps/libACE_la-ATM_Params.Tpo -c ../../ace/ATM_Params.cpp -fPIC -DPIC -o .libs/libACE_la-ATM_Params.o mv -f .deps/libACE_la-ATM_Params.Tpo .deps/libACE_la-ATM_Params.Plo /bin/sh ../libtool --tag=CXX --mode=compile /usr/bin/g++ -DHAVE_CONFIG_H -I../.. -I.. -DACE_BUILD_DLL -W -Wall -Wpointer-arith -pipe -O3 -DNDEBUG -pthread -pipe -I. -I.. -MT libACE_la-ATM_QoS.lo -MD -MP -MF .deps/libACE_la-ATM_QoS.Tpo -c -o libACE_la-ATM_QoS.lo `test -f 'ATM_QoS.cpp' || echo '../../ace/'`ATM_QoS.cpp libtool: compile: /usr/bin/g++ -DHAVE_CONFIG_H -I../.. -I.. -DACE_BUILD_DLL -W -Wall -Wpointer-arith -pipe -O3 -DNDEBUG -pthread -pipe -I. -I.. -MT libACE_la-ATM_QoS.lo -MD -MP -MF .deps/libACE_la-ATM_QoS.Tpo -c ../../ace/ATM_QoS.cpp -fPIC -DPIC -o .libs/libACE_la-ATM_QoS.o mv -f .deps/libACE_la-ATM_QoS.Tpo .deps/libACE_la-ATM_QoS.Plo /bin/sh ../libtool --tag=CXX --mode=compile /usr/bin/g++ -DHAVE_CONFIG_H -I../.. -I.. -DACE_BUILD_DLL -W -Wall -Wpointer-arith -pipe -O3 -DNDEBUG -pthread -pipe -I. -I.. -MT libACE_la-ATM_Stream.lo -MD -MP -MF .deps/libACE_la-ATM_Stream.Tpo -c -o libACE_la-ATM_Stream.lo `test -f 'ATM_Stream.cpp' || echo '../../ace/'`ATM_Stream.cpp In file included from ../../ace/OS_NS_Thread.h:32:0, from ../../ace/ACE.inl:6, from ../../ace/ACE.h:886, from ../../ace/ACE_crc32.cpp:3: ../../ace/os_include/os_sched.h:47:6: error: conflicting declaration 'typedef struct cpu_set_t cpu_set_t' } cpu_set_t; ^~~~~~~~~ In file included from /usr/include/sched.h:44:0, from /usr/include/pthread.h:23, from ../../ace/os_include/os_pthread.h:54, from ../../ace/OS_NS_Thread.h:31, from ../../ace/ACE.inl:6, from ../../ace/ACE.h:886, from ../../ace/ACE_crc32.cpp:3: /usr/include/x86_64-linux-gnu/bits/cpu-set.h:42:3: note: previous declaration as 'typedef struct cpu_set_t cpu_set_t' } cpu_set_t; ^~~~~~~~~ libtool: compile: /usr/bin/g++ -DHAVE_CONFIG_H -I../.. -I.. -DACE_BUILD_DLL -W -Wall -Wpointer-arith -pipe -O3 -DNDEBUG -pthread -pipe -I. -I.. -MT libACE_la-ATM_Stream.lo -MD -MP -MF .deps/libACE_la-ATM_Stream.Tpo -c ../../ace/ATM_Stream.cpp -fPIC -DPIC -o .libs/libACE_la-ATM_Stream.o In file included from ../../ace/config-lite.h:24:0, from ../../ace/ACE.h:25, from ../../ace/ACE_crc32.cpp:3: ../../ace/OS_NS_sys_time.inl: In function 'ACE_Time_Value ACE_OS::gettimeofday()': ../../ace/OS_NS_sys_time.inl:64:34: error: too few arguments to function 'int gettimeofday(timeval*, __timezone_ptr_t)' ACE_OSCALL (::gettimeofday (&tv), int, -1, result); ^ ../../ace/config-macros.h:297:22: note: in definition of macro 'ACE_OSCALL' RESULT = (TYPE) (X); ^ In file included from ../../ace/os_include/sys/os_time.h:30:0, from ../../ace/os_include/sys/os_resource.h:27, from ../../ace/os_include/sys/os_wait.h:28, from ../../ace/os_include/os_stdlib.h:28, from ../../ace/Basic_Types.h:59, from ../../ace/Sock_Connect.h:25, from ../../ace/ACE.h:36, from ../../ace/ACE_crc32.cpp:3: /usr/include/x86_64-linux-gnu/sys/time.h:68:12: note: declared here extern int gettimeofday (struct timeval *__restrict __tv, ^~~~~~~~~~~~ In file included from ../../ace/OS_NS_Thread.h:32:0, from ../../ace/ACE.inl:6, from ../../ace/ACE.h:886, from ../../ace/ACE_crc_ccitt.cpp:3: ../../ace/os_include/os_sched.h:47:6: error: conflicting declaration 'typedef struct cpu_set_t cpu_set_t' } cpu_set_t; ^~~~~~~~~ In file included from /usr/include/sched.h:44:0, from /usr/include/pthread.h:23, from ../../ace/os_include/os_pthread.h:54, from ../../ace/OS_NS_Thread.h:31, from ../../ace/ACE.inl:6, from ../../ace/ACE.h:886, from ../../ace/ACE_crc_ccitt.cpp:3: /usr/include/x86_64-linux-gnu/bits/cpu-set.h:42:3: note: previous declaration as 'typedef struct cpu_set_t cpu_set_t' } cpu_set_t; ^~~~~~~~~ Makefile:2914: recipe for target 'libACE_la-ACE_crc32.lo' failed make[3]: *** [libACE_la-ACE_crc32.lo] Error 1 make[3]: *** Waiting for unfinished jobs.... In file included from ../../ace/config-lite.h:24:0, from ../../ace/ACE.h:25, from ../../ace/ACE_crc_ccitt.cpp:3: ../../ace/OS_NS_sys_time.inl: In function 'ACE_Time_Value ACE_OS::gettimeofday()': ../../ace/OS_NS_sys_time.inl:64:34: error: too few arguments to function 'int gettimeofday(timeval*, __timezone_ptr_t)' ACE_OSCALL (::gettimeofday (&tv), int, -1, result); ^ ../../ace/config-macros.h:297:22: note: in definition of macro 'ACE_OSCALL' RESULT = (TYPE) (X); ^ In file included from ../../ace/os_include/sys/os_time.h:30:0, from ../../ace/os_include/sys/os_resource.h:27, from ../../ace/os_include/sys/os_wait.h:28, from ../../ace/os_include/os_stdlib.h:28, from ../../ace/Basic_Types.h:59, from ../../ace/Sock_Connect.h:25, from ../../ace/ACE.h:36, from ../../ace/ACE_crc_ccitt.cpp:3: /usr/include/x86_64-linux-gnu/sys/time.h:68:12: note: declared here extern int gettimeofday (struct timeval *__restrict __tv, ^~~~~~~~~~~~ mv -f .deps/libACE_la-ATM_Stream.Tpo .deps/libACE_la-ATM_Stream.Plo Makefile:2921: recipe for target 'libACE_la-ACE_crc_ccitt.lo' failed make[3]: *** [libACE_la-ACE_crc_ccitt.lo] Error 1 In file included from ../../ace/OS_NS_Thread.h:32:0, from ../../ace/ACE.inl:6, from ../../ace/ACE.h:886, from ../../ace/ACE.cpp:3: ../../ace/os_include/os_sched.h:47:6: error: conflicting declaration 'typedef struct cpu_set_t cpu_set_t' } cpu_set_t; ^~~~~~~~~ In file included from /usr/include/sched.h:44:0, from /usr/include/pthread.h:23, from ../../ace/os_include/os_pthread.h:54, from ../../ace/OS_NS_Thread.h:31, from ../../ace/ACE.inl:6, from ../../ace/ACE.h:886, from ../../ace/ACE.cpp:3: /usr/include/x86_64-linux-gnu/bits/cpu-set.h:42:3: note: previous declaration as 'typedef struct cpu_set_t cpu_set_t' } cpu_set_t; ^~~~~~~~~ In file included from ../../ace/config-lite.h:24:0, from ../../ace/ACE.h:25, from ../../ace/ACE.cpp:3: ../../ace/OS_NS_sys_time.inl: In function 'ACE_Time_Value ACE_OS::gettimeofday()': ../../ace/OS_NS_sys_time.inl:64:34: error: too few arguments to function 'int gettimeofday(timeval*, __timezone_ptr_t)' ACE_OSCALL (::gettimeofday (&tv), int, -1, result); ^ ../../ace/config-macros.h:297:22: note: in definition of macro 'ACE_OSCALL' RESULT = (TYPE) (X); ^ In file included from ../../ace/os_include/sys/os_time.h:30:0, from ../../ace/os_include/sys/os_resource.h:27, from ../../ace/os_include/sys/os_wait.h:28, from ../../ace/os_include/os_stdlib.h:28, from ../../ace/Basic_Types.h:59, from ../../ace/Sock_Connect.h:25, from ../../ace/ACE.h:36, from ../../ace/ACE.cpp:3: /usr/include/x86_64-linux-gnu/sys/time.h:68:12: note: declared here extern int gettimeofday (struct timeval *__restrict __tv, ^~~~~~~~~~~~ ../../ace/ACE.cpp: In function 'pid_t ACE::fork(const ACE_TCHAR*, int)': ../../ace/ACE.cpp:2763:29: warning: this statement may fall through [-Wimplicit-fallthrough=] ACE_OS::_exit (errno); ~~~~~~~~~~~~~~^~~~~~~ ../../ace/ACE.cpp:2764:13: note: here default: // child terminates, orphaning grandchild ^~~~~~~ Makefile:2907: recipe for target 'libACE_la-ACE.lo' failed make[3]: Leaving directory '/local/robotpkg/var/tmp/robotpkg/middleware/ace/work/ACE_wrappers/build/ace' make[3]: *** [libACE_la-ACE.lo] Error 1 Makefile:5125: recipe for target 'all-recursive' failed make[2]: Leaving directory '/local/robotpkg/var/tmp/robotpkg/middleware/ace/work/ACE_wrappers/build/ace' make[2]: *** [all-recursive] Error 1 Makefile:2439: recipe for target 'all' failed make[1]: Leaving directory '/local/robotpkg/var/tmp/robotpkg/middleware/ace/work/ACE_wrappers/build/ace' Makefile:360: recipe for target 'all-recursive' failed make[1]: *** [all] Error 2 make: *** [all-recursive] Error 1