robotpkg/image/viman-genom bulk build results

Log for viman-genom-1.6~openprs+tcl+tclserv_client on NetBSD-8.0-x86_64: bulk.log (Back)

=> Checking for clear installation ===> Installing bootstrap dependencies for viman-genom-1.6~openprs+tcl+tclserv_client => Installing /opt/robotpkg/var/lib/robotpkg/packages/bsd/NetBSD-8.0-x86_64/All/digest-20080510.tgz => Installing /opt/robotpkg/var/lib/robotpkg/packages/bsd/NetBSD-8.0-x86_64/All/tnftp-20130505~ssl.tgz ===> Checking bootstrap dependencies for viman-genom-1.6~openprs+tcl+tclserv_client => Required robotpkg package digest>=20080510: digest-20080510 found => Required robotpkg package tnftp>=20091122: tnftp-20130505~ssl found => Required system package gzip: gzip-20150113 found => Required system package patch>=2.0: patch-2.0128 found => Required system package pax and tar archivers: pax found => Required system package pkg_install>=20110805.9: pkg_install-20110805.9 found ===> Done bootstrap-depends for viman-genom-1.6~openprs+tcl+tclserv_client ===> Installing full dependencies for viman-genom-1.6~openprs+tcl+tclserv_client => Installing /opt/robotpkg/var/lib/robotpkg/packages/bsd/NetBSD-8.0-x86_64/All/artoolkitplus-2.1.1r4.tgz => Dependency digest-20080510 already installed => Installing /opt/robotpkg/var/lib/robotpkg/packages/bsd/NetBSD-8.0-x86_64/All/gbM-0.11~tcl.tgz => Installing /opt/robotpkg/var/lib/robotpkg/packages/bsd/NetBSD-8.0-x86_64/All/genBasic-genom-0.4r1~openprs+tcl+tclserv_client.tgz A genom editing mode is available for xemacs users in /opt/openrobots/share/genom. In order to use it, you should add the following lines to your (x)emacs startup file: (setq load-path (cons "/opt/openrobots/share/genom" load-path)) (autoload 'genom-mode "genom-mode" "Genom-mode" t) (setq auto-mode-alist (cons '("\.gen$" . genom-mode) auto-mode-alist)) => Installing /opt/robotpkg/var/lib/robotpkg/packages/bsd/NetBSD-8.0-x86_64/All/genManip-genom-0.9~openprs+tcl+tclserv_client.tgz => Dependency genom-2.12~doc already installed => Installing /opt/robotpkg/var/lib/robotpkg/packages/bsd/NetBSD-8.0-x86_64/All/libt3d-2.6~doc.tgz => Dependency libtclserv_client-0.5r1 already installed => Installing /opt/robotpkg/var/lib/robotpkg/packages/bsd/NetBSD-8.0-x86_64/All/mkdep-2.9.tgz => Installing /opt/robotpkg/var/lib/robotpkg/packages/bsd/NetBSD-8.0-x86_64/All/opencv2-2.4.13.6.tgz => Dependency pocolibs-3.0 already installed => Installing /opt/robotpkg/var/lib/robotpkg/packages/bsd/NetBSD-8.0-x86_64/All/pom-genom-0.7~openprs+tcl+tclserv_client.tgz => Dependency tclserv-2.8.2 already installed => Dependency tnftp-20130505~ssl already installed => Dependency transgen-1.1b1 already installed => Installing /opt/robotpkg/var/lib/robotpkg/packages/bsd/NetBSD-8.0-x86_64/All/viam-genom-1.10~display+openprs+tcl+tclserv_client.tgz => Dependency viam-libs-1.12r1~doc+opencv already installed ===> Checking build options for viman-genom-1.6~openprs+tcl+tclserv_client => Building with the following options: openprs Generate OpenPRS client code tcl Generate TCL client code tclserv_client Generate C tclServ client code ===> Checking alternatives for viman-genom-1.6~openprs+tcl+tclserv_client => Use the GNU C++ compiler: c++-compiler provided by g++>=3 => Use the GNU C compiler: c-compiler provided by gcc>=3 => Use opencv-2: opencv>=2.2.0 opencv<3 provided by opencv2>=2.2.0<3 => Use tcl-8.6: tcl>=8.4 provided by tcl86>=8.6<8.7 ===> Checking dependencies for viman-genom-1.6~openprs+tcl+tclserv_client => Required system package autoconf>=2.59: autoconf-2.69 found => Required system package g++>=3: g++-5.5.0 found => Required system package gcc>=3: gcc-5.5.0 found => Required system package GNU m4>=1.4: gm4-1.4.18 found => Required system package libjpeg: libjpeg found => Required system package libstdc++: libstdc++ found => Required system package libtool>=1.5.22: libtool-2.4.6 found => Required system package perl>=5: perl-5 found => Required system package pkg-config>=0.22: pkg-config-1.6.0 found => Required system package tcl86>=8.6<8.7: tcl86-8.6 found => Required robotpkg package artoolkitplus>=2.1.1: artoolkitplus-2.1.1r4 found => Required robotpkg package gbM>=0.9: gbM-0.11~tcl found => Required robotpkg package genBasic-genom>=0.1: genBasic-genom-0.4r1~openprs+tcl+tclserv_client found => Required robotpkg package genManip-genom>=0.9: genManip-genom-0.9~openprs+tcl+tclserv_client found => Required robotpkg package genom>=2.9: genom-2.12~doc found => Required robotpkg package libt3d>=2.6: libt3d-2.6~doc found => Required robotpkg package libtclserv_client>=0.3: libtclserv_client-0.5r1 found => Required robotpkg package mkdep>=2.6: mkdep-2.9 found => Required robotpkg package opencv2>=2.2.0<3: opencv2-2.4.13.6 found => Required robotpkg package pocolibs>=3.0: pocolibs-3.0 found => Required robotpkg package pom-genom>=0.5r1: pom-genom-0.7~openprs+tcl+tclserv_client found => Required robotpkg package tclserv>=2.7: tclserv-2.8.2 found => Required robotpkg package transgen>=1.1b0: transgen-1.1b1 found => Required robotpkg package viam-genom>=1.6: viam-genom-1.10~display+openprs+tcl+tclserv_client found => Required robotpkg package viam-libs>=1.12: viam-libs-1.12r1~doc+opencv found WARNING: Using opencv2-2.4.13.6 in /opt/openrobots WARNING: The following packages may interfere with the build because they WARNING: are located in paths used by other dependencies: WARNING: opencv2-3.4.6 in /usr/pkg ===> Done depends for viman-genom-1.6~openprs+tcl+tclserv_client ===> Extracting for viman-genom-1.6~openprs+tcl+tclserv_client => SHA1 checksums OK => RMD160 checksums OK tar: Global extended headers posix ustar archive. Extracting as plain files. Following files might be in the wrong directory or have wrong attributes. tar: ustar vol 1, 18 files, 204800 bytes read, 0 bytes written in 1 secs (204800 bytes/sec) ===> Patching for viman-genom-1.6~openprs+tcl+tclserv_client => Applying robotpkg patches for viman-genom-1.6~openprs+tcl+tclserv_client ===> Configuring for viman-genom-1.6~openprs+tcl+tclserv_client => Generating viman module genom vimanStruct.h:174: warning: type VimanImage unused /usr/pkg/bin/perl -w ./viman.pl configure.ac:34: warning: AC_LANG_CONFTEST: no AC_LANG_SOURCE call detected in body ../../lib/autoconf/lang.m4:193: AC_LANG_CONFTEST is expanded from... ../../lib/autoconf/general.m4:2661: _AC_LINK_IFELSE is expanded from... ../../lib/autoconf/general.m4:2678: AC_LINK_IFELSE is expanded from... libtool.m4:363: _LT_AC_SYS_LIBPATH_AIX is expanded from... libtool.m4:5563: AC_LIBTOOL_PROG_LD_SHLIBS is expanded from... libtool.m4:2786: _LT_AC_LANG_C_CONFIG is expanded from... libtool.m4:2785: AC_LIBTOOL_LANG_C_CONFIG is expanded from... libtool.m4:80: AC_LIBTOOL_SETUP is expanded from... libtool.m4:60: _AC_PROG_LIBTOOL is expanded from... libtool.m4:25: AC_PROG_LIBTOOL is expanded from... configure.ac:34: the top level configure.ac:34: warning: AC_LANG_CONFTEST: no AC_LANG_SOURCE call detected in body ../../lib/autoconf/lang.m4:193: AC_LANG_CONFTEST is expanded from... ../../lib/autoconf/general.m4:2661: _AC_LINK_IFELSE is expanded from... ../../lib/autoconf/general.m4:2678: AC_LINK_IFELSE is expanded from... libtool.m4:363: _LT_AC_SYS_LIBPATH_AIX is expanded from... libtool.m4:2867: _LT_AC_LANG_CXX_CONFIG is expanded from... libtool.m4:2866: AC_LIBTOOL_LANG_CXX_CONFIG is expanded from... libtool.m4:1911: _LT_AC_TAGCONFIG is expanded from... libtool.m4:80: AC_LIBTOOL_SETUP is expanded from... libtool.m4:60: _AC_PROG_LIBTOOL is expanded from... libtool.m4:25: AC_PROG_LIBTOOL is expanded from... configure.ac:34: the top level configure.ac:34: warning: AC_LANG_CONFTEST: no AC_LANG_SOURCE call detected in body ../../lib/autoconf/lang.m4:193: AC_LANG_CONFTEST is expanded from... ../../lib/autoconf/general.m4:2661: _AC_LINK_IFELSE is expanded from... ../../lib/autoconf/general.m4:2678: AC_LINK_IFELSE is expanded from... libtool.m4:363: _LT_AC_SYS_LIBPATH_AIX is expanded from... libtool.m4:5563: AC_LIBTOOL_PROG_LD_SHLIBS is expanded from... libtool.m4:4180: _LT_AC_LANG_GCJ_CONFIG is expanded from... libtool.m4:4179: AC_LIBTOOL_LANG_GCJ_CONFIG is expanded from... libtool.m4:1911: _LT_AC_TAGCONFIG is expanded from... libtool.m4:80: AC_LIBTOOL_SETUP is expanded from... libtool.m4:60: _AC_PROG_LIBTOOL is expanded from... libtool.m4:25: AC_PROG_LIBTOOL is expanded from... configure.ac:34: the top level Done. => Modifying GNU configure scripts to avoid --recheck ===> Building for viman-genom-1.6~openprs+tcl+tclserv_client make dependencies for vimanError.c... make dependencies for vimanEndian.c... make dependencies for vimanPrint.c... make dependencies for vimanPrintXML.c... make dependencies for vimanScan.c... make dependencies for vimanPosterLib.c... make dependencies for vimanMsgLib.c... make dependencies for vimanPosterShowLib.c... make dependencies for vimanPosterXMLLib.c... make dependencies for vimanPosterReadLib.c... make dependencies for vimanCntrlTask.c... make dependencies for vimanModuleInit.c... make dependencies for vimanMain.c... make dependencies for vimanPosterWriteLib.c... make dependencies for vimanConnectLib.c... make dependencies for vimanTest.c... make dependencies for vimanInit.c... make dependencies for tcl/vimanTcl.c... make dependencies for vimanPosterLib.c... make dependencies for vimanEndian.c... make dependencies for vimanError.c... make dependencies for openprs/vimanDecodeOpenprs.c... make dependencies for openprs/vimanEncodeOpenprs.c... make dependencies for openprs/vimanRequestsOpenprs.c... make dependencies for tclservClient/vimanError.c... make dependencies for tclservClient/vimanTclservClientEncode.c... make dependencies for tclservClient/vimanTclservClientDecode.c... make dependencies for tclservClient/vimanTclservClientMsgLib.c... vimanError.c: In function 'vimanRecordH2errMsgs': vimanError.c:17:5: warning: implicit declaration of function 'viamRecordH2errMsgs' [-Wimplicit-function-declaration] viamRecordH2errMsgs(); ^ vimanError.c:18:3: warning: implicit declaration of function 'genManipRecordH2errMsgs' [-Wimplicit-function-declaration] genManipRecordH2errMsgs(); ^ vimanError.c:19:3: warning: implicit declaration of function 'genBasicRecordH2errMsgs' [-Wimplicit-function-declaration] genBasicRecordH2errMsgs(); ^ ld: warning: libopencv_calib3d.so.2.4, needed by /opt/openrobots/lib/libviam.so, may conflict with libopencv_calib3d.so.3.4 ld: warning: libopencv_core.so.2.4, needed by /opt/openrobots/lib/libviam.so, may conflict with libopencv_core.so.3.4 ld: warning: libopencv_features2d.so.2.4, needed by /opt/openrobots/lib/libviam.so, may conflict with libopencv_features2d.so.3.4 ld: warning: libopencv_flann.so.2.4, needed by /opt/openrobots/lib/libviam.so, may conflict with libopencv_flann.so.3.4 ld: warning: libopencv_highgui.so.2.4, needed by /opt/openrobots/lib/libviam.so, may conflict with libopencv_highgui.so.3.4 ld: warning: libopencv_imgproc.so.2.4, needed by /opt/openrobots/lib/libviam.so, may conflict with libopencv_imgproc.so.3.4 ld: warning: libopencv_ml.so.2.4, needed by /opt/openrobots/lib/libviam.so, may conflict with libopencv_ml.so.3.4 ld: warning: libopencv_objdetect.so.2.4, needed by /opt/openrobots/lib/libviam.so, may conflict with libopencv_objdetect.so.3.4 ld: warning: libopencv_photo.so.2.4, needed by /opt/openrobots/lib/libviam.so, may conflict with libopencv_photo.so.3.4 ld: warning: libopencv_stitching.so.2.4, needed by /opt/openrobots/lib/libviam.so, may conflict with libopencv_stitching.so.3.4 ld: warning: libopencv_superres.so.2.4, needed by /opt/openrobots/lib/libviam.so, may conflict with libopencv_superres.so.3.4 ld: warning: libopencv_video.so.2.4, needed by /opt/openrobots/lib/libviam.so, may conflict with libopencv_video.so.3.4 ld: warning: libopencv_videostab.so.2.4, needed by /opt/openrobots/lib/libviam.so, may conflict with libopencv_videostab.so.3.4 ld: warning: libstdc++.so.7, needed by /usr/pkg/lib/libImath.so.24, may conflict with libstdc++.so.8 openprs/vimanRequestsOpenprs.c: In function 'init_viman_rqst_type_table': openprs/vimanRequestsOpenprs.c:120:16: warning: 'tclserv_client_abort' is deprecated [-Wdeprecated-declarations] (Encode_Func_Proto)pu_encode_genom_int, sizeof(int), tclserv_client_abort, ^ In file included from openprs/vimanRequestsOpenprs.c:69:0: /opt/openrobots/include/tclserv_client/tclserv_client.h:231:16: note: declared here DEPRECATED(int tclserv_client_abort(TCLSERV_CLIENT_ID id, ssize_t rqstId)); ^ /opt/openrobots/include/tclserv_client/tclserv_client.h:35:26: note: in definition of macro 'DEPRECATED' #define DEPRECATED(func) func __attribute__ ((deprecated)) ^ openprs/vimanRequestsOpenprs.c: In function 'init_viman_posters': openprs/vimanRequestsOpenprs.c:139:18: warning: cast from pointer to integer of different size [-Wpointer-to-int-cast] (int)&(((VIMAN_OBJECTPOSEEXPORTED_POSTER_STR *)x)->objectExported) - (int)((VIMAN_OBJECTPOSEEXPORTED_POSTER_STR *)x)); ^ openprs/vimanRequestsOpenprs.c:139:87: warning: cast from pointer to integer of different size [-Wpointer-to-int-cast] (int)&(((VIMAN_OBJECTPOSEEXPORTED_POSTER_STR *)x)->objectExported) - (int)((VIMAN_OBJECTPOSEEXPORTED_POSTER_STR *)x)); ^ openprs/vimanRequestsOpenprs.c:149:18: warning: cast from pointer to integer of different size [-Wpointer-to-int-cast] (int)&(((VIMAN_FILTEREDOBJECTPOSEEXPORTED_POSTER_STR *)x)->filteredobjectExported) - (int)((VIMAN_FILTEREDOBJECTPOSEEXPORTED_POSTER_STR *)x)); ^ openprs/vimanRequestsOpenprs.c:149:103: warning: cast from pointer to integer of different size [-Wpointer-to-int-cast] (int)&(((VIMAN_FILTEREDOBJECTPOSEEXPORTED_POSTER_STR *)x)->filteredobjectExported) - (int)((VIMAN_FILTEREDOBJECTPOSEEXPORTED_POSTER_STR *)x)); ^ openprs/vimanRequestsOpenprs.c:159:18: warning: cast from pointer to integer of different size [-Wpointer-to-int-cast] (int)&(((VIMAN_OBJECTPOSE_POSTER_STR *)x)->objectPublicArray) - (int)((VIMAN_OBJECTPOSE_POSTER_STR *)x)); ^ openprs/vimanRequestsOpenprs.c:159:82: warning: cast from pointer to integer of different size [-Wpointer-to-int-cast] (int)&(((VIMAN_OBJECTPOSE_POSTER_STR *)x)->objectPublicArray) - (int)((VIMAN_OBJECTPOSE_POSTER_STR *)x)); ^ openprs/vimanRequestsOpenprs.c:169:18: warning: cast from pointer to integer of different size [-Wpointer-to-int-cast] (int)&(((VIMAN_TIMEOFLASTTRACKEDIMAGE_POSTER_STR *)x)->time) - (int)((VIMAN_TIMEOFLASTTRACKEDIMAGE_POSTER_STR *)x)); ^ openprs/vimanRequestsOpenprs.c:169:81: warning: cast from pointer to integer of different size [-Wpointer-to-int-cast] (int)&(((VIMAN_TIMEOFLASTTRACKEDIMAGE_POSTER_STR *)x)->time) - (int)((VIMAN_TIMEOFLASTTRACKEDIMAGE_POSTER_STR *)x)); ^ tclservClient/vimanError.c: In function 'viman_decode_error': tclservClient/vimanError.c:48:8: warning: implicit declaration of function 'strcmp' [-Wimplicit-function-declaration] if (strcmp(vimanTclservClientErrMsgs[i].msg, str) == 0) { ^ tclservClient/vimanTclservClientDecode.c: In function 'scan_buf_struct_VIMAN_TIMEOFLASTTRACKEDIMAGE_POSTER_STR': tclservClient/vimanTclservClientDecode.c:14:9: warning: implicit declaration of function 'scan_buf_struct_VimanTime' [-Wimplicit-function-declaration] if (scan_buf_struct_VimanTime(buf, &(x+elt)->time, 0, NULL) != 0) ^ tclservClient/vimanTclservClientDecode.c: In function 'scan_buf_struct_VIMAN_OBJECTPOSE_POSTER_STR': tclservClient/vimanTclservClientDecode.c:24:9: warning: implicit declaration of function 'scan_buf_struct_VimanObjectPublicArray' [-Wimplicit-function-declaration] if (scan_buf_struct_VimanObjectPublicArray(buf, &(x+elt)->objectPublicArray, 0, NULL) != 0) ^ tclservClient/vimanTclservClientDecode.c: In function 'scan_buf_struct_VIMAN_FILTEREDOBJECTPOSEEXPORTED_POSTER_STR': tclservClient/vimanTclservClientDecode.c:34:9: warning: implicit declaration of function 'scan_buf_struct_GENMANIP_POSE_STR' [-Wimplicit-function-declaration] if (scan_buf_struct_GENMANIP_POSE_STR(buf, &(x+elt)->filteredobjectExported, 0, NULL) != 0) ^ tclservClient/vimanTclservClientDecode.c: In function 'scan_buf_struct_VIMAN_STR': tclservClient/vimanTclservClientDecode.c:54:9: warning: implicit declaration of function 'scan_buf_struct_VimanInitStr' [-Wimplicit-function-declaration] if (scan_buf_struct_VimanInitStr(buf, &(x+elt)->initStruct, 0, NULL) != 0) ^ tclservClient/vimanTclservClientDecode.c:56:9: warning: implicit declaration of function 'scan_buf_struct_VimanString' [-Wimplicit-function-declaration] if (scan_buf_struct_VimanString(buf, &(x+elt)->objectName, 0, NULL) != 0) ^ tclservClient/vimanTclservClientDecode.c:60:9: warning: implicit declaration of function 'scan_buf_enum_VimanBool' [-Wimplicit-function-declaration] if (scan_buf_enum_VimanBool(buf, &(x+elt)->vimanInitIsDone, 0, NULL) != 0) ^ tclservClient/vimanTclservClientDecode.c:70:9: warning: implicit declaration of function 'scan_buf_struct_VimanObjectPublic' [-Wimplicit-function-declaration] if (scan_buf_struct_VimanObjectPublic(buf, &(x+elt)->objectPublic, 0, NULL) != 0) ^ tclservClient/vimanTclservClientDecode.c:72:9: warning: implicit declaration of function 'scan_buf_struct_VimanObjectArray' [-Wimplicit-function-declaration] if (scan_buf_struct_VimanObjectArray(buf, &(x+elt)->objectArray, 0, NULL) != 0) ^ tclservClient/vimanTclservClientDecode.c:76:9: warning: implicit declaration of function 'scan_buf_struct_VimanThetaMat' [-Wimplicit-function-declaration] if (scan_buf_struct_VimanThetaMat(buf, &(x+elt)->thetaMat, 0, NULL) != 0) ^ tclservClient/vimanTclservClientDecode.c:84:9: warning: implicit declaration of function 'scan_buf_struct_VimanCorrectionVec' [-Wimplicit-function-declaration] if (scan_buf_struct_VimanCorrectionVec(buf, &(x+elt)->corImageFrame, 0, NULL) != 0) ^ tclservClient/vimanTclservClientDecode.c: In function 'scan_buf_struct_VimanInitStr': tclservClient/vimanTclservClientDecode.c:128:9: warning: implicit declaration of function 'scan_buf_enum_VimanInputStream' [-Wimplicit-function-declaration] if (scan_buf_enum_VimanInputStream(buf, &(x+elt)->inputStream, 0, NULL) != 0) ^ tclservClient/vimanTclservClientDecode.c: In function 'scan_buf_struct_VimanObjectArray': tclservClient/vimanTclservClientDecode.c:209:11: warning: implicit declaration of function 'scan_buf_struct_VimanObject' [-Wimplicit-function-declaration] if (scan_buf_struct_VimanObject(buf, (struct VimanObject *)(x+elt)->objects, 1, dims) != 0) ^ tclservClient/vimanTclservClientDecode.c: In function 'scan_buf_struct_VimanObjectPublic': tclservClient/vimanTclservClientDecode.c:234:9: warning: implicit declaration of function 'scan_buf_enum_VimanObjSymMotion' [-Wimplicit-function-declaration] if (scan_buf_enum_VimanObjSymMotion(buf, &(x+elt)->motion, 0, NULL) != 0) ^ tclservClient/vimanTclservClientDecode.c:238:9: warning: implicit declaration of function 'scan_buf_struct_VimanEuler' [-Wimplicit-function-declaration] if (scan_buf_struct_VimanEuler(buf, &(x+elt)->eulerRobot, 0, NULL) != 0) ^ tclservClient/vimanTclservClientDecode.c: In function 'scan_buf_struct_VimanObject': tclservClient/vimanTclservClientDecode.c:342:9: warning: implicit declaration of function 'scan_buf_struct_VimanMotionMat' [-Wimplicit-function-declaration] if (scan_buf_struct_VimanMotionMat(buf, &(x+elt)->motionMat, 0, NULL) != 0) ^ tclservClient/vimanTclservClientDecode.c:345:11: warning: implicit declaration of function 'scan_buf_struct_VimanPoint2D' [-Wimplicit-function-declaration] if (scan_buf_struct_VimanPoint2D(buf, (struct VimanPoint2D *)(x+elt)->cornersL, 2, dims) != 0) ^ In file included from tclservClient/vimanTclservClientMsgLib.c:43:0: /opt/openrobots/include/tclserv_client/tclserv_client.h:112:91: warning: 'struct timeval' declared inside parameter list int tclserv_client_timed_process_answer_msg(TCLSERV_CLIENT_ID id, ssize_t* rqstId, struct timeval* tv); ^ /opt/openrobots/include/tclserv_client/tclserv_client.h:112:91: warning: its scope is only this definition or declaration, which is probably not what you want vimanModuleInit.c: In function 'main': vimanModuleInit.c:433:2: warning: implicit declaration of function 'select' [-Wimplicit-function-declaration] select(64, NULL, NULL, NULL, NULL); ^ ld: warning: libopencv_calib3d.so.2.4, needed by /opt/openrobots/lib/libviam.so, may conflict with libopencv_calib3d.so.3.4 ld: warning: libopencv_core.so.2.4, needed by /opt/openrobots/lib/libviam.so, may conflict with libopencv_core.so.3.4 ld: warning: libopencv_features2d.so.2.4, needed by /opt/openrobots/lib/libviam.so, may conflict with libopencv_features2d.so.3.4 ld: warning: libopencv_flann.so.2.4, needed by /opt/openrobots/lib/libviam.so, may conflict with libopencv_flann.so.3.4 ld: warning: libopencv_highgui.so.2.4, needed by /opt/openrobots/lib/libviam.so, may conflict with libopencv_highgui.so.3.4 ld: warning: libopencv_imgproc.so.2.4, needed by /opt/openrobots/lib/libviam.so, may conflict with libopencv_imgproc.so.3.4 ld: warning: libopencv_ml.so.2.4, needed by /opt/openrobots/lib/libviam.so, may conflict with libopencv_ml.so.3.4 ld: warning: libopencv_objdetect.so.2.4, needed by /opt/openrobots/lib/libviam.so, may conflict with libopencv_objdetect.so.3.4 ld: warning: libopencv_photo.so.2.4, needed by /opt/openrobots/lib/libviam.so, may conflict with libopencv_photo.so.3.4 ld: warning: libopencv_stitching.so.2.4, needed by /opt/openrobots/lib/libviam.so, may conflict with libopencv_stitching.so.3.4 ld: warning: libopencv_superres.so.2.4, needed by /opt/openrobots/lib/libviam.so, may conflict with libopencv_superres.so.3.4 ld: warning: libopencv_video.so.2.4, needed by /opt/openrobots/lib/libviam.so, may conflict with libopencv_video.so.3.4 ld: warning: libopencv_videostab.so.2.4, needed by /opt/openrobots/lib/libviam.so, may conflict with libopencv_videostab.so.3.4 ld: warning: libstdc++.so.7, needed by /usr/pkg/lib/libImath.so.24, may conflict with libstdc++.so.8 make dependencies for vimanMainCodels.cc... make dependencies for vimanCntrlTaskCodels.cc... vimanMainCodels.cc: In function 'STATUS vimanMainPerm(int*)': vimanMainCodels.cc:266:30: error: 'CV_RGB' was not declared in this scope colors[0]= CV_RGB(255, 0, 0); ^ vimanMainCodels.cc: In function 'void vimanDrawBox(IplImage*, const CvMat*, const CvMat*, CvMat*, CvMat*, double)': vimanMainCodels.cc:2165:28: error: 'CV_RGB' was not declared in this scope color= CV_RGB(0, 255, 255); ^ vimanMainCodels.cc: In function 'void vimanDrawBox2(IplImage*, const CvMat*, const CvMat*, CvMat*, CvMat*, double, double, double)': vimanMainCodels.cc:2243:28: error: 'CV_RGB' was not declared in this scope color= CV_RGB(0, 255, 255); ^ vimanMainCodels.cc: In function 'void vimanDrawFrame(IplImage*, const CvMat*, const CvMat*, CvMat*, CvMat*, double)': vimanMainCodels.cc:2309:26: error: 'CV_RGB' was not declared in this scope color= CV_RGB(255, 0, 0); ^ In file included from /opt/openrobots/include/ARToolKitPlus/TrackerSingleMarkerImpl.h:48:0, from vimanMainCodels.cc:44: /opt/openrobots/include/ARToolKitPlus/TrackerImpl.h: In instantiation of 'const char* ARToolKitPlus::TrackerImpl<__PATTERN_SIZE_X, __PATTERN_SIZE_Y, __PATTERN_SAMPLE_NUM, __MAX_LOAD_PATTERNS, __MAX_IMAGE_PATTERNS>::getDescription() [with int __PATTERN_SIZE_X = 6; int __PATTERN_SIZE_Y = 6; int __PATTERN_SAMPLE_NUM = 6; int __MAX_LOAD_PATTERNS = 1; int __MAX_IMAGE_PATTERNS = 16]': vimanMainCodels.cc:3720:1: required from here /opt/openrobots/include/ARToolKitPlus/TrackerImpl.h:12745:90: warning: deprecated conversion from string constant to 'char*' [-Wwrite-strings] char* pixelformats[] = { "NONE", "ABGR", "BGRA", "BGR", "RGBA", "RGB", "RGB565", "LUM" }; ^ /opt/openrobots/include/ARToolKitPlus/TrackerImpl.h:12745:90: warning: deprecated conversion from string constant to 'char*' [-Wwrite-strings] /opt/openrobots/include/ARToolKitPlus/TrackerImpl.h:12745:90: warning: deprecated conversion from string constant to 'char*' [-Wwrite-strings] /opt/openrobots/include/ARToolKitPlus/TrackerImpl.h:12745:90: warning: deprecated conversion from string constant to 'char*' [-Wwrite-strings] /opt/openrobots/include/ARToolKitPlus/TrackerImpl.h:12745:90: warning: deprecated conversion from string constant to 'char*' [-Wwrite-strings] /opt/openrobots/include/ARToolKitPlus/TrackerImpl.h:12745:90: warning: deprecated conversion from string constant to 'char*' [-Wwrite-strings] /opt/openrobots/include/ARToolKitPlus/TrackerImpl.h:12745:90: warning: deprecated conversion from string constant to 'char*' [-Wwrite-strings] /opt/openrobots/include/ARToolKitPlus/TrackerImpl.h:12745:90: warning: deprecated conversion from string constant to 'char*' [-Wwrite-strings] gmake[2]: *** [../autoconf/codels.mk:47: posix-obj/vimanMainCodels.lo] Error 1 gmake[1]: *** [Makefile:70: all-posix] Error 2 gmake: *** [Makefile:37: all] Error 2 An unexpected error occured. The last 10 log lines are shown below. | /opt/openrobots/include/ARToolKitPlus/TrackerImpl.h:12745:90: warning: deprecated conversion from string constant to 'char*' [-Wwrite-strings] | /opt/openrobots/include/ARToolKitPlus/TrackerImpl.h:12745:90: warning: deprecated conversion from string constant to 'char*' [-Wwrite-strings] | /opt/openrobots/include/ARToolKitPlus/TrackerImpl.h:12745:90: warning: deprecated conversion from string constant to 'char*' [-Wwrite-strings] | /opt/openrobots/include/ARToolKitPlus/TrackerImpl.h:12745:90: warning: deprecated conversion from string constant to 'char*' [-Wwrite-strings] | /opt/openrobots/include/ARToolKitPlus/TrackerImpl.h:12745:90: warning: deprecated conversion from string constant to 'char*' [-Wwrite-strings] | gmake[2]: *** [../autoconf/codels.mk:47: posix-obj/vimanMainCodels.lo] Error 1 | gmake[2]: Leaving directory '/local/robotpkg/var/tmp/robotpkg/image/viman-genom/work/viman-genom-1.6/codels' | gmake[1]: Leaving directory '/local/robotpkg/var/tmp/robotpkg/image/viman-genom/work/viman-genom-1.6' | gmake[1]: *** [Makefile:70: all-posix] Error 2 | gmake: *** [Makefile:37: all] Error 2 For details or bug reports, check the complete log file in: /local/robotpkg/var/tmp/robotpkg/image/viman-genom/work/build.log gmake[3]: *** [/local/robotpkg/var/lib/robotpkg/mk/build/build.mk:199: do-build] Error 2 => Marking viman-genom-1.6~openprs+tcl+tclserv_client as broken gmake[2]: *** [/local/robotpkg/var/lib/robotpkg/mk/pkg/package.mk:42: pkg-check-installed] Error 2 ERROR: /usr/pkg/bin/gmake: *** [package] Error 2 ===> Deinstalling for viman-genom Removed artoolkitplus-2.1.1r4 Removed digest-20080510 Removing dependency genManip-genom-0.9~openprs+tcl+tclserv_client Removed gbM-0.11~tcl Removing dependency pocolibs-3.0 Removing dependency Removing dependency pom-genom-0.7~openprs+tcl+tclserv_client Removing dependency viam-genom-1.10~display+openprs+tcl+tclserv_client Removed genom-2.12~doc Removed mkdep-2.9 Removed tnftp-20130505~ssl