robotpkg/hardware/mccdaqft-genom3 bulk build results

Log for mccdaqft-genom3-1.0~codels+openprs+pocolibs-client-c+pocolibs-server on NetBSD-8.0-x86_64: bulk.log (Back)

=> Checking for clear installation ===> Installing bootstrap dependencies for mccdaqft-genom3-1.0~codels+openprs+pocolibs-client-c+pocolibs-server => Installing /opt/robotpkg/var/lib/robotpkg/packages/bsd/NetBSD-8.0-x86_64/All/digest-20080510.tgz => Installing /opt/robotpkg/var/lib/robotpkg/packages/bsd/NetBSD-8.0-x86_64/All/tnftp-20130505~ssl.tgz ===> Checking bootstrap dependencies for mccdaqft-genom3-1.0~codels+openprs+pocolibs-client-c+pocolibs-server => Required robotpkg package digest>=20080510: digest-20080510 found => Required robotpkg package tnftp>=20091122: tnftp-20130505~ssl found => Required system package gzip: gzip-20150113 found => Required system package pax and tar archivers: pax found => Required system package pkg_install>=20110805.9: pkg_install-20110805.9 found ===> Done bootstrap-depends for mccdaqft-genom3-1.0~codels+openprs+pocolibs-client-c+pocolibs-server ===> Installing full dependencies for mccdaqft-genom3-1.0~codels+openprs+pocolibs-client-c+pocolibs-server => Installing /opt/robotpkg/var/lib/robotpkg/packages/bsd/NetBSD-8.0-x86_64/All/daqflex-libs-1.0.tgz => Dependency digest-20080510 already installed => Installing /opt/robotpkg/var/lib/robotpkg/packages/bsd/NetBSD-8.0-x86_64/All/eigen3-3.2.4.tgz => Installing /opt/robotpkg/var/lib/robotpkg/packages/bsd/NetBSD-8.0-x86_64/All/genom3-2.99.31.tgz => Installing /opt/robotpkg/var/lib/robotpkg/packages/bsd/NetBSD-8.0-x86_64/All/genom3-openprs-1.0.9r5.tgz => Installing /opt/robotpkg/var/lib/robotpkg/packages/bsd/NetBSD-8.0-x86_64/All/genom3-pocolibs-1.12.tgz => Dependency openprs-1.1b10 already installed => Installing /opt/robotpkg/var/lib/robotpkg/packages/bsd/NetBSD-8.0-x86_64/All/openrobots2-idl-2.0.tgz => Dependency pocolibs-2.17 already installed => Dependency tnftp-20130505~ssl already installed => Dependency transgen3-1.0b5 already installed ===> Checking build options for mccdaqft-genom3-1.0~codels+openprs+pocolibs-client-c+pocolibs-server => Building with the following options: codels Build server codels openprs Build an OpenPRS client pocolibs-client-c Build a pocolibs C client pocolibs-server Build a pocolibs server ===> Checking alternatives for mccdaqft-genom3-1.0~codels+openprs+pocolibs-client-c+pocolibs-server => Use the GNU C++ compiler: c++-compiler provided by g++>=3 => Use the GNU C compiler: c-compiler provided by gcc>=3 ===> Checking dependencies for mccdaqft-genom3-1.0~codels+openprs+pocolibs-client-c+pocolibs-server => Required system package autoconf>=2.59: autoconf-2.69 found => Required system package automake>=1.8: automake-1.15.1 found => Required system package g++>=3: g++-5.5.0 found => Required system package gcc>=3: gcc-5.5.0 found => Required system package GNU m4>=1.4: gm4-1.4.18 found => Required system package libstdc++: libstdc++ found => Required system package libtool>=1.5.22: libtool-2.4.6 found => Required system package pkg-config>=0.22: pkg-config-1.4.1 found => Required robotpkg package daqflex-libs>=1.0: daqflex-libs-1.0 found => Required robotpkg package eigen3>=3.1: eigen3-3.2.4 found => Required robotpkg package genom3>=2.99.31: genom3-2.99.31 found => Required robotpkg package genom3-openprs>=1.0: genom3-openprs-1.0.9r5 found => Required robotpkg package genom3-pocolibs>=1.8: genom3-pocolibs-1.12 found => Required robotpkg package openprs>=1.1b7: openprs-1.1b10 found => Required robotpkg package openrobots2-idl>=2.0: openrobots2-idl-2.0 found => Required robotpkg package pocolibs>=2.17: pocolibs-2.17 found => Required robotpkg package transgen3>=1.0b2: transgen3-1.0b5 found ===> Done depends for mccdaqft-genom3-1.0~codels+openprs+pocolibs-client-c+pocolibs-server ===> Extracting for mccdaqft-genom3-1.0~codels+openprs+pocolibs-client-c+pocolibs-server => SHA1 checksums OK => RMD160 checksums OK tar: tar vol 1, 34 files, 1658880 bytes read, 0 bytes written in 1 secs (1658880 bytes/sec) ===> Configuring for mccdaqft-genom3-1.0~codels+openprs+pocolibs-client-c+pocolibs-server => Generating openprs/client => Running autoreconf for openprs/client autoreconf: Entering directory `.' autoreconf: configure.ac: not using Gettext autoreconf: running: /usr/pkg/bin/aclocal --force -I autoconf autoreconf: configure.ac: tracing autoreconf: running: /usr/pkg/bin/libtoolize --copy --force autoreconf: running: /usr/pkg/bin/autoconf --force autoreconf: running: /usr/pkg/bin/autoheader --force autoreconf: running: /usr/pkg/bin/automake --add-missing --copy --force-missing configure.ac:12: installing 'autoconf/compile' configure.ac:12: installing 'autoconf/config.guess' configure.ac:12: installing 'autoconf/config.sub' configure.ac:9: installing 'autoconf/install-sh' configure.ac:9: installing 'autoconf/missing' Makefile.am: installing 'autoconf/depcomp' autoreconf: Leaving directory `.' => Generating pocolibs/client/c => Running autoreconf for pocolibs/client/c autoreconf: Entering directory `.' autoreconf: configure.ac: not using Gettext autoreconf: running: /usr/pkg/bin/aclocal --force -I autoconf autoreconf: configure.ac: tracing autoreconf: running: /usr/pkg/bin/libtoolize --copy --force autoreconf: running: /usr/pkg/bin/autoconf --force autoreconf: running: /usr/pkg/bin/autoheader --force autoreconf: running: /usr/pkg/bin/automake --add-missing --copy --force-missing configure.ac:12: installing 'autoconf/compile' configure.ac:12: installing 'autoconf/config.guess' configure.ac:12: installing 'autoconf/config.sub' configure.ac:9: installing 'autoconf/install-sh' configure.ac:9: installing 'autoconf/missing' Makefile.am: installing 'autoconf/depcomp' autoreconf: Leaving directory `.' => Generating pocolibs/server => Running autoreconf for pocolibs/server autoreconf: Entering directory `.' autoreconf: configure.ac: not using Gettext autoreconf: running: /usr/pkg/bin/aclocal --force -I autoconf autoreconf: configure.ac: tracing autoreconf: running: /usr/pkg/bin/libtoolize --copy --force autoreconf: running: /usr/pkg/bin/autoconf --force autoreconf: running: /usr/pkg/bin/autoheader --force autoreconf: running: /usr/pkg/bin/automake --add-missing --copy --force-missing configure.ac:12: installing 'autoconf/compile' configure.ac:12: installing 'autoconf/config.guess' configure.ac:12: installing 'autoconf/config.sub' configure.ac:9: installing 'autoconf/install-sh' configure.ac:9: installing 'autoconf/missing' Makefile.am: installing 'autoconf/depcomp' autoreconf: Leaving directory `.' => Modifying GNU configure scripts to avoid --recheck ===> Building for mccdaqft-genom3-1.0~codels+openprs+pocolibs-client-c+pocolibs-server /local/robotpkg/var/tmp/robotpkg/hardware/mccdaqft-genom3/work/mccdaqft-genom3-1.0/codels/.libs/libmccdaqft_codels.so: undefined reference to `aio_write' /local/robotpkg/var/tmp/robotpkg/hardware/mccdaqft-genom3/work/mccdaqft-genom3-1.0/codels/.libs/libmccdaqft_codels.so: undefined reference to `aio_return' /local/robotpkg/var/tmp/robotpkg/hardware/mccdaqft-genom3/work/mccdaqft-genom3-1.0/codels/.libs/libmccdaqft_codels.so: undefined reference to `aio_error' gmake: *** [mccdaqft-pocolibs] Error 1 An unexpected error occured. The last 10 log lines are shown below. /local/robotpkg/var/lib/robotpkg/mk/build/build.mk:198: recipe for target 'do-build' failed /local/robotpkg/var/lib/robotpkg/mk/pkg/package.mk:42: recipe for target 'pkg-check-installed' failed | mv -f src/.deps/mccdaqft_pocolibs-mccdaqft_portlib.Tpo src/.deps/mccdaqft_pocolibs-mccdaqft_portlib.Po | mv -f src/.deps/mccdaqft_pocolibs-mccdaqft_read_exec_task.Tpo src/.deps/mccdaqft_pocolibs-mccdaqft_read_exec_task.Po => Marking mccdaqft-genom3-1.0~codels+openprs+pocolibs-client-c+pocolibs-server as broken | mv -f src/.deps/mccdaqft_pocolibs-mccdaqft_read_exec_codels.Tpo src/.deps/mccdaqft_pocolibs-mccdaqft_read_exec_codels.Po | /bin/sh ./libtool --tag=CC --mode=link /usr/bin/gcc -pthread -pipe -O3 -DNDEBUG -o mccdaqft-pocolibs src/mccdaqft_pocolibs-mccdaqft_main.o src/mccdaqft_pocolibs-mccdaqft_control_task.o src/mccdaqft_pocolibs-mccdaqft_control_codels.o src/mccdaqft_pocolibs-mccdaqft_msglib.o src/mccdaqft_pocolibs-mccdaqft_portlib.o src/mccdaqft_pocolibs-mccdaqft_remotelib.o src/mccdaqft_pocolibs-mccdaqft_activity.o src/mccdaqft_pocolibs-mccdaqft_exception.o src/mccdaqft_pocolibs-mccdaqft_read_exec_task.o src/mccdaqft_pocolibs-mccdaqft_read_exec_codels.o /local/robotpkg/var/tmp/robotpkg/hardware/mccdaqft-genom3/work/mccdaqft-genom3-1.0/codels/libmccdaqft_codels.la -Wl,-rpath,/opt/openrobots/lib -L/opt/openrobots/lib -ldaqflex -Wl,-rpath,/opt/openrobots/lib -L/opt/openrobots/lib -lposterLib -lcomLib -lportLib -lm | libtool: link: /usr/bin/gcc -pthread -pipe -O3 -DNDEBUG -o .libs/mccdaqft-pocolibs src/mccdaqft_pocolibs-mccdaqft_main.o src/mccdaqft_pocolibs-mccdaqft_control_task.o src/mccdaqft_pocolibs-mccdaqft_control_codels.o src/mccdaqft_pocolibs-mccdaqft_msglib.o src/mccdaqft_pocolibs-mccdaqft_portlib.o src/mccdaqft_pocolibs-mccdaqft_remotelib.o src/mccdaqft_pocolibs-mccdaqft_activity.o src/mccdaqft_pocolibs-mccdaqft_exception.o src/mccdaqft_pocolibs-mccdaqft_read_exec_task.o src/mccdaqft_pocolibs-mccdaqft_read_exec_codels.o -Wl,-rpath -Wl,/opt/openrobots/lib -Wl,-rpath -Wl,/opt/openrobots/lib /local/robotpkg/var/tmp/robotpkg/hardware/mccdaqft-genom3/work/mccdaqft-genom3-1.0/codels/.libs/libmccdaqft_codels.so -L/opt/openrobots/lib -L/usr/pkg/lib /opt/openrobots/lib/libdaqflex.so /usr/pkg/lib/libusb-1.0.so /opt/openrobots/lib/libposterLib.so -L../comLib -L../portLib /opt/openrobots/lib/libcomLib.so /opt/openrobots/lib/libportLib.so -lm -pthread -Wl,-rpath -Wl,/opt/openrobots/lib -Wl,-rpath -Wl,/usr/pkg/lib | /local/robotpkg/var/tmp/robotpkg/hardware/mccdaqft-genom3/work/mccdaqft-genom3-1.0/codels/.libs/libmccdaqft_codels.so: undefined reference to `aio_write' | /local/robotpkg/var/tmp/robotpkg/hardware/mccdaqft-genom3/work/mccdaqft-genom3-1.0/codels/.libs/libmccdaqft_codels.so: undefined reference to `aio_return' | /local/robotpkg/var/tmp/robotpkg/hardware/mccdaqft-genom3/work/mccdaqft-genom3-1.0/codels/.libs/libmccdaqft_codels.so: undefined reference to `aio_error' | Makefile:517: recipe for target 'mccdaqft-pocolibs' failed | gmake: *** [mccdaqft-pocolibs] Error 1 For details or bug reports, check the complete log file in: /local/robotpkg/var/tmp/robotpkg/hardware/mccdaqft-genom3/work/build.log gmake[3]: *** [do-build] Error 2 gmake[2]: *** [pkg-check-installed] Error 2 ERROR: /usr/pkg/bin/gmake: *** [package] Error 2 ===> Deinstalling for mccdaqft-genom3 Removed daqflex-libs-1.0 Removed digest-20080510 Removed eigen3-3.2.4 Removing dependency eltclsh-1.17 Removing dependency Removing dependency genom3-pocolibs-1.12 Removing dependency transgen3-1.0b5 Removing dependency genom3-openprs-1.0.9r5 Removed genom3-2.99.31 Removed openrobots2-idl-2.0 Removed tnftp-20130505~ssl