robotpkg/audio/textos-genom bulk build results

Log for textos-genom-1.0.2~openprs+tcl+tclserv_client on Ubuntu-18.04-x86_64: bulk.log (Back)

=> Checking for clear installation ===> Installing bootstrap dependencies for textos-genom-1.0.2~openprs+tcl+tclserv_client => Installing /opt/robotpkg/var/lib/robotpkg/packages/bsd/Ubuntu-18.04-x86_64/All/digest-20080510.tgz => Installing /opt/robotpkg/var/lib/robotpkg/packages/bsd/Ubuntu-18.04-x86_64/All/tnftp-20130505~ssl.tgz ===> Checking bootstrap dependencies for textos-genom-1.0.2~openprs+tcl+tclserv_client => Required robotpkg package digest>=20080510: digest-20080510 found => Required robotpkg package tnftp>=20091122: tnftp-20130505~ssl found => Required system package gnupg>=1: gnupg-2.2.4 found => Required system package gzip: gzip-1.6 found => Required system package patch>=2.0: patch-2.7.6 found => Required system package pax and tar archivers: pax found => Required system package pkg_install>=20110805.9: pkg_install-20110805.9 found => Required system package pkgrepo2deb>=1.4: pkgrepo2deb-1.4 found ===> Done bootstrap-depends for textos-genom-1.0.2~openprs+tcl+tclserv_client ===> Installing full dependencies for textos-genom-1.0.2~openprs+tcl+tclserv_client => Dependency digest-20080510 already installed WARNING: Cannot check installed version of festival => Installing /opt/robotpkg/var/lib/robotpkg/packages/bsd/Ubuntu-18.04-x86_64/All/genom-2.12~doc.tgz A genom editing mode is available for xemacs users in /opt/openrobots/share/genom. In order to use it, you should add the following lines to your (x)emacs startup file: (setq load-path (cons "/opt/openrobots/share/genom" load-path)) (autoload 'genom-mode "genom-mode" "Genom-mode" t) (setq auto-mode-alist (cons '("\.gen$" . genom-mode) auto-mode-alist)) => Installing /opt/robotpkg/var/lib/robotpkg/packages/bsd/Ubuntu-18.04-x86_64/All/libtclserv_client-0.5r1.tgz => Installing /opt/robotpkg/var/lib/robotpkg/packages/bsd/Ubuntu-18.04-x86_64/All/mkdep-2.9.tgz => Dependency pocolibs-2.17 already installed => Installing /opt/robotpkg/var/lib/robotpkg/packages/bsd/Ubuntu-18.04-x86_64/All/tclserv-2.8.1.tgz => Dependency tnftp-20130505~ssl already installed => Installing /opt/robotpkg/var/lib/robotpkg/packages/bsd/Ubuntu-18.04-x86_64/All/transgen-1.1b1.tgz ===> Checking build options for textos-genom-1.0.2~openprs+tcl+tclserv_client => Building with the following options: openprs Generate OpenPRS client code tcl Generate TCL client code tclserv_client Generate C tclServ client code ===> Checking alternatives for textos-genom-1.0.2~openprs+tcl+tclserv_client => Use the GNU C++ compiler: c++-compiler provided by g++>=3 => Use the GNU C compiler: c-compiler provided by gcc>=3 => Use tcl-8.6: tcl>=8.4 provided by tcl86>=8.6<8.7 ===> Checking dependencies for textos-genom-1.0.2~openprs+tcl+tclserv_client => Required system package autoconf>=2.59: autoconf-2.69 found => Required system package festival>=1.96 : festival found => Required system package g++>=3: g++-7 found => Required system package gcc>=3: gcc-7 found => Required system package GNU m4>=1.4: gm4-1.4.18 found => Required system package libstdc++: libstdc++ found => Required system package libtool>=1.5.22: libtool-2.4.6 found => Required system package perl>=5: perl-5 found => Required system package pkg-config>=0.22: pkg-config-0.29.1 found => Required system package tcl86>=8.6<8.7: tcl86-8.6 found WARNING: Cannot check installed version of festival => Required robotpkg package genom>=2.9: genom-2.12~doc found => Required robotpkg package libtclserv_client>=0.3: libtclserv_client-0.5r1 found => Required robotpkg package mkdep>=2.6: mkdep-2.9 found => Required robotpkg package pocolibs>=2.17: pocolibs-2.17 found => Required robotpkg package tclserv>=2.7: tclserv-2.8.1 found => Required robotpkg package transgen>=1.1b0: transgen-1.1b1 found ===> Done depends for textos-genom-1.0.2~openprs+tcl+tclserv_client ===> Extracting for textos-genom-1.0.2~openprs+tcl+tclserv_client => SHA1 checksums OK => RMD160 checksums OK ===> Patching for textos-genom-1.0.2~openprs+tcl+tclserv_client => Applying robotpkg patches for textos-genom-1.0.2~openprs+tcl+tclserv_client ===> Configuring for textos-genom-1.0.2~openprs+tcl+tclserv_client => Generating textos module genInit warning: init request without parameters /usr/bin/perl -w ./textos.pl configure.ac:34: warning: AC_LANG_CONFTEST: no AC_LANG_SOURCE call detected in body ../../lib/autoconf/lang.m4:193: AC_LANG_CONFTEST is expanded from... ../../lib/autoconf/general.m4:2672: _AC_LINK_IFELSE is expanded from... ../../lib/autoconf/general.m4:2689: AC_LINK_IFELSE is expanded from... libtool.m4:363: _LT_AC_SYS_LIBPATH_AIX is expanded from... libtool.m4:5563: AC_LIBTOOL_PROG_LD_SHLIBS is expanded from... libtool.m4:2786: _LT_AC_LANG_C_CONFIG is expanded from... libtool.m4:2785: AC_LIBTOOL_LANG_C_CONFIG is expanded from... libtool.m4:80: AC_LIBTOOL_SETUP is expanded from... libtool.m4:60: _AC_PROG_LIBTOOL is expanded from... libtool.m4:25: AC_PROG_LIBTOOL is expanded from... configure.ac:34: the top level configure.ac:34: warning: AC_LANG_CONFTEST: no AC_LANG_SOURCE call detected in body ../../lib/autoconf/lang.m4:193: AC_LANG_CONFTEST is expanded from... ../../lib/autoconf/general.m4:2672: _AC_LINK_IFELSE is expanded from... ../../lib/autoconf/general.m4:2689: AC_LINK_IFELSE is expanded from... libtool.m4:363: _LT_AC_SYS_LIBPATH_AIX is expanded from... libtool.m4:2867: _LT_AC_LANG_CXX_CONFIG is expanded from... libtool.m4:2866: AC_LIBTOOL_LANG_CXX_CONFIG is expanded from... libtool.m4:1911: _LT_AC_TAGCONFIG is expanded from... libtool.m4:80: AC_LIBTOOL_SETUP is expanded from... libtool.m4:60: _AC_PROG_LIBTOOL is expanded from... libtool.m4:25: AC_PROG_LIBTOOL is expanded from... configure.ac:34: the top level configure.ac:34: warning: AC_LANG_CONFTEST: no AC_LANG_SOURCE call detected in body ../../lib/autoconf/lang.m4:193: AC_LANG_CONFTEST is expanded from... ../../lib/autoconf/general.m4:2672: _AC_LINK_IFELSE is expanded from... ../../lib/autoconf/general.m4:2689: AC_LINK_IFELSE is expanded from... libtool.m4:363: _LT_AC_SYS_LIBPATH_AIX is expanded from... libtool.m4:5563: AC_LIBTOOL_PROG_LD_SHLIBS is expanded from... libtool.m4:4180: _LT_AC_LANG_GCJ_CONFIG is expanded from... libtool.m4:4179: AC_LIBTOOL_LANG_GCJ_CONFIG is expanded from... libtool.m4:1911: _LT_AC_TAGCONFIG is expanded from... libtool.m4:80: AC_LIBTOOL_SETUP is expanded from... libtool.m4:60: _AC_PROG_LIBTOOL is expanded from... libtool.m4:25: AC_PROG_LIBTOOL is expanded from... configure.ac:34: the top level Done. => Modifying GNU configure scripts to avoid --recheck ===> Building for textos-genom-1.0.2~openprs+tcl+tclserv_client make dependencies for textosError.c... make dependencies for textosEndian.c... make dependencies for textosPrint.c... make dependencies for textosPrintXML.c... make dependencies for textosScan.c... make dependencies for textosPosterLib.c... make dependencies for textosMsgLib.c... make dependencies for textosPosterShowLib.c... make dependencies for textosPosterXMLLib.c... make dependencies for textosPosterReadLib.c... make dependencies for textosCntrlTask.c... make dependencies for textosModuleInit.c... make dependencies for textosMain.c... make dependencies for textosPosterWriteLib.c... make dependencies for textosConnectLib.c... make dependencies for textosTest.c... make dependencies for textosInit.c... make dependencies for tcl/textosTcl.c... make dependencies for textosPosterLib.c... make dependencies for textosEndian.c... make dependencies for textosError.c... make dependencies for openprs/textosDecodeOpenprs.c... make dependencies for openprs/textosEncodeOpenprs.c... make dependencies for openprs/textosRequestsOpenprs.c... make dependencies for tclservClient/textosError.c... make dependencies for tclservClient/textosTclservClientEncode.c... make dependencies for tclservClient/textosTclservClientDecode.c... make dependencies for tclservClient/textosTclservClientMsgLib.c... ar: `u' modifier ignored since `D' is the default (see `U') ar: `u' modifier ignored since `D' is the default (see `U') openprs/textosRequestsOpenprs.c: In function 'init_textos_rqst_type_table': openprs/textosRequestsOpenprs.c:87:16: warning: 'tclserv_client_abort' is deprecated [-Wdeprecated-declarations] (Encode_Func_Proto)pu_encode_genom_int, sizeof(int), tclserv_client_abort, ^ In file included from openprs/textosRequestsOpenprs.c:69:0: /opt/openrobots/include/tclserv_client/tclserv_client.h:231:16: note: declared here DEPRECATED(int tclserv_client_abort(TCLSERV_CLIENT_ID id, ssize_t rqstId)); ^ /opt/openrobots/include/tclserv_client/tclserv_client.h:35:26: note: in definition of macro 'DEPRECATED' #define DEPRECATED(func) func __attribute__ ((deprecated)) ^~~~ tclservClient/textosError.c: In function 'textos_decode_error': tclservClient/textosError.c:40:8: warning: implicit declaration of function 'strcmp' [-Wimplicit-function-declaration] if (strcmp(textosTclservClientErrMsgs[i].msg, str) == 0) { ^~~~~~ tclservClient/textosTclservClientDecode.c: In function 'scan_buf_struct_tts_ids': tclservClient/textosTclservClientDecode.c:14:9: warning: implicit declaration of function 'scan_buf_struct_tts_say_p'; did you mean 'scan_struct_tts_say_p'? [-Wimplicit-function-declaration] if (scan_buf_struct_tts_say_p(buf, &(x+elt)->sayp, 0, NULL) != 0) ^~~~~~~~~~~~~~~~~~~~~~~~~ scan_struct_tts_say_p ar: `u' modifier ignored since `D' is the default (see `U') ar: `u' modifier ignored since `D' is the default (see `U') textosModuleInit.c: In function 'main': textosModuleInit.c:383:2: warning: ignoring return value of 'pipe', declared with attribute warn_unused_result [-Wunused-result] pipe(waitPipe); ^~~~~~~~~~~~~~ textosModuleInit.c:409:2: warning: ignoring return value of 'write', declared with attribute warn_unused_result [-Wunused-result] write(waitPipe[1], "textos: h2initGlob errorn", 17); ^~~~~~~~~~~~~~~~~~~~~~~~~~~~~~~~~~~~~~~~~~~~~~~~~~~~ textosModuleInit.c:417:2: warning: ignoring return value of 'write', declared with attribute warn_unused_result [-Wunused-result] write(waitPipe[1], "textos: moduleTaskInit errorn", 21); ^~~~~~~~~~~~~~~~~~~~~~~~~~~~~~~~~~~~~~~~~~~~~~~~~~~~~~~~ textosModuleInit.c:428:2: warning: ignoring return value of 'write', declared with attribute warn_unused_result [-Wunused-result] write(waitPipe[1], "textos: OKn", 3); ^~~~~~~~~~~~~~~~~~~~~~~~~~~~~~~~~~~~~ ar: `u' modifier ignored since `D' is the default (see `U') ar: `u' modifier ignored since `D' is the default (see `U') make dependencies for textosMainCodels.cc... make dependencies for textosCntrlTaskCodels.cc... textosMainCodels.cc: In function 'ACTIVITY_EVENT ttsSayMain(tts_say_p*, int*)': textosMainCodels.cc:93:25: warning: format not a string literal and no format arguments [-Wformat-security] warnx(sayp->sentence); ^ ar: `u' modifier ignored since `D' is the default (see `U') /usr/lib/gcc/x86_64-linux-gnu/7/../../../x86_64-linux-gnu/libestools.so: undefined reference to `GOMP_barrier' /usr/lib/gcc/x86_64-linux-gnu/7/../../../x86_64-linux-gnu/libestools.so: undefined reference to `GOMP_parallel' /usr/lib/gcc/x86_64-linux-gnu/7/../../../x86_64-linux-gnu/libestools.so: undefined reference to `omp_get_thread_num' /usr/lib/gcc/x86_64-linux-gnu/7/../../../x86_64-linux-gnu/libestools.so: undefined reference to `omp_get_num_threads' collect2: error: ld returned 1 exit status make[2]: *** [posix-obj/textos] Error 1 make[1]: *** [all-posix] Error 2 make: *** [all] Error 2 An unexpected error occured. The last 10 log lines are shown below. | /usr/lib/gcc/x86_64-linux-gnu/7/../../../x86_64-linux-gnu/libestools.so: undefined reference to `omp_get_num_threads' | collect2: error: ld returned 1 exit status | make[2]: *** [posix-obj/textos] Error 1 /local/robotpkg/var/lib/robotpkg/mk/build/build.mk:198: recipe for target 'do-build' failed | ../autoconf/codels.mk:32: recipe for target 'posix-obj/textos' failed | make[2]: Leaving directory '/local/robotpkg/var/tmp/robotpkg/audio/textos-genom/work/textos-genom-1.0.2/codels' | Makefile:70: recipe for target 'all-posix' failed | make[1]: Leaving directory '/local/robotpkg/var/tmp/robotpkg/audio/textos-genom/work/textos-genom-1.0.2' | make[1]: *** [all-posix] Error 2 | make: *** [all] Error 2 | Makefile:37: recipe for target 'all' failed For details or bug reports, check the complete log file in: /local/robotpkg/var/tmp/robotpkg/audio/textos-genom/work/build.log make[3]: *** [do-build] Error 2 make[2]: *** [pkg-check-installed] Error 2 ERROR: make: *** [package] Error 2 /local/robotpkg/var/lib/robotpkg/mk/pkg/package.mk:42: recipe for target 'pkg-check-installed' failed => Marking textos-genom-1.0.2~openprs+tcl+tclserv_client as broken ===> Deinstalling for textos-genom Removed digest-20080510 Removing dependency pocolibs-2.17 Removing dependency Removed genom-2.12~doc Removing dependency transgen-1.1b1 Removed libtclserv_client-0.5r1 Removed mkdep-2.9 Removing dependency tclserv-2.8.1 Removed pocolibs-2.17 Removed tnftp-20130505~ssl