robotpkg/audio/textos-genom bulk build results

Log for textos-genom-1.0.2~openprs+tcl+tclserv_client on Ubuntu-18.04-x86_64: autoconf.log (Back)

This file contains any messages produced by compilers while running configure, to aid debugging if configure makes a mistake. It was created by textos-genom configure 1.0.2, which was generated by GNU Autoconf 2.69. Invocation command line was $ ./configure --with-festival=/usr --with-tcl=/usr/lib/x86_64-linux-gnu/ --prefix=/opt/openrobots --infodir=/opt/openrobots/info --mandir=/opt/openrobots/man ## --------- ## ## Platform. ## ## --------- ## hostname = fluffy64-ubuntu1804 uname -m = x86_64 uname -r = 4.15.0-39-generic uname -s = Linux uname -v = #42-Ubuntu SMP Tue Oct 23 15:48:01 UTC 2018 /usr/bin/uname -p = unknown /bin/uname -X = unknown /bin/arch = unknown /usr/bin/arch -k = unknown /usr/convex/getsysinfo = unknown /usr/bin/hostinfo = unknown /bin/machine = unknown /usr/bin/oslevel = unknown /bin/universe = unknown PATH: /opt/openrobots/bin PATH: /opt/openrobots/sbin PATH: /usr/local/sbin PATH: /usr/local/bin PATH: /usr/sbin PATH: /usr/bin PATH: /sbin PATH: /bin ## ----------- ## ## Core tests. ## ## ----------- ## configure:3237: checking build system type configure:3251: result: x86_64-unknown-linux-gnu configure:3271: checking host system type configure:3284: result: x86_64-unknown-linux-gnu configure:3356: checking for gcc configure:3383: result: /usr/bin/gcc configure:3612: checking for C compiler version configure:3621: /usr/bin/gcc --version >&5 gcc (Ubuntu 7.3.0-27ubuntu1~18.04) 7.3.0 Copyright (C) 2017 Free Software Foundation, Inc. This is free software; see the source for copying conditions. There is NO warranty; not even for MERCHANTABILITY or FITNESS FOR A PARTICULAR PURPOSE. configure:3632: $? = 0 configure:3621: /usr/bin/gcc -v >&5 Using built-in specs. COLLECT_GCC=/usr/bin/gcc COLLECT_LTO_WRAPPER=/usr/lib/gcc/x86_64-linux-gnu/7/lto-wrapper OFFLOAD_TARGET_NAMES=nvptx-none OFFLOAD_TARGET_DEFAULT=1 Target: x86_64-linux-gnu Configured with: ../src/configure -v --with-pkgversion='Ubuntu 7.3.0-27ubuntu1~18.04' --with-bugurl=file:///usr/share/doc/gcc-7/README.Bugs --enable-languages=c,ada,c++,go,brig,d,fortran,objc,obj-c++ --prefix=/usr --with-gcc-major-version-only --program-suffix=-7 --program-prefix=x86_64-linux-gnu- --enable-shared --enable-linker-build-id --libexecdir=/usr/lib --without-included-gettext --enable-threads=posix --libdir=/usr/lib --enable-nls --with-sysroot=/ --enable-clocale=gnu --enable-libstdcxx-debug --enable-libstdcxx-time=yes --with-default-libstdcxx-abi=new --enable-gnu-unique-object --disable-vtable-verify --enable-libmpx --enable-plugin --enable-default-pie --with-system-zlib --with-target-system-zlib --enable-objc-gc=auto --enable-multiarch --disable-werror --with-arch-32=i686 --with-abi=m64 --with-multilib-list=m32,m64,mx32 --enable-multilib --with-tune=generic --enable-offload-targets=nvptx-none --without-cuda-driver --enable-checking=release --build=x86_64-linux-gnu --host=x86_64-linux-gnu --target=x86_64-linux-gnu Thread model: posix gcc version 7.3.0 (Ubuntu 7.3.0-27ubuntu1~18.04) configure:3632: $? = 0 configure:3621: /usr/bin/gcc -V >&5 gcc: error: unrecognized command line option '-V' gcc: fatal error: no input files compilation terminated. configure:3632: $? = 1 configure:3621: /usr/bin/gcc -qversion >&5 gcc: error: unrecognized command line option '-qversion'; did you mean '--version'? gcc: fatal error: no input files compilation terminated. configure:3632: $? = 1 configure:3652: checking whether the C compiler works configure:3674: /usr/bin/gcc -pipe -O3 -DNDEBUG conftest.c >&5 configure:3678: $? = 0 configure:3726: result: yes configure:3729: checking for C compiler default output file name configure:3731: result: a.out configure:3737: checking for suffix of executables configure:3744: /usr/bin/gcc -o conftest -pipe -O3 -DNDEBUG conftest.c >&5 configure:3748: $? = 0 configure:3770: result: configure:3792: checking whether we are cross compiling configure:3800: /usr/bin/gcc -o conftest -pipe -O3 -DNDEBUG conftest.c >&5 configure:3804: $? = 0 configure:3811: ./conftest configure:3815: $? = 0 configure:3830: result: no configure:3835: checking for suffix of object files configure:3857: /usr/bin/gcc -c -pipe -O3 -DNDEBUG conftest.c >&5 configure:3861: $? = 0 configure:3882: result: o configure:3886: checking whether we are using the GNU C compiler configure:3905: /usr/bin/gcc -c -pipe -O3 -DNDEBUG conftest.c >&5 configure:3905: $? = 0 configure:3914: result: yes configure:3923: checking whether /usr/bin/gcc accepts -g configure:3943: /usr/bin/gcc -c -g conftest.c >&5 configure:3943: $? = 0 configure:3984: result: yes configure:4001: checking for /usr/bin/gcc option to accept ISO C89 configure:4064: /usr/bin/gcc -c -pipe -O3 -DNDEBUG conftest.c >&5 configure:4064: $? = 0 configure:4077: result: none needed configure:4210: checking for C++ compiler version configure:4219: /usr/bin/g++ --version >&5 g++ (Ubuntu 7.3.0-27ubuntu1~18.04) 7.3.0 Copyright (C) 2017 Free Software Foundation, Inc. This is free software; see the source for copying conditions. There is NO warranty; not even for MERCHANTABILITY or FITNESS FOR A PARTICULAR PURPOSE. configure:4230: $? = 0 configure:4219: /usr/bin/g++ -v >&5 Using built-in specs. COLLECT_GCC=/usr/bin/g++ COLLECT_LTO_WRAPPER=/usr/lib/gcc/x86_64-linux-gnu/7/lto-wrapper OFFLOAD_TARGET_NAMES=nvptx-none OFFLOAD_TARGET_DEFAULT=1 Target: x86_64-linux-gnu Configured with: ../src/configure -v --with-pkgversion='Ubuntu 7.3.0-27ubuntu1~18.04' --with-bugurl=file:///usr/share/doc/gcc-7/README.Bugs --enable-languages=c,ada,c++,go,brig,d,fortran,objc,obj-c++ --prefix=/usr --with-gcc-major-version-only --program-suffix=-7 --program-prefix=x86_64-linux-gnu- --enable-shared --enable-linker-build-id --libexecdir=/usr/lib --without-included-gettext --enable-threads=posix --libdir=/usr/lib --enable-nls --with-sysroot=/ --enable-clocale=gnu --enable-libstdcxx-debug --enable-libstdcxx-time=yes --with-default-libstdcxx-abi=new --enable-gnu-unique-object --disable-vtable-verify --enable-libmpx --enable-plugin --enable-default-pie --with-system-zlib --with-target-system-zlib --enable-objc-gc=auto --enable-multiarch --disable-werror --with-arch-32=i686 --with-abi=m64 --with-multilib-list=m32,m64,mx32 --enable-multilib --with-tune=generic --enable-offload-targets=nvptx-none --without-cuda-driver --enable-checking=release --build=x86_64-linux-gnu --host=x86_64-linux-gnu --target=x86_64-linux-gnu Thread model: posix gcc version 7.3.0 (Ubuntu 7.3.0-27ubuntu1~18.04) configure:4230: $? = 0 configure:4219: /usr/bin/g++ -V >&5 g++: error: unrecognized command line option '-V' g++: fatal error: no input files compilation terminated. configure:4230: $? = 1 configure:4219: /usr/bin/g++ -qversion >&5 g++: error: unrecognized command line option '-qversion'; did you mean '--version'? g++: fatal error: no input files compilation terminated. configure:4230: $? = 1 configure:4234: checking whether we are using the GNU C++ compiler configure:4253: /usr/bin/g++ -c -pipe -O3 -DNDEBUG conftest.cpp >&5 configure:4253: $? = 0 configure:4262: result: yes configure:4271: checking whether /usr/bin/g++ accepts -g configure:4291: /usr/bin/g++ -c -g conftest.cpp >&5 configure:4291: $? = 0 configure:4332: result: yes configure:4371: checking for a BSD-compatible install configure:4439: result: /usr/bin/install -c configure:4522: checking for a sed that does not truncate output configure:4578: result: /bin/sed configure:4581: checking for grep that handles long lines and -e configure:4639: result: /bin/grep configure:4644: checking for egrep configure:4706: result: /bin/grep -E configure:4722: checking for ld used by /usr/bin/gcc configure:4789: result: /usr/bin/ld configure:4796: checking if the linker (/usr/bin/ld) is GNU ld configure:4811: result: yes configure:4816: checking for /usr/bin/ld option to reload object files configure:4823: result: -r configure:4841: checking for BSD-compatible nm configure:4890: result: /usr/bin/nm -B configure:4894: checking whether ln -s works configure:4898: result: yes configure:4905: checking how to recognize dependent libraries configure:5091: result: pass_all configure:5180: /usr/bin/gcc -c -pipe -O3 -DNDEBUG conftest.c >&5 configure:5183: $? = 0 configure:5312: checking how to run the C preprocessor configure:5382: result: /usr/bin/gcc -E configure:5402: /usr/bin/gcc -E conftest.c configure:5402: $? = 0 configure:5416: /usr/bin/gcc -E conftest.c conftest.c:9:10: fatal error: ac_nonexistent.h: No such file or directory #include ^~~~~~~~~~~~~~~~~~ compilation terminated. configure:5416: $? = 1 configure: failed program was: | /* confdefs.h */ | #define PACKAGE_NAME "textos-genom" | #define PACKAGE_TARNAME "textos-genom" | #define PACKAGE_VERSION "1.0.2" | #define PACKAGE_STRING "textos-genom 1.0.2" | #define PACKAGE_BUGREPORT "anthony.mallet@laas.fr" | #define PACKAGE_URL "" | /* end confdefs.h. */ | #include configure:5445: checking for ANSI C header files configure:5465: /usr/bin/gcc -c -pipe -O3 -DNDEBUG conftest.c >&5 configure:5465: $? = 0 configure:5538: /usr/bin/gcc -o conftest -pipe -O3 -DNDEBUG conftest.c >&5 configure:5538: $? = 0 configure:5538: ./conftest configure:5538: $? = 0 configure:5549: result: yes configure:5562: checking for sys/types.h configure:5562: /usr/bin/gcc -c -pipe -O3 -DNDEBUG conftest.c >&5 configure:5562: $? = 0 configure:5562: result: yes configure:5562: checking for sys/stat.h configure:5562: /usr/bin/gcc -c -pipe -O3 -DNDEBUG conftest.c >&5 configure:5562: $? = 0 configure:5562: result: yes configure:5562: checking for stdlib.h configure:5562: /usr/bin/gcc -c -pipe -O3 -DNDEBUG conftest.c >&5 configure:5562: $? = 0 configure:5562: result: yes configure:5562: checking for string.h configure:5562: /usr/bin/gcc -c -pipe -O3 -DNDEBUG conftest.c >&5 configure:5562: $? = 0 configure:5562: result: yes configure:5562: checking for memory.h configure:5562: /usr/bin/gcc -c -pipe -O3 -DNDEBUG conftest.c >&5 configure:5562: $? = 0 configure:5562: result: yes configure:5562: checking for strings.h configure:5562: /usr/bin/gcc -c -pipe -O3 -DNDEBUG conftest.c >&5 configure:5562: $? = 0 configure:5562: result: yes configure:5562: checking for inttypes.h configure:5562: /usr/bin/gcc -c -pipe -O3 -DNDEBUG conftest.c >&5 configure:5562: $? = 0 configure:5562: result: yes configure:5562: checking for stdint.h configure:5562: /usr/bin/gcc -c -pipe -O3 -DNDEBUG conftest.c >&5 configure:5562: $? = 0 configure:5562: result: yes configure:5562: checking for unistd.h configure:5562: /usr/bin/gcc -c -pipe -O3 -DNDEBUG conftest.c >&5 configure:5562: $? = 0 configure:5562: result: yes configure:5576: checking dlfcn.h usability configure:5576: /usr/bin/gcc -c -pipe -O3 -DNDEBUG conftest.c >&5 configure:5576: $? = 0 configure:5576: result: yes configure:5576: checking dlfcn.h presence configure:5576: /usr/bin/gcc -E conftest.c configure:5576: $? = 0 configure:5576: result: yes configure:5576: checking for dlfcn.h configure:5576: result: yes configure:5596: checking how to run the C++ preprocessor configure:5662: result: /usr/bin/g++ -E configure:5682: /usr/bin/g++ -E conftest.cpp configure:5682: $? = 0 configure:5696: /usr/bin/g++ -E conftest.cpp conftest.cpp:20:10: fatal error: ac_nonexistent.h: No such file or directory #include ^~~~~~~~~~~~~~~~~~ compilation terminated. configure:5696: $? = 1 configure: failed program was: | /* confdefs.h */ | #define PACKAGE_NAME "textos-genom" | #define PACKAGE_TARNAME "textos-genom" | #define PACKAGE_VERSION "1.0.2" | #define PACKAGE_STRING "textos-genom 1.0.2" | #define PACKAGE_BUGREPORT "anthony.mallet@laas.fr" | #define PACKAGE_URL "" | #define STDC_HEADERS 1 | #define HAVE_SYS_TYPES_H 1 | #define HAVE_SYS_STAT_H 1 | #define HAVE_STDLIB_H 1 | #define HAVE_STRING_H 1 | #define HAVE_MEMORY_H 1 | #define HAVE_STRINGS_H 1 | #define HAVE_INTTYPES_H 1 | #define HAVE_STDINT_H 1 | #define HAVE_UNISTD_H 1 | #define HAVE_DLFCN_H 1 | /* end confdefs.h. */ | #include configure:5780: checking for g77 configure:5810: result: no configure:5780: checking for xlf configure:5810: result: no configure:5780: checking for f77 configure:5796: found /usr/bin/f77 configure:5807: result: f77 configure:5833: checking for Fortran 77 compiler version configure:5842: f77 --version >&5 GNU Fortran (Ubuntu 7.3.0-27ubuntu1~18.04) 7.3.0 Copyright (C) 2017 Free Software Foundation, Inc. This is free software; see the source for copying conditions. There is NO warranty; not even for MERCHANTABILITY or FITNESS FOR A PARTICULAR PURPOSE. configure:5853: $? = 0 configure:5842: f77 -v >&5 Using built-in specs. COLLECT_GCC=f77 COLLECT_LTO_WRAPPER=/usr/lib/gcc/x86_64-linux-gnu/7/lto-wrapper OFFLOAD_TARGET_NAMES=nvptx-none OFFLOAD_TARGET_DEFAULT=1 Target: x86_64-linux-gnu Configured with: ../src/configure -v --with-pkgversion='Ubuntu 7.3.0-27ubuntu1~18.04' --with-bugurl=file:///usr/share/doc/gcc-7/README.Bugs --enable-languages=c,ada,c++,go,brig,d,fortran,objc,obj-c++ --prefix=/usr --with-gcc-major-version-only --program-suffix=-7 --program-prefix=x86_64-linux-gnu- --enable-shared --enable-linker-build-id --libexecdir=/usr/lib --without-included-gettext --enable-threads=posix --libdir=/usr/lib --enable-nls --with-sysroot=/ --enable-clocale=gnu --enable-libstdcxx-debug --enable-libstdcxx-time=yes --with-default-libstdcxx-abi=new --enable-gnu-unique-object --disable-vtable-verify --enable-libmpx --enable-plugin --enable-default-pie --with-system-zlib --with-target-system-zlib --enable-objc-gc=auto --enable-multiarch --disable-werror --with-arch-32=i686 --with-abi=m64 --with-multilib-list=m32,m64,mx32 --enable-multilib --with-tune=generic --enable-offload-targets=nvptx-none --without-cuda-driver --enable-checking=release --build=x86_64-linux-gnu --host=x86_64-linux-gnu --target=x86_64-linux-gnu Thread model: posix gcc version 7.3.0 (Ubuntu 7.3.0-27ubuntu1~18.04) configure:5853: $? = 0 configure:5842: f77 -V >&5 f77: error: unrecognized command line option '-V' f77: fatal error: no input files compilation terminated. configure:5853: $? = 1 configure:5842: f77 -qversion >&5 f77: error: unrecognized command line option '-qversion'; did you mean '--version'? f77: fatal error: no input files compilation terminated. configure:5853: $? = 1 configure:5862: checking whether we are using the GNU Fortran 77 compiler configure:5875: f77 -c conftest.F >&5 configure:5875: $? = 0 configure:5884: result: yes configure:5890: checking whether f77 accepts -g configure:5901: f77 -c -g conftest.f >&5 configure:5901: $? = 0 configure:5909: result: yes configure:5942: checking the maximum length of command line arguments configure:6054: result: 1572864 configure:6066: checking command to parse /usr/bin/nm -B output from /usr/bin/gcc object configure:6171: /usr/bin/gcc -c -pipe -O3 -DNDEBUG conftest.c >&5 configure:6174: $? = 0 configure:6178: /usr/bin/nm -B conftest.o \| sed -n -e 's/^.*[ ]\([ABCDGIRSTW][ABCDGIRSTW]*\)[ ][ ]*\([_A-Za-z][_A-Za-z0-9]*\)$/  /p' \> conftest.nm configure:6181: $? = 0 configure:6233: /usr/bin/gcc -o conftest -pipe -O3 -DNDEBUG conftest.c conftstm.o >&5 configure:6236: $? = 0 configure:6274: result: ok configure:6278: checking for objdir configure:6293: result: .libs configure:6385: checking for ar configure:6401: found /usr/bin/ar configure:6412: result: ar configure:6477: checking for ranlib configure:6493: found /usr/bin/ranlib configure:6504: result: ranlib configure:6569: checking for strip configure:6585: found /usr/bin/strip configure:6596: result: strip configure:7161: checking if /usr/bin/gcc supports -fno-rtti -fno-exceptions configure:7179: /usr/bin/gcc -c -pipe -O3 -DNDEBUG -fno-rtti -fno-exceptions conftest.c >&5 cc1: warning: command line option '-fno-rtti' is valid for C++/ObjC++ but not for C configure:7183: $? = 0 configure:7196: result: no configure:7211: checking for /usr/bin/gcc option to produce PIC configure:7443: result: -fPIC configure:7451: checking if /usr/bin/gcc PIC flag -fPIC works configure:7469: /usr/bin/gcc -c -pipe -O3 -DNDEBUG -fPIC -DPIC conftest.c >&5 configure:7473: $? = 0 configure:7486: result: yes configure:7514: checking if /usr/bin/gcc static flag -static works configure:7542: result: yes configure:7552: checking if /usr/bin/gcc supports -c -o file.o configure:7573: /usr/bin/gcc -c -pipe -O3 -DNDEBUG -o out/conftest2.o conftest.c >&5 configure:7577: $? = 0 configure:7599: result: yes configure:7625: checking whether the /usr/bin/gcc linker (/usr/bin/ld -m elf_x86_64) supports shared libraries configure:8551: result: yes configure:8572: checking whether -lc should be explicitly linked in configure:8577: /usr/bin/gcc -c -pipe -O3 -DNDEBUG conftest.c >&5 configure:8580: $? = 0 configure:8595: /usr/bin/gcc -shared conftest.o -v -Wl,-soname -Wl,conftest -o conftest 2\>\&1 \| grep -lc \>/dev/null 2\>\&1 configure:8598: $? = 0 configure:8610: result: no configure:8618: checking dynamic linker characteristics configure:9222: result: GNU/Linux ld.so configure:9246: checking how to hardcode library paths into programs configure:9271: result: immediate configure:9285: checking whether stripping libraries is possible configure:9290: result: yes configure:9807: checking if libtool supports shared libraries configure:9809: result: yes configure:9812: checking whether to build shared libraries configure:9833: result: yes configure:9836: checking whether to build static libraries configure:9840: result: yes configure:9934: creating libtool configure:10523: checking for ld used by /usr/bin/g++ configure:10590: result: /usr/bin/ld -m elf_x86_64 configure:10597: checking if the linker (/usr/bin/ld -m elf_x86_64) is GNU ld configure:10612: result: yes configure:10663: checking whether the /usr/bin/g++ linker (/usr/bin/ld -m elf_x86_64) supports shared libraries configure:11555: result: yes configure:11576: /usr/bin/g++ -c -pipe -O3 -DNDEBUG conftest.cpp >&5 configure:11579: $? = 0 configure:11735: checking for /usr/bin/g++ option to produce PIC configure:12019: result: -fPIC configure:12027: checking if /usr/bin/g++ PIC flag -fPIC works configure:12045: /usr/bin/g++ -c -pipe -O3 -DNDEBUG -fPIC -DPIC conftest.cpp >&5 configure:12049: $? = 0 configure:12062: result: yes configure:12090: checking if /usr/bin/g++ static flag -static works configure:12118: result: yes configure:12128: checking if /usr/bin/g++ supports -c -o file.o configure:12149: /usr/bin/g++ -c -pipe -O3 -DNDEBUG -o out/conftest2.o conftest.cpp >&5 configure:12153: $? = 0 configure:12175: result: yes configure:12201: checking whether the /usr/bin/g++ linker (/usr/bin/ld -m elf_x86_64) supports shared libraries configure:12227: result: yes configure:12294: checking dynamic linker characteristics configure:12846: result: GNU/Linux ld.so configure:12870: checking how to hardcode library paths into programs configure:12895: result: immediate configure:13434: checking if libtool supports shared libraries configure:13436: result: yes configure:13439: checking whether to build shared libraries configure:13459: result: yes configure:13462: checking whether to build static libraries configure:13466: result: yes configure:13476: checking for f77 option to produce PIC configure:13708: result: -fPIC configure:13716: checking if f77 PIC flag -fPIC works configure:13734: f77 -c -g -O2 -fPIC conftest.f >&5 configure:13738: $? = 0 configure:13751: result: yes configure:13779: checking if f77 static flag -static works configure:13807: result: yes configure:13817: checking if f77 supports -c -o file.o configure:13838: f77 -c -g -O2 -o out/conftest2.o conftest.f >&5 configure:13842: $? = 0 configure:13864: result: yes configure:13890: checking whether the f77 linker (/usr/bin/ld -m elf_x86_64) supports shared libraries configure:14804: result: yes configure:14871: checking dynamic linker characteristics configure:15423: result: GNU/Linux ld.so configure:15447: checking how to hardcode library paths into programs configure:15472: result: immediate configure:19035: checking for mkdep configure:19054: found /opt/openrobots/bin/mkdep configure:19067: result: /opt/openrobots/bin/mkdep configure:19079: checking whether mkdep accepts -I/-D options configure:19092: result: yes configure:19101: checking sys/cdefs.h usability configure:19101: /usr/bin/gcc -c -pipe -O3 -DNDEBUG conftest.c >&5 configure:19101: $? = 0 configure:19101: result: yes configure:19101: checking sys/cdefs.h presence configure:19101: /usr/bin/gcc -E conftest.c configure:19101: $? = 0 configure:19101: result: yes configure:19101: checking for sys/cdefs.h configure:19101: result: yes configure:19112: checking whether byte ordering is bigendian configure:19127: /usr/bin/gcc -c -pipe -O3 -DNDEBUG conftest.c >&5 conftest.c:22:9: error: unknown type name 'not' not a universal capable compiler ^~~ conftest.c:22:15: error: expected '=', ',', ';', 'asm' or '__attribute__' before 'universal' not a universal capable compiler ^~~~~~~~~ conftest.c:22:15: error: unknown type name 'universal' configure:19127: $? = 1 configure: failed program was: | /* confdefs.h */ | #define PACKAGE_NAME "textos-genom" | #define PACKAGE_TARNAME "textos-genom" | #define PACKAGE_VERSION "1.0.2" | #define PACKAGE_STRING "textos-genom 1.0.2" | #define PACKAGE_BUGREPORT "anthony.mallet@laas.fr" | #define PACKAGE_URL "" | #define STDC_HEADERS 1 | #define HAVE_SYS_TYPES_H 1 | #define HAVE_SYS_STAT_H 1 | #define HAVE_STDLIB_H 1 | #define HAVE_STRING_H 1 | #define HAVE_MEMORY_H 1 | #define HAVE_STRINGS_H 1 | #define HAVE_INTTYPES_H 1 | #define HAVE_STDINT_H 1 | #define HAVE_UNISTD_H 1 | #define HAVE_DLFCN_H 1 | #define HAVE_SYS_CDEFS_H 1 | /* end confdefs.h. */ | #ifndef __APPLE_CC__ | not a universal capable compiler | #endif | typedef int dummy; | configure:19172: /usr/bin/gcc -c -pipe -O3 -DNDEBUG conftest.c >&5 configure:19172: $? = 0 configure:19190: /usr/bin/gcc -c -pipe -O3 -DNDEBUG conftest.c >&5 conftest.c: In function 'main': conftest.c:28:4: error: unknown type name 'not'; did you mean 'ino_t'? not big endian ^~~ ino_t conftest.c:28:12: error: expected '=', ',', ';', 'asm' or '__attribute__' before 'endian' not big endian ^~~~~~ configure:19190: $? = 1 configure: failed program was: | /* confdefs.h */ | #define PACKAGE_NAME "textos-genom" | #define PACKAGE_TARNAME "textos-genom" | #define PACKAGE_VERSION "1.0.2" | #define PACKAGE_STRING "textos-genom 1.0.2" | #define PACKAGE_BUGREPORT "anthony.mallet@laas.fr" | #define PACKAGE_URL "" | #define STDC_HEADERS 1 | #define HAVE_SYS_TYPES_H 1 | #define HAVE_SYS_STAT_H 1 | #define HAVE_STDLIB_H 1 | #define HAVE_STRING_H 1 | #define HAVE_MEMORY_H 1 | #define HAVE_STRINGS_H 1 | #define HAVE_INTTYPES_H 1 | #define HAVE_STDINT_H 1 | #define HAVE_UNISTD_H 1 | #define HAVE_DLFCN_H 1 | #define HAVE_SYS_CDEFS_H 1 | /* end confdefs.h. */ | #include | #include | | int | main () | { | #if BYTE_ORDER != BIG_ENDIAN | not big endian | #endif | | ; | return 0; | } configure:19318: result: no configure:19408: checking if compiler recognizes -pthread configure:19440: /usr/bin/gcc -o conftest -pipe -O3 -DNDEBUG -pthread conftest.c >&5 conftest.c: In function 'pipo': conftest.c:23:25: warning: implicit declaration of function 'exit' [-Wimplicit-function-declaration] void *pipo(void *a) { exit(0); } ^~~~ conftest.c:23:25: warning: incompatible implicit declaration of built-in function 'exit' conftest.c:23:25: note: include '' or provide a declaration of 'exit' conftest.c: In function 'main': conftest.c:29:5: warning: incompatible implicit declaration of built-in function 'exit' exit(2); ^~~~ conftest.c:29:5: note: include '' or provide a declaration of 'exit' configure:19440: $? = 0 configure:19440: ./conftest configure:19440: $? = 0 configure:19460: result: yes configure:19663: checking for library containing fabs configure:19694: /usr/bin/gcc -o conftest -pipe -O3 -DNDEBUG -pthread -pthread conftest.c >&5 conftest.c:28:6: warning: conflicting types for built-in function 'fabs' [-Wbuiltin-declaration-mismatch] char fabs (); ^~~~ /tmp/ccNphn5L.o: In function `main': conftest.c:(.text.startup+0x7): undefined reference to `fabs' collect2: error: ld returned 1 exit status configure:19694: $? = 1 configure: failed program was: | /* confdefs.h */ | #define PACKAGE_NAME "textos-genom" | #define PACKAGE_TARNAME "textos-genom" | #define PACKAGE_VERSION "1.0.2" | #define PACKAGE_STRING "textos-genom 1.0.2" | #define PACKAGE_BUGREPORT "anthony.mallet@laas.fr" | #define PACKAGE_URL "" | #define STDC_HEADERS 1 | #define HAVE_SYS_TYPES_H 1 | #define HAVE_SYS_STAT_H 1 | #define HAVE_STDLIB_H 1 | #define HAVE_STRING_H 1 | #define HAVE_MEMORY_H 1 | #define HAVE_STRINGS_H 1 | #define HAVE_INTTYPES_H 1 | #define HAVE_STDINT_H 1 | #define HAVE_UNISTD_H 1 | #define HAVE_DLFCN_H 1 | #define HAVE_SYS_CDEFS_H 1 | /* end confdefs.h. */ | | /* Override any GCC internal prototype to avoid an error. | Use char because int might match the return type of a GCC | builtin and then its argument prototype would still apply. */ | #ifdef __cplusplus | extern "C" | #endif | char fabs (); | int | main () | { | return fabs (); | ; | return 0; | } configure:19694: /usr/bin/gcc -o conftest -pipe -O3 -DNDEBUG -pthread -pthread conftest.c -lm >&5 conftest.c:28:6: warning: conflicting types for built-in function 'fabs' [-Wbuiltin-declaration-mismatch] char fabs (); ^~~~ configure:19694: $? = 0 configure:19711: result: -lm configure:19719: checking for library containing atan configure:19750: /usr/bin/gcc -o conftest -pipe -O3 -DNDEBUG -pthread -pthread conftest.c -lm >&5 conftest.c:28:6: warning: conflicting types for built-in function 'atan' [-Wbuiltin-declaration-mismatch] char atan (); ^~~~ configure:19750: $? = 0 configure:19767: result: none required configure:19884: checking pkg-config is at least version 0.9.0 configure:19887: result: yes configure:19898: checking for GENOM configure:19906: $PKG_CONFIG --exists --print-errors "genom >= 2.12" configure:19909: $? = 0 configure:19924: $PKG_CONFIG --exists --print-errors "genom >= 2.12" configure:19927: $? = 0 configure:19982: result: yes configure:19991: checking for TCLSERV configure:19999: $PKG_CONFIG --exists --print-errors "tclserv >= 2.7" configure:20002: $? = 0 configure:20017: $PKG_CONFIG --exists --print-errors "tclserv >= 2.7" configure:20020: $? = 0 configure:20075: result: yes configure:20122: checking for tclConfig.sh configure:20134: result: "/usr/lib/x86_64-linux-gnu//tclConfig.sh" configure:20139: checking for tcl headers configure:20141: result: -I/usr/include/tcl8.6 configure:20144: checking for tcl library configure:20146: result: -L/usr/lib/x86_64-linux-gnu -ltcl8.6 configure:20165: checking for TRANSGEN configure:20173: $PKG_CONFIG --exists --print-errors "transgen" configure:20176: $? = 0 configure:20191: $PKG_CONFIG --exists --print-errors "transgen" configure:20194: $? = 0 configure:20249: result: yes configure:20260: checking for TCLSERV_CLIENT_LIB configure:20268: $PKG_CONFIG --exists --print-errors "libtclserv_client >= 0.3" configure:20271: $? = 0 configure:20286: $PKG_CONFIG --exists --print-errors "libtclserv_client >= 0.3" configure:20289: $? = 0 configure:20344: result: yes configure:20400: checking for festival configure:20430: result: /usr configure:20605: creating ./config.status ## ---------------------- ## ## Running config.status. ## ## ---------------------- ## This file was extended by textos-genom config.status 1.0.2, which was generated by GNU Autoconf 2.69. Invocation command line was CONFIG_FILES = CONFIG_HEADERS = CONFIG_LINKS = CONFIG_COMMANDS = $ ./config.status on fluffy64-ubuntu1804 config.status:21424: creating textos-oprs.pc config.status:21424: creating textos-tclserv_client.pc config.status:21424: creating config.mk config.status:21424: creating Makefile config.status:21424: creating codels/Makefile config.status:21424: creating server/Makefile config.status:21424: creating textos.pc config.status:21424: creating local.mk ## ---------------- ## ## Cache variables. ## ## ---------------- ## ac_cv_build='x86_64-unknown-linux-gnu' ac_cv_c_bigendian='no' ac_cv_c_compiler_gnu='yes' ac_cv_cxx_compiler_gnu='yes' ac_cv_env_CCC_set='' ac_cv_env_CCC_value='' ac_cv_env_CC_set='set' ac_cv_env_CC_value='/usr/bin/gcc' ac_cv_env_CFLAGS_set='set' ac_cv_env_CFLAGS_value='-pipe -O3 -DNDEBUG' ac_cv_env_CPPFLAGS_set='set' ac_cv_env_CPPFLAGS_value='' ac_cv_env_CPP_set='set' ac_cv_env_CPP_value='/usr/bin/gcc -E' ac_cv_env_CXXCPP_set='set' ac_cv_env_CXXCPP_value='/usr/bin/g++ -E' ac_cv_env_CXXFLAGS_set='set' ac_cv_env_CXXFLAGS_value='-pipe -O3 -DNDEBUG' ac_cv_env_CXX_set='set' ac_cv_env_CXX_value='/usr/bin/g++' ac_cv_env_F77_set='' ac_cv_env_F77_value='' ac_cv_env_FFLAGS_set='' ac_cv_env_FFLAGS_value='' ac_cv_env_GENOM_CFLAGS_set='' ac_cv_env_GENOM_CFLAGS_value='' ac_cv_env_GENOM_LIBS_set='' ac_cv_env_GENOM_LIBS_value='' ac_cv_env_LDFLAGS_set='set' ac_cv_env_LDFLAGS_value='' ac_cv_env_LIBS_set='set' ac_cv_env_LIBS_value='' ac_cv_env_PKG_CONFIG_set='set' ac_cv_env_PKG_CONFIG_value='/usr/bin/pkg-config' ac_cv_env_TCLSERV_CFLAGS_set='' ac_cv_env_TCLSERV_CFLAGS_value='' ac_cv_env_TCLSERV_CLIENT_LIB_CFLAGS_set='' ac_cv_env_TCLSERV_CLIENT_LIB_CFLAGS_value='' ac_cv_env_TCLSERV_CLIENT_LIB_LIBS_set='' ac_cv_env_TCLSERV_CLIENT_LIB_LIBS_value='' ac_cv_env_TCLSERV_LIBS_set='' ac_cv_env_TCLSERV_LIBS_value='' ac_cv_env_TRANSGEN_CFLAGS_set='' ac_cv_env_TRANSGEN_CFLAGS_value='' ac_cv_env_TRANSGEN_LIBS_set='' ac_cv_env_TRANSGEN_LIBS_value='' ac_cv_env_XENO_CONFIG_set='' ac_cv_env_XENO_CONFIG_value='' ac_cv_env_build_alias_set='' ac_cv_env_build_alias_value='' ac_cv_env_host_alias_set='' ac_cv_env_host_alias_value='' ac_cv_env_target_alias_set='' ac_cv_env_target_alias_value='' ac_cv_f77_compiler_gnu='yes' ac_cv_header_dlfcn_h='yes' ac_cv_header_inttypes_h='yes' ac_cv_header_memory_h='yes' ac_cv_header_stdc='yes' ac_cv_header_stdint_h='yes' ac_cv_header_stdlib_h='yes' ac_cv_header_string_h='yes' ac_cv_header_strings_h='yes' ac_cv_header_sys_cdefs_h='yes' ac_cv_header_sys_stat_h='yes' ac_cv_header_sys_types_h='yes' ac_cv_header_unistd_h='yes' ac_cv_host='x86_64-unknown-linux-gnu' ac_cv_objext='o' ac_cv_path_EGREP='/bin/grep -E' ac_cv_path_GREP='/bin/grep' ac_cv_path_MKDEP='/opt/openrobots/bin/mkdep' ac_cv_path_install='/usr/bin/install -c' ac_cv_prog_CPP='/usr/bin/gcc -E' ac_cv_prog_CXXCPP='/usr/bin/g++ -E' ac_cv_prog_ac_ct_AR='ar' ac_cv_prog_ac_ct_CC='/usr/bin/gcc' ac_cv_prog_ac_ct_F77='f77' ac_cv_prog_ac_ct_RANLIB='ranlib' ac_cv_prog_ac_ct_STRIP='strip' ac_cv_prog_cc_c89='' ac_cv_prog_cc_g='yes' ac_cv_prog_cxx_g='yes' ac_cv_prog_f77_g='yes' ac_cv_robot_mkdep='yes' ac_cv_search_atan='none required' ac_cv_search_fabs='-lm' lt_cv_deplibs_check_method='pass_all' lt_cv_file_magic_cmd='$MAGIC_CMD' lt_cv_file_magic_test_file='' lt_cv_ld_reload_flag='-r' lt_cv_objdir='.libs' lt_cv_path_LD='/usr/bin/ld' lt_cv_path_LDCXX='/usr/bin/ld -m elf_x86_64' lt_cv_path_NM='/usr/bin/nm -B' lt_cv_path_SED='/bin/sed' lt_cv_prog_compiler_c_o='yes' lt_cv_prog_compiler_c_o_CXX='yes' lt_cv_prog_compiler_c_o_F77='yes' lt_cv_prog_compiler_pic_works='yes' lt_cv_prog_compiler_pic_works_CXX='yes' lt_cv_prog_compiler_pic_works_F77='yes' lt_cv_prog_compiler_rtti_exceptions='no' lt_cv_prog_compiler_static_works='yes' lt_cv_prog_compiler_static_works_CXX='yes' lt_cv_prog_compiler_static_works_F77='yes' lt_cv_prog_gnu_ld='yes' lt_cv_prog_gnu_ldcxx='yes' lt_cv_sys_global_symbol_pipe='sed -n -e '"'"'s/^.*[ ]\([ABCDGIRSTW][ABCDGIRSTW]*\)[ ][ ]*\([_A-Za-z][_A-Za-z0-9]*\)$/\1 \2 \2/p'"'" lt_cv_sys_global_symbol_to_c_name_address='sed -n -e '"'"'s/^: \([^ ]*\) $/ {\"\1\", (lt_ptr) 0},/p'"'"' -e '"'"'s/^[BCDEGRST] \([^ ]*\) \([^ ]*\)$/ {"\2", (lt_ptr) \&\2},/p'"'" lt_cv_sys_global_symbol_to_cdecl='sed -n -e '"'"'s/^. .* \(.*\)$/extern int \1;/p'"'" lt_cv_sys_lib_dlsearch_path_spec='/usr/lib64 /lib64 /usr/lib/x86_64-linux-gnu/libfakeroot /usr/local/lib /usr/local/lib/x86_64-linux-gnu /lib/x86_64-linux-gnu /usr/lib/x86_64-linux-gnu /lib32 /usr/lib32 ' lt_cv_sys_lib_search_path_spec='/usr/lib64 /lib64 /usr/local/lib64' lt_cv_sys_max_cmd_len='1572864' lt_lt_cv_prog_compiler_c_o='"yes"' lt_lt_cv_prog_compiler_c_o_CXX='"yes"' lt_lt_cv_prog_compiler_c_o_F77='"yes"' lt_lt_cv_sys_global_symbol_pipe='"sed -n -e '"'"'s/^.*[ ]\\([ABCDGIRSTW][ABCDGIRSTW]*\\)[ ][ ]*\\([_A-Za-z][_A-Za-z0-9]*\\)\$/\\1 \\2 \\2/p'"'"'"' lt_lt_cv_sys_global_symbol_to_c_name_address='"sed -n -e '"'"'s/^: \\([^ ]*\\) \$/ {\\\"\\1\\\", (lt_ptr) 0},/p'"'"' -e '"'"'s/^[BCDEGRST] \\([^ ]*\\) \\([^ ]*\\)\$/ {\"\\2\", (lt_ptr) \\&\\2},/p'"'"'"' lt_lt_cv_sys_global_symbol_to_cdecl='"sed -n -e '"'"'s/^. .* \\(.*\\)\$/extern int \\1;/p'"'"'"' pkg_cv_GENOM_CFLAGS='-I/opt/openrobots/include' pkg_cv_GENOM_LIBS='-L/opt/openrobots/lib -Wl,-rpath,/opt/openrobots/lib -lgenom -Wl,-rpath,/opt/openrobots/lib -lposterLib -lcomLib -lportLib -lrt -lm -ldl' pkg_cv_TCLSERV_CFLAGS='-I/opt/openrobots/include' pkg_cv_TCLSERV_CLIENT_LIB_CFLAGS='-I/opt/openrobots/include' pkg_cv_TCLSERV_CLIENT_LIB_LIBS='-L/opt/openrobots/lib -Wl,-rpath,/opt/openrobots/lib -ltclserv_client' pkg_cv_TCLSERV_LIBS='' pkg_cv_TRANSGEN_CFLAGS='-I/opt/openrobots/include/transgen -I/opt/openrobots/include/openprs' pkg_cv_TRANSGEN_LIBS='-L/opt/openrobots/lib -Wl,-rpath,/opt/openrobots/lib -loprs-com -Wl,-rpath,/opt/openrobots/lib -lOPList' robot_cv_gcc_pthread='yes' ## ----------------- ## ## Output variables. ## ## ----------------- ## ABI_VERSION_INFO='' AR='ar' CC='/usr/bin/gcc' CFLAGS='-pipe -O3 -DNDEBUG -pthread' CPP='/usr/bin/gcc -E' CPPFLAGS='' CXX='/usr/bin/g++' CXXCPP='/usr/bin/g++ -E' CXXFLAGS='-pipe -O3 -DNDEBUG' DEFS='-DPACKAGE_NAME=\"textos-genom\" -DPACKAGE_TARNAME=\"textos-genom\" -DPACKAGE_VERSION=\"1.0.2\" -DPACKAGE_STRING=\"textos-genom\ 1.0.2\" -DPACKAGE_BUGREPORT=\"anthony.mallet@laas.fr\" -DPACKAGE_URL=\"\" -DSTDC_HEADERS=1 -DHAVE_SYS_TYPES_H=1 -DHAVE_SYS_STAT_H=1 -DHAVE_STDLIB_H=1 -DHAVE_STRING_H=1 -DHAVE_MEMORY_H=1 -DHAVE_STRINGS_H=1 -DHAVE_INTTYPES_H=1 -DHAVE_STDINT_H=1 -DHAVE_UNISTD_H=1 -DHAVE_DLFCN_H=1 -DHAVE_SYS_CDEFS_H=1' DSYMUTIL='' ECHO='/bin/echo' ECHO_C='' ECHO_N='-n' ECHO_T='' EGREP='/bin/grep -E' ENDIANNESS='' EXEEXT='' EXTRA_INCLUDES='' EXTRA_LIBS='' EXTRA_PKGCONFIG='' EXTRA_SUBDIRS='' F77='f77' FESTIVAL_CFLAGS='-I/usr/include/speech_tools' FESTIVAL_PREFIX='/usr' FFLAGS='-g -O2' GENOM_CFLAGS='-I/opt/openrobots/include' GENOM_LIBS='-L/opt/openrobots/lib -Wl,-rpath,/opt/openrobots/lib -lgenom -Wl,-rpath,/opt/openrobots/lib -lposterLib -lcomLib -lportLib -lrt -lm -ldl' GREP='/bin/grep' HAS_TCL='yes' INSTALL_DATA='${INSTALL} -m 644' INSTALL_PROGRAM='${INSTALL}' INSTALL_SCRIPT='${INSTALL}' LANG_CXX='yes' LDFLAGS=' -pthread' LIBMATH='-lm ' LIBOBJS='' LIBS='-lm ' LIBTOOL='$(SHELL) $(top_builddir)/libtool' LIBTOOL_DEPS='autoconf/ltmain.sh' LN_S='ln -s' LTLIBOBJS='' MKDEP='/opt/openrobots/bin/mkdep' NMEDIT='' OBJEXT='o' OSAPI='posix' PACKAGE_BUGREPORT='anthony.mallet@laas.fr' PACKAGE_NAME='textos-genom' PACKAGE_STRING='textos-genom 1.0.2' PACKAGE_TARNAME='textos-genom' PACKAGE_URL='' PACKAGE_VERSION='1.0.2' PATH_SEPARATOR=':' PKG_CONFIG='/usr/bin/pkg-config' RANLIB='ranlib' SED='/bin/sed' SHELL='/bin/sh' STRIP='strip' TCLSERV_CFLAGS='-I/opt/openrobots/include' TCLSERV_CLIENT_LIB_CFLAGS='-I/opt/openrobots/include' TCLSERV_CLIENT_LIB_LIBS='-L/opt/openrobots/lib -Wl,-rpath,/opt/openrobots/lib -ltclserv_client' TCLSERV_LIBS='' TCL_CONFIG_PATH='/usr/lib/x86_64-linux-gnu/' TCL_CPPFLAGS='-I/usr/include/tcl8.6' TCL_LDFLAGS='-L/usr/lib/x86_64-linux-gnu -ltcl8.6' TRANSGEN_CFLAGS='-I/opt/openrobots/include/transgen -I/opt/openrobots/include/openprs' TRANSGEN_LIBS='-L/opt/openrobots/lib -Wl,-rpath,/opt/openrobots/lib -loprs-com -Wl,-rpath,/opt/openrobots/lib -lOPList' XENO_CONFIG='' ac_ct_CC='/usr/bin/gcc' ac_ct_CXX='' ac_ct_F77='f77' bindir='${exec_prefix}/bin' build='x86_64-unknown-linux-gnu' build_alias='' build_cpu='x86_64' build_os='linux-gnu' build_vendor='unknown' datadir='${datarootdir}' datarootdir='${prefix}/share' docdir='${datarootdir}/doc/${PACKAGE_TARNAME}' dvidir='${docdir}' exec_prefix='${prefix}' host='x86_64-unknown-linux-gnu' host_alias='' host_cpu='x86_64' host_os='linux-gnu' host_vendor='unknown' htmldir='${docdir}' includedir='${prefix}/include' infodir='/opt/openrobots/info' libdir='${exec_prefix}/lib' libexecdir='${exec_prefix}/libexec' localedir='${datarootdir}/locale' localstatedir='${prefix}/var' mandir='/opt/openrobots/man' oldincludedir='/usr/include' pdfdir='${docdir}' prefix='/opt/openrobots' program_transform_name='s,x,x,' psdir='${docdir}' runstatedir='${localstatedir}/run' sbindir='${exec_prefix}/sbin' sharedstatedir='${prefix}/com' sysconfdir='${prefix}/etc' target_alias='' ## ----------- ## ## confdefs.h. ## ## ----------- ## /* confdefs.h */ #define PACKAGE_NAME "textos-genom" #define PACKAGE_TARNAME "textos-genom" #define PACKAGE_VERSION "1.0.2" #define PACKAGE_STRING "textos-genom 1.0.2" #define PACKAGE_BUGREPORT "anthony.mallet@laas.fr" #define PACKAGE_URL "" #define STDC_HEADERS 1 #define HAVE_SYS_TYPES_H 1 #define HAVE_SYS_STAT_H 1 #define HAVE_STDLIB_H 1 #define HAVE_STRING_H 1 #define HAVE_MEMORY_H 1 #define HAVE_STRINGS_H 1 #define HAVE_INTTYPES_H 1 #define HAVE_STDINT_H 1 #define HAVE_UNISTD_H 1 #define HAVE_DLFCN_H 1 #define HAVE_SYS_CDEFS_H 1 configure: exit 0