robotpkg bulk build results

Log for Ubuntu-19.04-x86_64 (Back)

--- Syncing bulk database ---------------------------------------- setting Ubuntu-19.04-x86_64 as running --- Updating robotpkg -------------------------------------------- Pulling /local/robotpkg/var/lib/robotpkg/ From git://git.openrobots.org/robots/robotpkg 4e98cc0b..e34296b3 master -> origin/master HEAD is now at e34296b3 [mk/internal] Fix preduce macro when argument contains commas Updating pkgtools/pkg_install ===> Updating for pkg_install-20110805.9 pkg_install-20110805.9 is already installed and up-to-date. Updating pkgtools/rbulkit ===> Updating for rbulkit-20181122 rbulkit-20181122 is already installed and up-to-date. Updating pkgtools/pkgrepo2deb ===> Updating for pkgrepo2deb-1.6.1 pkgrepo2deb-1.6.1 is already installed and up-to-date. --- Running build for bulk-rbulk ------------------------------- ===> Sorting packages for rbulk base set Scanning sysutils/ros-diagnostics:*~doc Scanning graphics/qt-qgv:*~doc Scanning manipulation/genManip-genom:*~doc Scanning robots/nao-robot:*~doc Scanning middleware/hpp-template-corba:*~doc Scanning hardware/gyroKVH1000:*~doc Scanning lang/ros-genlisp:*~doc Scanning architecture/genom3:*~doc Scanning lang/ros-message-runtime:*~doc Scanning sysutils/hrp2-bringup:*~doc Scanning middleware/naoqi:*~doc Scanning devel/log4cxx:*~doc Scanning localization/insitu:*~doc Scanning math/boost-numeric-bindings:*~doc Scanning archivers/pax:*~doc Scanning middleware/openni:*~doc Scanning path/maneuver-genom3:*~doc Scanning sysutils/tk3-flash:*~doc Scanning mapping/ros-laser-geometry:*~doc Scanning doc/py-hpp-practicals:*~doc Scanning speech/gspeett:*~doc Scanning math/ros-geometry2:*~doc Scanning math/meschach:*~doc Scanning audio/ogi-voice-as-diphone:*~doc Scanning architecture/genom3-pocolibs:*~doc Scanning hardware/cwiid:*~doc Scanning lang/ros-geneus:*~doc Scanning devel/mkdep:*~doc Scanning devel/libedit:*~doc Scanning image/jafar-image:*~doc Scanning math/ros-eigen-stl-containers:*~doc Scanning motion/uavpos-genom3:*~doc Scanning motion/uavatt-genom3:*~doc Scanning audio/textos-genom:*~doc Scanning audio/speett-genom:*~doc Scanning graphics/jafar-gdhe:*~doc Scanning mapping/mapkit:*~doc [mapping/mapkit:*~doc] Warning: the LICENSE of mapping/mapkit is undefined. Scanning middleware/ros-actionlib:*~doc Scanning pkgtools/rbulkit:*~doc Scanning pkgtools/pkgin:*~doc Scanning motion/phynt-genom3:*~doc Scanning audio/clone-genom:*~doc [audio/clone-genom:*~doc] Warning: the LICENSE of audio/clone-genom is undefined. Scanning doc/demo-genom:*~doc Scanning robots/neobotix-libs:*~doc Scanning robots/player20-libs:*~doc Scanning pkgtools/pkg_install:*~doc Scanning motion/nhfc-genom3:*~doc Scanning path/hpp-fcl:*~doc Scanning sysutils/arduio:*~doc Scanning image/stereopixel-genom:*~doc Scanning robots/hrpsys-base:*~doc Scanning optimization/acado:*~doc Scanning hardware/GPSNovatel:*~doc [hardware/GPSNovatel:*~doc] Warning: the LICENSE of hardware/GPSNovatel is undefined. Scanning graphics/ros-rqt-common-plugins:*~doc Scanning mapping/worldmodelgrid3d:*~doc [mapping/worldmodelgrid3d:*~doc] Warning: the LICENSE of mapping/worldmodelgrid3d is undefined. Scanning devel/ros-catkin:*~doc Scanning robots/rmp440-libs:*~doc Scanning motion/sot-pattern-generator:*~doc Scanning graphics/ros-kdl-parser:*~doc Scanning motion/orocos-kdl:orocos-kdl>=1.3 Scanning devel/orocos-log4cpp:*~doc Scanning robots/ivmob-libs:*~doc Scanning knowledge/liboro:*~doc [knowledge/liboro:*~doc] Warning: DOXYGEN_PLIST_DIR in knowledge/liboro is deprecated. [knowledge/liboro:*~doc] Warning: use DYNAMIC_PLIST_DIRS instead. Scanning middleware/ros-comm:*~doc Scanning path/hpp-statistics:*~doc Scanning mapping/segkit:*~doc [mapping/segkit:*~doc] Warning: the LICENSE of mapping/segkit is undefined. Scanning devel/ros-filters:*~doc Scanning net/libtclserv_client:*~doc Scanning motion/sot-dynamic:*~doc Scanning mapping/worldmodelgrid3dg-genom:*~doc [mapping/worldmodelgrid3dg-genom:*~doc] Warning: the LICENSE of mapping/worldmodelgrid3dg-genom is undefined. Scanning robots/mor-libs:*~doc Scanning robots/rmp-libs:*~doc Scanning supervision/transgen:*~doc Scanning math/hrp2-dynamics:*~doc Scanning path/hpp-walkgen:*~doc Scanning path/jrl-walkgen:*~doc Scanning path/hpp-core:*~doc Scanning optimization/ipopt:*~doc Scanning hardware/velodyne-genom:*~doc Scanning meta-pkgs/minnie:*~doc Scanning devel/tinyxml:*~doc Scanning math/ros-angles:*~doc Scanning math/jrl-dynamics:*~doc Scanning optimization/roboptim-trajectory:*~doc Scanning hardware/mouse3d-genom:*~doc Scanning hardware/platine-genom:*~doc Scanning lang/ros-gencpp:*~doc Scanning graphics/laaswm:*~doc Scanning graphics/gdhe:*~doc Scanning devel/boost-headers:*~doc Scanning image/viman-genom:*~doc Scanning localization/optitrack-genom3:*~doc Scanning hardware/sahand-genom:*~doc [hardware/sahand-genom:*~doc] Warning: the LICENSE of hardware/sahand-genom is undefined. Scanning interfaces/abstract-robot-dynamics:*~doc Scanning sysutils/y2l:*~doc Scanning motion/sot-core:*~doc Scanning mapping/libdtm:*~doc [mapping/libdtm:*~doc] Warning: the LICENSE of mapping/libdtm is undefined. Scanning devel/ros-pluginlib:*~doc Scanning image/viam-genom:*~doc Scanning image/niut-genom:*~doc Scanning middleware/ros-genmsg:*~doc Scanning motion/softMotion-libs:*~doc Scanning path/hpp-wholebody-step:*~doc Scanning hardware/gbx-hokuyo-aist:*~doc Scanning hardware/force-genom:*~doc [hardware/force-genom:*~doc] Warning: the LICENSE of hardware/force-genom is undefined. Scanning lang/ros-gennodejs:*~doc Scanning sysutils/py-aafigure:*~doc Scanning middleware/ros-dynamic-reconfigure:*~doc Scanning math/sensFusion-libs:*~doc Scanning interfaces/ros-navigation-msgs:*~doc Scanning meta-pkgs/ros-robot:*~doc Scanning math/gbM:*~doc Scanning hardware/sick-genom:*~doc [hardware/sick-genom:*~doc] Warning: the LICENSE of hardware/sick-genom is undefined. Scanning interfaces/abstract-gik-task:*~doc Scanning simulation/gazebo-ros-pkgs:*~doc Scanning devel/gbx-share:*~doc Scanning middleware/mavlink1:*~doc Scanning pkgtools/robotpkgdb:*~doc Scanning interfaces/humanoid-nav-msgs:*~doc Scanning meta-pkgs/gearbox:*~doc Scanning graphics/ros-rqt:*~doc Scanning net/ros-resource-retriever:*~doc Scanning architecture/orocos-ocl:*~doc Scanning interfaces/ros-control-msgs:*~doc Scanning meta-pkgs/boost:*~doc Scanning devel/boost-jam:boost-jam>=1.52.0 Scanning graphics/collada-dom:*~doc Scanning mapping/regionMap-genom:*~doc Scanning devel/ros-nodelet-core:*~doc Scanning pkgtools/digest:*~doc Scanning localization/pom-genom3:*~doc Scanning localization/gps-genom3:*~doc Scanning image/ros-vision-opencv:*~doc Scanning interfaces/ros-common-msgs:*~doc Scanning meta-pkgs/hpp:*~doc Scanning graphics/robot-capsule-urdf:*~doc Scanning knowledge/oro-server:*~doc Scanning devel/ros-roscpp-core:*~doc Scanning sysutils/interceptty:*~doc Scanning sysutils/py-rospkg:*~doc Scanning graphics/coldman-genom:*~doc Scanning middleware/pocolibs:*~doc Scanning supervision/matlab-genomix:*~doc Scanning net/evart-stream:*~doc Scanning devel/ros-lint:*~doc Scanning devel/boost-jam:*~doc Scanning interfaces/ros-comm-msgs:*~doc Scanning devel/ros-bond-core:*~doc Scanning interfaces/ros-std-msgs:*~doc Scanning simulation/morse-yarp:*~doc Scanning graphics/Togl:*~doc Scanning image/coriander:*~doc Scanning path/libkdtp:*~doc Scanning pkgtools/url2robotpkg:*~doc Scanning archivers/bzip2:*~doc Scanning supervision/tcl-genomix:*~doc Scanning math/jafar-jmath:*~doc Scanning net/py-poco:*~doc Scanning devel/boost-build:*~doc Scanning mapping/zone-genom:*~doc [mapping/zone-genom:*~doc] Warning: the LICENSE of mapping/zone-genom is undefined. Scanning audio/sphinx2:*~doc Scanning simulation/optitrack-gazebo:*~doc Scanning graphics/ros-convex-decomposition:*~doc Scanning net/libfetch:*~doc Scanning devel/ros-xacro:*~doc Scanning mapping/dtm-genom:*~doc [mapping/dtm-genom:*~doc] Warning: the LICENSE of mapping/dtm-genom is undefined. Scanning hardware/gyroKVH5000:*~doc Scanning archivers/zlib:*~doc Scanning math/boost-numeric-bindings-v1:*~doc Scanning mapping/octomap:*~doc Scanning hardware/MTI:*~doc [hardware/MTI:*~doc] Warning: the LICENSE of hardware/MTI is undefined. Scanning sysutils/ros-console-bridge:*~doc Scanning middleware/omniORB:*~doc Scanning math/geometric-tools:*~doc Scanning robots/rflexclients:*~doc Scanning localization/ros-joint-state-publisher:*~doc Scanning localization/ros-robot-state-publisher:*~doc Scanning image/artoolkitplus:*~doc Scanning sysutils/alog:*~doc Scanning motion/ros-control:*~doc Scanning net/netshring:*~doc Scanning architecture/genom3-ros:*~doc Scanning simulation/mrsim-gazebo:*~doc Scanning lang/ros-genpy:*~doc Scanning meta-pkgs/ros-base:*~doc Scanning motion/py-sot-tools:*~doc Scanning graphics/simple-humanoid-description:*~doc Scanning archivers/libarchive:*~doc Scanning math/jrl-mathtools:*~doc Scanning image/libdc1394-1:*~doc Scanning doc/demo-genom3:*~doc Scanning audio/OGIlexicon:*~doc Scanning hardware/libftdi:*~doc Scanning sysutils/py-rosdep:*~doc Scanning supervision/genom3-openprs:*~doc Scanning devel/gbx-flexiport:*~doc Scanning graphics/ros-urdf:*~doc Scanning sysutils/console-bridge:*~doc Scanning devel/jafar-kernel:*~doc Scanning graphics/py-qt-gepetto-viewer-corba:*~doc Scanning hardware/openni-sensor:*~doc Scanning motion/py-orocos-kdl:*~doc Scanning math/ros-geometry:*~doc Scanning devel/boost-libs:*~doc Scanning graphics/ros-interactive-markers:*~doc Scanning hardware/serial:*~doc Scanning motion/ros-control-toolbox:*~doc Scanning hardware/dynamixel-genom3:*~doc Scanning path/libp3d:*~doc Scanning simulation/libmrsim:*~doc Scanning middleware/orocos-rtt:*~doc Scanning pkgtools/pkgrepo2deb:*~doc Scanning math/libccd:*~doc Scanning robots/mana-emergency:*~doc Scanning graphics/py-qt-hpp-plot:*~doc Scanning hardware/mccdaqft-genom3:*~doc Scanning hardware/joystick-genom3:*~doc Scanning audio/festvox-cmu-us-awb-arctic-hts:*~doc Scanning scripts/pilo-demo:*~doc Scanning robots/hrp2-machine:*~doc Scanning image/sift:*~doc Scanning devel/yaml-cpp:*~doc Scanning motion/orocos-kdl:*~doc Scanning lang/ros-message-generation:*~doc Scanning math/py-eigenpy:*~doc Scanning robots/tk3-matlab:*~doc Scanning robots/rmp400-genom:*~doc Scanning robots/rmp440-genom:*~doc Scanning localization/odokit:*~doc [localization/odokit:*~doc] Warning: the LICENSE of localization/odokit is undefined. Scanning devel/ros-realtime-tools:*~doc Scanning doc/boost-docs:*~doc Scanning pkgtools/libnbcompat:*~doc Scanning supervision/openprs:*~doc Scanning knowledge/jena:*~doc Scanning robots/scout-genom:*~doc [robots/scout-genom:*~doc] Warning: the LICENSE of robots/scout-genom is undefined. Scanning robots/hrp2-14:*~doc Scanning robots/rflex-genom:*~doc [robots/rflex-genom:*~doc] Warning: the LICENSE of robots/rflex-genom is undefined. Scanning robots/jloco-genom:*~doc [robots/jloco-genom:*~doc] Warning: the LICENSE of robots/jloco-genom is undefined. Scanning robots/ivmob-genom:*~doc Scanning net/rosix:*~doc Scanning meta-pkgs/ros-desktop:*~doc Scanning middleware/libjyarp:*~doc Scanning middleware/yarp:yarp>=2.3.64<2.3.70 Scanning math/hpp-pinocchio:*~doc Scanning math/pinocchio:pinocchio>=2.1.6<3.0.0 Scanning knowledge/py-oro:*~doc Scanning robots/play-genom:*~doc [robots/play-genom:*~doc] Warning: the LICENSE of robots/play-genom is undefined. Scanning graphics/urdfdom-headers:*~doc Scanning sysutils/py-catkin-pkg:*~doc Scanning path/hpp-manipulation-urdf:*~doc Scanning path/hpp-util:*~doc Scanning math/py-pinocchio:*~doc Scanning speech/dialogs:*~doc Scanning motion/dynamic-graph-bridge:*~doc Scanning architecture/genom:*~doc Scanning pkgtools/libtool:*~doc Scanning image/ros-image-common:*~doc Scanning graphics/py-qt-hpp-gepetto-viewer:*~doc Scanning hardware/sahand-kmod:*~doc Scanning pkgtools/robotpkg_chk:*~doc Scanning supervision/ros-executive-smach:*~doc Scanning math/eigen3:*~doc Scanning robots/hrp2-10:*~doc Scanning image/libdc1394:*~doc Scanning devel/ros-cmake-modules:*~doc Scanning mapping/regionMap-lib:*~doc Scanning graphics/urdfdom:*~doc Scanning motion/contlaw:*~doc [motion/contlaw:*~doc] Warning: the LICENSE of motion/contlaw is undefined. Scanning shell/eltclsh:*~doc Scanning middleware/py-yarp:*~doc Scanning math/pinocchio:*~doc Scanning math/eigen2:*~doc Scanning localization/libpom:*~doc Scanning net/genomix:*~doc Scanning image/viam-dc1394-driver:*~doc Scanning doc/hpp-doc:*~doc Scanning graphics/pqp:*~doc Scanning doc/robotpkg:*~doc Scanning motion/sot-romeo:*~doc Scanning sysutils/ros-rqt-graph:*~doc Scanning path/aspect-genom:*~doc [path/aspect-genom:*~doc] Warning: the LICENSE of path/aspect-genom is undefined. Scanning hardware/sickLib:*~doc Scanning www/picoweb:*~doc Scanning net/tclserv:*~doc Scanning image/opencv3:*~doc Scanning graphics/py-qt-gepetto-viewer:*~doc Scanning motion/locoDemo-genom:*~doc Scanning interfaces/openrobots2-idl:*~doc Scanning math/liblbfgs:*~doc Scanning net/zeromq:*~doc Scanning image/opencv2:*~doc Scanning image/viam-v4l-driver:*~doc Scanning image/libimages3d:*~doc Scanning lang/jython:*~doc Scanning audio/festlex-poslex:*~doc Scanning interfaces/jrl-mal:*~doc Scanning middleware/py-omniORBpy:*~doc Scanning math/tvmet:*~doc [math/tvmet:*~doc] Warning: the LICENSE of math/tvmet is undefined. Scanning math/jrl-dynamics-urdf:*~doc Scanning devel/cortex-sdk:*~doc Scanning devel/jsoncpp:*~doc [devel/jsoncpp:*~doc] Warning: DOXYGEN_PLIST_DIR in devel/jsoncpp is deprecated. [devel/jsoncpp:*~doc] Warning: use DYNAMIC_PLIST_DIRS instead. Scanning graphics/assimp:*~doc Scanning sysutils/ros-rqt-plot:*~doc Scanning path/hpp-manipulation:*~doc Scanning path/ndd-genom:*~doc [path/ndd-genom:*~doc] Warning: the LICENSE of path/ndd-genom is undefined. Scanning path/p3d-genom:*~doc [path/p3d-genom:*~doc] Warning: the LICENSE of path/p3d-genom is undefined. Scanning optimization/qpoases:*~doc Scanning interfaces/openrobots-idl:*~doc Scanning middleware/yarp:*~doc Scanning middleware/openni2:*~doc Scanning archivers/lz4:*~doc Scanning supervision/transgen3:*~doc Scanning graphics/ros-qt-gui-core:*~doc Scanning sysutils/hrp2-computer-monitor:*~doc Scanning simulation/morse:*~doc Scanning hardware/velodyne-libs:*~doc Scanning middleware/openrtm-aist:*~doc Scanning net/tclpcap:*~doc Scanning image/libstereopixel:*~doc Scanning motion/pilo-genom:*~doc [motion/pilo-genom:*~doc] Warning: the LICENSE of motion/pilo-genom is undefined. Scanning graphics/primitiveShapes-libs:*~doc Scanning simulation/openhrp3:*~doc Scanning hardware/daqflex-libs:*~doc Scanning optimization/roboptim-core-ipopt-plugin:*~doc [optimization/roboptim-core-ipopt-plugin:*~doc] Warning: DOXYGEN_PLIST_DIR in optimization/roboptim-core-ipopt-plugin is deprecated. [optimization/roboptim-core-ipopt-plugin:*~doc] Warning: use DYNAMIC_PLIST_DIRS instead. Scanning pkgtools/tnftp:*~doc Scanning image/viam-libs:*~doc Scanning devel/ros-class-loader:*~doc Scanning graphics/grh2:*~doc Scanning hardware/sahand-libs:*~doc Scanning image/visp:*~doc Scanning audio/festlex-cmu:*~doc Scanning devel/swig:*~doc Scanning sysutils/ros-console:*~doc Scanning simulation/mrsim-genom3:*~doc Scanning hardware/gyro-libs:*~doc Scanning path/hpp-constraints:*~doc Scanning math/t3d:*~doc [math/t3d:*~doc] Warning: DOXYGEN_PLIST_DIR in math/t3d is deprecated. [math/t3d:*~doc] Warning: use DYNAMIC_PLIST_DIRS instead. Scanning robots/romeo-description:*~doc Scanning robots/tk3-mikrokopter:*~doc Scanning graphics/ros-geometric-shapes:*~doc Scanning sysutils/ros-rospack:*~doc Scanning sysutils/tth:*~doc Scanning knowledge/pellet:*~doc Scanning robots/mikrokopter-genom3:*~doc Scanning image/jafar-correl:*~doc Scanning motion/py-dynamic-graph:*~doc Scanning sysutils/ros-rviz:*~doc Scanning meta-pkgs/orocos-toolchain:*~doc Scanning meta-pkgs/jafar:*~doc Scanning path/py-hpp-manipulation-corba:*~doc Scanning math/lapack:*~doc Scanning sysutils/arduio-genom3:*~doc Scanning localization/hueblob-genom:*~doc Scanning graphics/openvrml-libs:*~doc Scanning pkgtools/install-sh:*~doc Scanning localization/segloc-genom:*~doc [localization/segloc-genom:*~doc] Warning: the LICENSE of localization/segloc-genom is undefined. Scanning graphics/ros-python-qt-binding:*~doc Scanning graphics/vcglib:*~doc [graphics/vcglib:*~doc] Warning: DOXYGEN_PLIST_DIR in graphics/vcglib is deprecated. [graphics/vcglib:*~doc] Warning: use DYNAMIC_PLIST_DIRS instead. Scanning graphics/coldman-libs:*~doc Scanning motion/dynamic-graph:*~doc Scanning motion/ros-orocos-kinematics-dynamics:*~doc Scanning sysutils/py-rosdistro:*~doc Scanning meta-pkgs/mana:*~doc Scanning scripts/py-sot-application:*~doc Scanning audio/festival:*~doc Scanning middleware/ace:*~doc Scanning math/ros-random-numbers:*~doc Scanning localization/mocap-genom:*~doc Scanning net/evart-client:*~doc [net/evart-client:*~doc] Warning: DOXYGEN_PLIST_DIR in net/evart-client is deprecated. [net/evart-client:*~doc] Warning: use DYNAMIC_PLIST_DIRS instead. Scanning image/openni-nite:*~doc Scanning devel/ros-ros:*~doc Scanning graphics/flann:*~doc Scanning graphics/laaswm-libs:*~doc Scanning graphics/gerard-bauzil:*~doc Scanning interfaces/genBasic-genom:*~doc Scanning optimization/roboptim-core:*~doc Scanning robots/rmp440-genom3:*~doc Scanning localization/gyro-genom:*~doc [localization/gyro-genom:*~doc] Warning: the LICENSE of localization/gyro-genom is undefined. Scanning graphics/sun-java3d:*~doc Scanning graphics/py-qt-hpp-gui:*~doc Scanning pkgtools/pkg-config:*~doc Scanning localization/MTI-genom:*~doc [localization/MTI-genom:*~doc] Warning: the LICENSE of localization/MTI-genom is undefined. Scanning localization/GPS-genom:*~doc Scanning localization/pom-genom:*~doc Scanning image/libraw1394:*~doc Scanning doc/py-hpp-tutorial:*~doc Scanning graphics/ros-ivcon:*~doc Scanning motion/dynamic-graph-bridge-msgs:*~doc Scanning lang/sun-jdk:*~doc Scanning interfaces/genPos-genom:*~doc Scanning interfaces/genHum-genom:*~doc Scanning path/py-hpp-corbaserver:*~doc Scanning path/py-hpp-corbaserver:py37-hpp-corbaserver-4.7.0~!doc Scanning path/py-hpp-corbaserver:py36-hpp-corbaserver-4.7.0~!doc Scanning path/py-hpp-corbaserver:py35-hpp-corbaserver-4.7.0~!doc Scanning path/py-hpp-corbaserver:py34-hpp-corbaserver-4.7.0~!doc Scanning path/py-hpp-corbaserver:py27-hpp-corbaserver-4.7.0~!doc Scanning path/py-hpp-corbaserver:py37-hpp-corbaserver-4.7.0~doc Scanning path/py-hpp-corbaserver:py36-hpp-corbaserver-4.7.0~doc Scanning path/py-hpp-corbaserver:py35-hpp-corbaserver-4.7.0~doc Scanning path/py-hpp-corbaserver:py34-hpp-corbaserver-4.7.0~doc Scanning interfaces/genHum-genom:genHum-genom-1.1r1~!doc Scanning interfaces/genPos-genom:genPos-genom-0.3r1~!doc Scanning doc/py-hpp-tutorial:py37-hpp-tutorial-4.7.0~!doc Scanning doc/py-hpp-tutorial:py36-hpp-tutorial-4.7.0~!doc Scanning doc/py-hpp-tutorial:py35-hpp-tutorial-4.7.0~!doc Scanning doc/py-hpp-tutorial:py34-hpp-tutorial-4.7.0~!doc Scanning doc/py-hpp-tutorial:py27-hpp-tutorial-4.7.0~!doc Scanning doc/py-hpp-tutorial:py37-hpp-tutorial-4.7.0~doc Scanning doc/py-hpp-tutorial:py36-hpp-tutorial-4.7.0~doc Scanning doc/py-hpp-tutorial:py35-hpp-tutorial-4.7.0~doc Scanning doc/py-hpp-tutorial:py34-hpp-tutorial-4.7.0~doc Scanning localization/pom-genom:pom-genom-0.7~!doc Scanning localization/GPS-genom:GPS-genom-1.7~!doc Scanning localization/MTI-genom:MTI-genom-0.4r1~!doc [localization/MTI-genom:MTI-genom-0.4r1~!doc] Warning: the LICENSE of localization/MTI-genom is undefined. Scanning graphics/py-qt-hpp-gui:py37-qt5-hpp-gui-4.7.0r1~!doc Scanning graphics/py-qt-hpp-gui:py37-qt4-hpp-gui-4.7.0r1~!doc Scanning graphics/py-qt-hpp-gui:py36-qt5-hpp-gui-4.7.0r1~!doc Scanning graphics/py-qt-hpp-gui:py36-qt4-hpp-gui-4.7.0r1~!doc Scanning graphics/py-qt-hpp-gui:py35-qt5-hpp-gui-4.7.0r1~!doc Scanning graphics/py-qt-hpp-gui:py35-qt4-hpp-gui-4.7.0r1~!doc Scanning graphics/py-qt-hpp-gui:py34-qt5-hpp-gui-4.7.0r1~!doc Scanning graphics/py-qt-hpp-gui:py34-qt4-hpp-gui-4.7.0r1~!doc Scanning graphics/py-qt-hpp-gui:py27-qt5-hpp-gui-4.7.0r1~!doc Scanning graphics/py-qt-hpp-gui:py27-qt4-hpp-gui-4.7.0r1~!doc Scanning graphics/py-qt-hpp-gui:py37-qt5-hpp-gui-4.7.0r1~doc Scanning graphics/py-qt-hpp-gui:py37-qt4-hpp-gui-4.7.0r1~doc Scanning graphics/py-qt-hpp-gui:py36-qt5-hpp-gui-4.7.0r1~doc Scanning graphics/py-qt-hpp-gui:py36-qt4-hpp-gui-4.7.0r1~doc Scanning graphics/py-qt-hpp-gui:py35-qt5-hpp-gui-4.7.0r1~doc Scanning graphics/py-qt-hpp-gui:py35-qt4-hpp-gui-4.7.0r1~doc Scanning graphics/py-qt-hpp-gui:py34-qt5-hpp-gui-4.7.0r1~doc Scanning graphics/py-qt-hpp-gui:py34-qt4-hpp-gui-4.7.0r1~doc Scanning graphics/py-qt-hpp-gui:py27-qt4-hpp-gui-4.7.0r1~doc Scanning localization/gyro-genom:gyro-genom-0.3r1~gyroKVH5000 [localization/gyro-genom:gyro-genom-0.3r1~gyroKVH5000] Warning: the LICENSE of localization/gyro-genom is undefined. Scanning localization/gyro-genom:gyro-genom-0.3r1~gyroKVH1000+!doc [localization/gyro-genom:gyro-genom-0.3r1~gyroKVH1000+!doc] Warning: the LICENSE of localization/gyro-genom is undefined. Scanning robots/rmp440-genom3:rmp440-genom3-0.1r2~codels+openprs+ros-client-c+ros-client-ros+ros-server+!* Scanning robots/rmp440-genom3:rmp440-genom3-0.1r2~pocolibs-client-c+codels+openprs+pocolibs-server+!doc+!* Scanning interfaces/genBasic-genom:genBasic-genom-0.4r1~!doc Scanning middleware/openni:openni-1.5.2.23r1~sse3+!doc Scanning hardware/openni-sensor:openni-sensor-5.1.0.41r1~sse3+!doc Scanning net/evart-client:evart-client-2.2~!doc Scanning localization/mocap-genom:mocap-genom-1.3~!doc Scanning audio/festival:festival-1.96~!doc Scanning scripts/py-sot-application:py37-sot-application-1.0.0r3~!doc Scanning scripts/py-sot-application:py36-sot-application-1.0.0r3~!doc Scanning scripts/py-sot-application:py35-sot-application-1.0.0r3~!doc Scanning scripts/py-sot-application:py34-sot-application-1.0.0r3~!doc Scanning path/p3d-genom:p3d-genom>=1.1~rmp400 [path/p3d-genom:p3d-genom>=1.1~rmp400] Warning: the LICENSE of path/p3d-genom is undefined. Scanning path/libp3d:libp3d-1.4r2~rmp400+!doc Scanning motion/pilo-genom:pilo-genom>=1.2~rmp400 [motion/pilo-genom:pilo-genom>=1.2~rmp400] Warning: the LICENSE of motion/pilo-genom is undefined. Scanning robots/rmp400-genom:rmp400-genom-0.12~gyro+!doc Scanning sysutils/py-rosdistro:py37-rosdistro-0.3.5~!doc Scanning sysutils/py-rosdistro:py36-rosdistro-0.3.5~!doc Scanning sysutils/py-rosdistro:py35-rosdistro-0.3.5~!doc Scanning sysutils/py-rosdistro:py34-rosdistro-0.3.5~!doc Scanning graphics/coldman-libs:coldman-libs-1.4~!doc Scanning graphics/vcglib:vcglib-20100824~!doc Scanning localization/segloc-genom:segloc-genom-0.3~!doc [localization/segloc-genom:segloc-genom-0.3~!doc] Warning: the LICENSE of localization/segloc-genom is undefined. Scanning localization/hueblob-genom:hueblob-genom-1.4~!doc Scanning sysutils/arduio-genom3:arduio-genom3-1.3~codels+openprs+ros-client-c+ros-client-ros+ros-server+!* Scanning sysutils/arduio-genom3:arduio-genom3-1.3~pocolibs-client-c+codels+openprs+pocolibs-server+!doc+!* Scanning path/py-hpp-manipulation-corba:py37-hpp-manipulation-corba-4.7.0~!doc Scanning path/py-hpp-manipulation-corba:py36-hpp-manipulation-corba-4.7.0~!doc Scanning path/py-hpp-manipulation-corba:py35-hpp-manipulation-corba-4.7.0~!doc Scanning path/py-hpp-manipulation-corba:py34-hpp-manipulation-corba-4.7.0~!doc Scanning path/py-hpp-manipulation-corba:py27-hpp-manipulation-corba-4.7.0~!doc Scanning path/py-hpp-manipulation-corba:py37-hpp-manipulation-corba-4.7.0~doc Scanning path/py-hpp-manipulation-corba:py36-hpp-manipulation-corba-4.7.0~doc Scanning path/py-hpp-manipulation-corba:py35-hpp-manipulation-corba-4.7.0~doc Scanning path/py-hpp-manipulation-corba:py34-hpp-manipulation-corba-4.7.0~doc Scanning image/ros-vision-opencv:ros-vision-opencv-1.13~!doc Scanning robots/mikrokopter-genom3:mikrokopter-genom3-2.0.1~codels+openprs+ros-client-c+ros-client-ros+ros-server+!* Scanning robots/mikrokopter-genom3:mikrokopter-genom3-2.0.1~pocolibs-client-c+codels+openprs+pocolibs-server+!doc+!* Scanning knowledge/pellet:pellet-2.3.0~!doc Scanning math/t3d:libt3d-2.6~!doc Scanning path/hpp-constraints:hpp-constraints-4.7.0~!doc Scanning simulation/mrsim-genom3:mrsim-genom3-2.1.1~codels+openprs+ros-client-c+ros-client-ros+ros-server+!* Scanning simulation/mrsim-genom3:mrsim-genom3-2.1.1~pocolibs-client-c+codels+openprs+pocolibs-server+!doc+!* Scanning devel/swig:swig-2.0.4~!doc Scanning image/visp:visp-2.6.1r2~!doc Scanning image/viam-libs:viam-libs-1.12r1~!doc Scanning image/viam-libs:viam-libs-1.12r1~doc Scanning pkgtools/tnftp:tnftp-20130505~ssl+!doc Scanning motion/pilo-genom:pilo-genom-1.2r1~locoDemo+!doc [motion/pilo-genom:pilo-genom-1.2r1~locoDemo+!doc] Warning: the LICENSE of motion/pilo-genom is undefined. Scanning simulation/morse:morse-1.4r1~!doc+!* Scanning middleware/openni2:openni2-2.2beta2r1~!doc Scanning middleware/yarp:yarp-2.3.64r3~!doc+!* Scanning optimization/qpoases:qpoases-3.2.1~!doc Scanning path/p3d-genom:p3d-genom-1.5r2~rmp440+!doc [path/p3d-genom:p3d-genom-1.5r2~rmp440+!doc] Warning: the LICENSE of path/p3d-genom is undefined. Scanning path/libp3d:libp3d>=1.4~rmp440 Scanning path/ndd-genom:ndd-genom-1.0~!doc [path/ndd-genom:ndd-genom-1.0~!doc] Warning: the LICENSE of path/ndd-genom is undefined. Scanning path/hpp-manipulation:hpp-manipulation-4.7.0~!doc Scanning devel/jsoncpp:jsoncpp-0.5.0~!doc Scanning middleware/py-omniORBpy:py37-omniORBpy-4.2.3~!doc Scanning middleware/py-omniORBpy:py36-omniORBpy-4.2.3~!doc Scanning middleware/py-omniORBpy:py35-omniORBpy-4.2.3~!doc Scanning middleware/py-omniORBpy:py34-omniORBpy-4.2.3~!doc Scanning interfaces/jrl-mal:jrl-mal-1.19.6r1~!doc Scanning image/viam-v4l-driver:viam-v4l-driver-1.12~!doc Scanning image/viam-libs:viam-libs-1.12r1~doc+opencv Scanning net/zeromq:zeromq-2.0.10~!doc Scanning motion/locoDemo-genom:locoDemo-genom-1.5~!doc Scanning graphics/py-qt-gepetto-viewer:py37-qt5-gepetto-viewer-4.7.0~!doc Scanning graphics/py-qt-gepetto-viewer:py37-qt4-gepetto-viewer-4.7.0~!doc Scanning graphics/py-qt-gepetto-viewer:py36-qt5-gepetto-viewer-4.7.0~!doc Scanning graphics/py-qt-gepetto-viewer:py36-qt4-gepetto-viewer-4.7.0~!doc Scanning graphics/py-qt-gepetto-viewer:py35-qt5-gepetto-viewer-4.7.0~!doc Scanning graphics/py-qt-gepetto-viewer:py35-qt4-gepetto-viewer-4.7.0~!doc Scanning graphics/py-qt-gepetto-viewer:py34-qt5-gepetto-viewer-4.7.0~!doc Scanning graphics/py-qt-gepetto-viewer:py34-qt4-gepetto-viewer-4.7.0~!doc Scanning graphics/py-qt-gepetto-viewer:py27-qt5-gepetto-viewer-4.7.0~!doc Scanning graphics/py-qt-gepetto-viewer:py27-qt4-gepetto-viewer-4.7.0~!doc Scanning graphics/py-qt-gepetto-viewer:py37-qt5-gepetto-viewer-4.7.0~doc Scanning graphics/py-qt-gepetto-viewer:py37-qt4-gepetto-viewer-4.7.0~doc Scanning graphics/py-qt-gepetto-viewer:py36-qt5-gepetto-viewer-4.7.0~doc Scanning graphics/py-qt-gepetto-viewer:py36-qt4-gepetto-viewer-4.7.0~doc Scanning graphics/py-qt-gepetto-viewer:py35-qt5-gepetto-viewer-4.7.0~doc Scanning graphics/py-qt-gepetto-viewer:py35-qt4-gepetto-viewer-4.7.0~doc Scanning graphics/py-qt-gepetto-viewer:py34-qt5-gepetto-viewer-4.7.0~doc Scanning graphics/py-qt-gepetto-viewer:py34-qt4-gepetto-viewer-4.7.0~doc Scanning graphics/py-qt-gepetto-viewer:py27-qt4-gepetto-viewer-4.7.0~doc Scanning path/aspect-genom:aspect-genom-0.1~!doc [path/aspect-genom:aspect-genom-0.1~!doc] Warning: the LICENSE of path/aspect-genom is undefined. Scanning doc/robotpkg:robotpkg-guide-20191117~!doc Scanning image/viam-dc1394-driver:viam-dc1394-driver-1.12~!doc Scanning middleware/py-yarp:py37-yarp-2.3.64~!doc Scanning middleware/py-yarp:py36-yarp-2.3.64~!doc Scanning middleware/py-yarp:py35-yarp-2.3.64~!doc Scanning middleware/py-yarp:py34-yarp-2.3.64~!doc Scanning math/eigen3:eigen3-3.3.0~!doc Scanning graphics/py-qt-hpp-gepetto-viewer:py37-qt5-hpp-gepetto-viewer-4.7.0~!doc Scanning graphics/py-qt-hpp-gepetto-viewer:py37-qt4-hpp-gepetto-viewer-4.7.0~!doc Scanning graphics/py-qt-hpp-gepetto-viewer:py36-qt5-hpp-gepetto-viewer-4.7.0~!doc Scanning graphics/py-qt-hpp-gepetto-viewer:py36-qt4-hpp-gepetto-viewer-4.7.0~!doc Scanning graphics/py-qt-hpp-gepetto-viewer:py35-qt5-hpp-gepetto-viewer-4.7.0~!doc Scanning graphics/py-qt-hpp-gepetto-viewer:py35-qt4-hpp-gepetto-viewer-4.7.0~!doc Scanning graphics/py-qt-hpp-gepetto-viewer:py34-qt5-hpp-gepetto-viewer-4.7.0~!doc Scanning graphics/py-qt-hpp-gepetto-viewer:py34-qt4-hpp-gepetto-viewer-4.7.0~!doc Scanning graphics/py-qt-hpp-gepetto-viewer:py27-qt5-hpp-gepetto-viewer-4.7.0~!doc Scanning graphics/py-qt-hpp-gepetto-viewer:py27-qt4-hpp-gepetto-viewer-4.7.0~!doc Scanning graphics/py-qt-hpp-gepetto-viewer:py37-qt5-hpp-gepetto-viewer-4.7.0~doc Scanning graphics/py-qt-hpp-gepetto-viewer:py37-qt4-hpp-gepetto-viewer-4.7.0~doc Scanning graphics/py-qt-hpp-gepetto-viewer:py36-qt5-hpp-gepetto-viewer-4.7.0~doc Scanning graphics/py-qt-hpp-gepetto-viewer:py36-qt4-hpp-gepetto-viewer-4.7.0~doc Scanning graphics/py-qt-hpp-gepetto-viewer:py35-qt5-hpp-gepetto-viewer-4.7.0~doc Scanning graphics/py-qt-hpp-gepetto-viewer:py35-qt4-hpp-gepetto-viewer-4.7.0~doc Scanning graphics/py-qt-hpp-gepetto-viewer:py34-qt5-hpp-gepetto-viewer-4.7.0~doc Scanning graphics/py-qt-hpp-gepetto-viewer:py34-qt4-hpp-gepetto-viewer-4.7.0~doc Scanning graphics/py-qt-hpp-gepetto-viewer:py27-qt4-hpp-gepetto-viewer-4.7.0~doc Scanning lang/ros-message-generation:ros-message-generation-0.4~!doc Scanning architecture/genom:genom-2.12~!doc Scanning math/py-pinocchio:py37-pinocchio-2.1.9~!doc Scanning math/py-pinocchio:py36-pinocchio-2.1.9~!doc Scanning math/py-pinocchio:py35-pinocchio-2.1.9~!doc Scanning math/py-pinocchio:py34-pinocchio-2.1.9~!doc Scanning path/hpp-util:hpp-util-4.5.0~!doc Scanning path/hpp-manipulation-urdf:hpp-manipulation-urdf-4.5.0~!doc Scanning sysutils/py-catkin-pkg:py37-catkin-pkg-0.4.8~!doc Scanning sysutils/py-catkin-pkg:py36-catkin-pkg-0.4.8~!doc Scanning sysutils/py-catkin-pkg:py35-catkin-pkg-0.4.8~!doc Scanning sysutils/py-catkin-pkg:py34-catkin-pkg-0.4.8~!doc Scanning robots/play-genom:play-genom-0.1~!doc [robots/play-genom:play-genom-0.1~!doc] Warning: the LICENSE of robots/play-genom is undefined. Scanning math/hpp-pinocchio:hpp-pinocchio-4.7.0~!doc Scanning robots/ivmob-genom:ivmob-genom-1.4~!doc Scanning robots/jloco-genom:jloco-genom-2.0~!doc [robots/jloco-genom:jloco-genom-2.0~!doc] Warning: the LICENSE of robots/jloco-genom is undefined. Scanning robots/rflex-genom:rflex-genom-0.3r1~!doc [robots/rflex-genom:rflex-genom-0.3r1~!doc] Warning: the LICENSE of robots/rflex-genom is undefined. Scanning robots/scout-genom:scout-genom-0.1~!doc [robots/scout-genom:scout-genom-0.1~!doc] Warning: the LICENSE of robots/scout-genom is undefined. Scanning knowledge/jena:jena-2.6.4~!doc Scanning robots/rmp440-genom:rmp440-genom-0.6~gyro+!doc Scanning math/py-eigenpy:py37-eigenpy-1.6.1~!doc Scanning math/py-eigenpy:py36-eigenpy-1.6.1~!doc Scanning math/py-eigenpy:py35-eigenpy-1.6.1~!doc Scanning math/py-eigenpy:py34-eigenpy-1.6.1~!doc Scanning image/sift:sift-1.1.2r1~!doc Scanning hardware/joystick-genom3:joystick-genom3-1.0~codels+openprs+ros-client-c+ros-client-ros+ros-server+!* Scanning hardware/joystick-genom3:joystick-genom3-1.0~pocolibs-client-c+codels+openprs+pocolibs-server+!doc+!* Scanning hardware/mccdaqft-genom3:mccdaqft-genom3-1.0.1~codels+openprs+ros-client-c+ros-client-ros+ros-server+!* Scanning hardware/mccdaqft-genom3:mccdaqft-genom3-1.0.1~pocolibs-client-c+codels+openprs+pocolibs-server+!doc+!* Scanning graphics/py-qt-hpp-plot:py37-qt5-hpp-plot-4.7.0~!doc Scanning graphics/py-qt-hpp-plot:py37-qt4-hpp-plot-4.7.0~!doc Scanning graphics/py-qt-hpp-plot:py36-qt5-hpp-plot-4.7.0~!doc Scanning graphics/py-qt-hpp-plot:py36-qt4-hpp-plot-4.7.0~!doc Scanning graphics/py-qt-hpp-plot:py35-qt5-hpp-plot-4.7.0~!doc Scanning graphics/py-qt-hpp-plot:py35-qt4-hpp-plot-4.7.0~!doc Scanning graphics/py-qt-hpp-plot:py34-qt5-hpp-plot-4.7.0~!doc Scanning graphics/py-qt-hpp-plot:py34-qt4-hpp-plot-4.7.0~!doc Scanning graphics/py-qt-hpp-plot:py27-qt5-hpp-plot-4.7.0~!doc Scanning graphics/py-qt-hpp-plot:py27-qt4-hpp-plot-4.7.0~!doc Scanning graphics/py-qt-hpp-plot:py37-qt5-hpp-plot-4.7.0~doc Scanning graphics/py-qt-hpp-plot:py37-qt4-hpp-plot-4.7.0~doc Scanning graphics/py-qt-hpp-plot:py36-qt5-hpp-plot-4.7.0~doc Scanning graphics/py-qt-hpp-plot:py36-qt4-hpp-plot-4.7.0~doc Scanning graphics/py-qt-hpp-plot:py35-qt5-hpp-plot-4.7.0~doc Scanning graphics/py-qt-hpp-plot:py35-qt4-hpp-plot-4.7.0~doc Scanning graphics/py-qt-hpp-plot:py34-qt5-hpp-plot-4.7.0~doc Scanning graphics/py-qt-hpp-plot:py34-qt4-hpp-plot-4.7.0~doc Scanning graphics/py-qt-hpp-plot:py27-qt4-hpp-plot-4.7.0~doc Scanning middleware/orocos-rtt:orocos-rtt-2.9.1~!doc+!corba Scanning hardware/dynamixel-genom3:dynamixel-genom3-2.2~codels+openprs+ros-client-c+ros-client-ros+ros-server+!* Scanning hardware/dynamixel-genom3:dynamixel-genom3-2.2~pocolibs-client-c+codels+openprs+pocolibs-server+!doc+!* Scanning interfaces/ros-control-msgs:ros-control-msgs-1.4~!doc Scanning math/ros-geometry:ros-geometry-1.12~!doc Scanning motion/py-orocos-kdl:py37-orocos-kdl-1.4.0~!doc Scanning motion/py-orocos-kdl:py36-orocos-kdl-1.4.0~!doc Scanning motion/py-orocos-kdl:py35-orocos-kdl-1.4.0~!doc Scanning motion/py-orocos-kdl:py34-orocos-kdl-1.4.0~!doc Scanning graphics/py-qt-gepetto-viewer-corba:py37-qt5-gepetto-viewer-corba-5.3.1~!doc Scanning graphics/py-qt-gepetto-viewer-corba:py37-qt4-gepetto-viewer-corba-5.3.1~!doc Scanning graphics/py-qt-gepetto-viewer-corba:py36-qt5-gepetto-viewer-corba-5.3.1~!doc Scanning graphics/py-qt-gepetto-viewer-corba:py36-qt4-gepetto-viewer-corba-5.3.1~!doc Scanning graphics/py-qt-gepetto-viewer-corba:py35-qt5-gepetto-viewer-corba-5.3.1~!doc Scanning graphics/py-qt-gepetto-viewer-corba:py35-qt4-gepetto-viewer-corba-5.3.1~!doc Scanning graphics/py-qt-gepetto-viewer-corba:py34-qt5-gepetto-viewer-corba-5.3.1~!doc Scanning graphics/py-qt-gepetto-viewer-corba:py34-qt4-gepetto-viewer-corba-5.3.1~!doc Scanning graphics/py-qt-gepetto-viewer-corba:py27-qt5-gepetto-viewer-corba-5.3.1~!doc Scanning graphics/py-qt-gepetto-viewer-corba:py27-qt4-gepetto-viewer-corba-5.3.1~!doc Scanning graphics/py-qt-gepetto-viewer-corba:py37-qt5-gepetto-viewer-corba-5.3.1~doc Scanning graphics/py-qt-gepetto-viewer-corba:py37-qt4-gepetto-viewer-corba-5.3.1~doc Scanning graphics/py-qt-gepetto-viewer-corba:py36-qt5-gepetto-viewer-corba-5.3.1~doc Scanning graphics/py-qt-gepetto-viewer-corba:py36-qt4-gepetto-viewer-corba-5.3.1~doc Scanning graphics/py-qt-gepetto-viewer-corba:py35-qt5-gepetto-viewer-corba-5.3.1~doc Scanning graphics/py-qt-gepetto-viewer-corba:py35-qt4-gepetto-viewer-corba-5.3.1~doc Scanning graphics/py-qt-gepetto-viewer-corba:py34-qt5-gepetto-viewer-corba-5.3.1~doc Scanning graphics/py-qt-gepetto-viewer-corba:py34-qt4-gepetto-viewer-corba-5.3.1~doc Scanning graphics/py-qt-gepetto-viewer-corba:py27-qt4-gepetto-viewer-corba-5.3.1~doc Scanning sysutils/py-rosdep:py37-rosdep-0.10.30~!doc Scanning sysutils/py-rosdep:py36-rosdep-0.10.30~!doc Scanning sysutils/py-rosdep:py35-rosdep-0.10.30~!doc Scanning sysutils/py-rosdep:py34-rosdep-0.10.30~!doc Scanning hardware/libftdi:libftdi-0.19~!doc Scanning doc/demo-genom3:demo-genom3-1.3~codels+openprs+ros-client-c+ros-client-ros+ros-server+!* Scanning doc/demo-genom3:demo-genom3-1.3~pocolibs-client-c+codels+openprs+pocolibs-server+!doc+!* Scanning lang/ros-gencpp:ros-gencpp-0.6~!doc Scanning mapping/dtm-genom:dtm-genom-1.5~!doc [mapping/dtm-genom:dtm-genom-1.5~!doc] Warning: the LICENSE of mapping/dtm-genom is undefined. Scanning mapping/zone-genom:zone-genom-1.1~!doc [mapping/zone-genom:zone-genom-1.1~!doc] Warning: the LICENSE of mapping/zone-genom is undefined. Scanning graphics/coldman-genom:coldman-genom-1.3r1~!doc Scanning graphics/coldman-libs:coldman-libs-1.4~display+!doc Scanning sysutils/py-rospkg:py37-rospkg-1.1.7~!doc Scanning sysutils/py-rospkg:py36-rospkg-1.1.7~!doc Scanning sysutils/py-rospkg:py35-rospkg-1.1.7~!doc Scanning sysutils/py-rospkg:py34-rospkg-1.1.7~!doc Scanning knowledge/oro-server:oro-server-0.8.1~!doc Scanning localization/gps-genom3:gps-genom3-1.1~codels+openprs+ros-client-c+ros-client-ros+ros-server+!* Scanning localization/gps-genom3:gps-genom3-1.1~pocolibs-client-c+codels+openprs+pocolibs-server+!doc+!* Scanning localization/pom-genom3:pom-genom3-3.1~codels+openprs+ros-client-c+ros-client-ros+ros-server+!* Scanning localization/pom-genom3:pom-genom3-3.1~pocolibs-client-c+codels+openprs+pocolibs-server+!doc+!* Scanning mapping/regionMap-genom:regionMap-genom-0.4~!doc Scanning pkgtools/robotpkgdb:robotpkgdb-20191117~!doc Scanning hardware/sick-genom:sick-genom-0.2~atrv+!doc [hardware/sick-genom:sick-genom-0.2~atrv+!doc] Warning: the LICENSE of hardware/sick-genom is undefined. Scanning math/gbM:gbM-0.11~!doc Scanning hardware/force-genom:force-genom-1.1.1~!doc [hardware/force-genom:force-genom-1.1.1~!doc] Warning: the LICENSE of hardware/force-genom is undefined. Scanning path/hpp-wholebody-step:hpp-wholebody-step-4.7.0~!doc Scanning motion/softMotion-libs:softMotion-libs-3.12~tcl+!* Scanning motion/softMotion-libs:softMotion-libs-3.12~!doc+!* Scanning image/niut-genom:niut-genom-0.6~!doc Scanning image/viam-genom:viam-genom-1.10~!doc Scanning hardware/sahand-genom:sahand-genom-1.1~!doc [hardware/sahand-genom:sahand-genom-1.1~!doc] Warning: the LICENSE of hardware/sahand-genom is undefined. Scanning localization/optitrack-genom3:optitrack-genom3-2.2~codels+openprs+ros-client-c+ros-client-ros+ros-server+!* Scanning localization/optitrack-genom3:optitrack-genom3-2.2~pocolibs-client-c+codels+openprs+pocolibs-server+!doc+!* Scanning image/viman-genom:viman-genom-1.6~!doc Scanning hardware/platine-genom:platine-genom-0.5~!doc Scanning hardware/mouse3d-genom:mouse3d-genom-1.2~!doc Scanning hardware/velodyne-genom:velodyne-genom-1.6~!doc Scanning path/hpp-core:hpp-core-4.7.0~!doc Scanning path/hpp-walkgen:hpp-walkgen-4.7.0~!doc Scanning mapping/worldmodelgrid3dg-genom:worldmodelgrid3dg-genom-1.0~!doc [mapping/worldmodelgrid3dg-genom:worldmodelgrid3dg-genom-1.0~!doc] Warning: the LICENSE of mapping/worldmodelgrid3dg-genom is undefined. Scanning path/hpp-statistics:hpp-statistics-4.5.0~!doc Scanning knowledge/liboro:liboro-1.1r1~!doc Scanning devel/ros-catkin:py37-ros-catkin-0.7.16~!doc Scanning devel/ros-catkin:py36-ros-catkin-0.7.16~!doc Scanning devel/ros-catkin:py35-ros-catkin-0.7.16~!doc Scanning devel/ros-catkin:py34-ros-catkin-0.7.16~!doc Scanning mapping/worldmodelgrid3d:worldmodelgrid3d-1.0~!doc [mapping/worldmodelgrid3d:worldmodelgrid3d-1.0~!doc] Warning: the LICENSE of mapping/worldmodelgrid3d is undefined. Scanning image/stereopixel-genom:stereopixel-genom-1.3~!doc Scanning path/hpp-fcl:hpp-fcl-1.1.3~!doc Scanning motion/nhfc-genom3:nhfc-genom3-2.0~codels+openprs+ros-client-c+ros-client-ros+ros-server+!* Scanning motion/nhfc-genom3:nhfc-genom3-2.0~pocolibs-client-c+codels+openprs+pocolibs-server+!doc+!* Scanning doc/demo-genom:demo-genom-0.1~!doc Scanning audio/clone-genom:clone-genom-0.2r1~!doc [audio/clone-genom:clone-genom-0.2r1~!doc] Warning: the LICENSE of audio/clone-genom is undefined. Scanning motion/phynt-genom3:phynt-genom3-1.0~codels+openprs+ros-client-c+ros-client-ros+ros-server+!* Scanning motion/phynt-genom3:phynt-genom3-1.0~pocolibs-client-c+codels+openprs+pocolibs-server+!doc+!* Scanning audio/speett-genom:speett-genom-1.0~!doc Scanning audio/textos-genom:textos-genom-1.0.2~!doc Scanning motion/uavatt-genom3:uavatt-genom3-1.0~codels+openprs+ros-client-c+ros-client-ros+ros-server+!* Scanning motion/uavatt-genom3:uavatt-genom3-1.0~pocolibs-client-c+codels+openprs+pocolibs-server+!doc+!* Scanning motion/uavpos-genom3:uavpos-genom3-1.0~codels+openprs+ros-client-c+ros-client-ros+ros-server+!* Scanning motion/uavpos-genom3:uavpos-genom3-1.0~pocolibs-client-c+codels+openprs+pocolibs-server+!doc+!* Scanning doc/py-hpp-practicals:py37-hpp-practicals-4.7.0~!doc Scanning doc/py-hpp-practicals:py36-hpp-practicals-4.7.0~!doc Scanning doc/py-hpp-practicals:py35-hpp-practicals-4.7.0~!doc Scanning doc/py-hpp-practicals:py34-hpp-practicals-4.7.0~!doc Scanning doc/py-hpp-practicals:py27-hpp-practicals-4.7.0~!doc Scanning doc/py-hpp-practicals:py37-hpp-practicals-4.7.0~doc Scanning doc/py-hpp-practicals:py36-hpp-practicals-4.7.0~doc Scanning doc/py-hpp-practicals:py35-hpp-practicals-4.7.0~doc Scanning doc/py-hpp-practicals:py34-hpp-practicals-4.7.0~doc Scanning path/maneuver-genom3:maneuver-genom3-2.0~codels+openprs+ros-client-c+ros-client-ros+ros-server+!* Scanning path/maneuver-genom3:maneuver-genom3-2.0~pocolibs-client-c+codels+openprs+pocolibs-server+!doc+!* Scanning devel/log4cxx:log4cxx-0.10.0r1~!doc Scanning middleware/hpp-template-corba:hpp-template-corba-4.5.0~!doc Scanning manipulation/genManip-genom:genManip-genom-0.9~!doc Scanning graphics/qt-qgv:qt4-qgv-1.1.0~!doc Scanned 771 packages (614 unique) [0%] Processing archivers/pax:pax-20080110~!doc ===> Cleaning temporary files for pax-20080110 ===> Bulk building for pax-20080110 => Checking for clear installation => Required system package gnupg>=1: gnupg-2.2.12 found => Required system package gzip: gzip-1.9 found => Required system package pkg_install>=20110805.9: pkg_install-20110805.9 found => Required system package pkgrepo2deb>=1.6.1: pkgrepo2deb-1.6.1 found => Building with no option. => Use the GNU C compiler: c-compiler provided by gcc>=3 => Required system package gcc>=3: gcc-8 found => Extracting libnbcompat in place => Building libnbcompat in place => Modifying GNU configure scripts to avoid --recheck => Disabling fatal errors with C++ preprocessor in GNU configure scripts => Registering installation for pax-20080110 => Linking package in /opt/robotpkg/var/lib/robotpkg/packages/bsd/Ubuntu-19.04-x86_64/pub => Updating debian binary packages ===> Logging bulk summary for pax-20080110 => Checking leftover files => Creating bulk log files => Logging bulk metadata ===> Cleaning temporary files for pax-20080110 ===> Done bulk for pax-20080110 [0%] Processing pkgtools/pkg_install:pkg_install-20110805.9~!doc ===> Cleaning temporary files for pkg_install-20110805.9 ===> Bulk building for pkg_install-20110805.9 => Checking for clear installation => Required system package gnupg>=1: gnupg-2.2.12 found => Required system package gzip: gzip-1.9 found => Required system package pax and tar archivers: pax found => Required system package pkgrepo2deb>=1.6.1: pkgrepo2deb-1.6.1 found => Building with no option. => Use the GNU C compiler: c-compiler provided by gcc>=3 => Required system package bzip2: bzip2 found => Required system package gcc>=3: gcc-8 found => Required system package zlib>=1.2.3: zlib-1.2.11 found => Extracting libnbcompat in place => Extracting libarchive in place => Extracting libfetch in place => Building libnbcompat in place => Building libarchive in place => Building libfetch in place => Modifying GNU configure scripts to avoid --recheck => Disabling fatal errors with C++ preprocessor in GNU configure scripts => Running PRE-INSTALL script actions => Running POST-INSTALL script actions => Registering installation for pkg_install-20110805.9 => Linking package in /opt/robotpkg/var/lib/robotpkg/packages/bsd/Ubuntu-19.04-x86_64/pub => Updating debian binary packages robotpkg_delete: The following packages are marked as not for deletion: pkg_install-20110805.9 ...but will delete them anyway ===> Logging bulk summary for pkg_install-20110805.9 => Checking leftover files => Creating bulk log files => Logging bulk metadata ===> Cleaning temporary files for pkg_install-20110805.9 ===> Done bulk for pkg_install-20110805.9 [0%] Processing pkgtools/robotpkgdb:robotpkgdb-20191117~!doc ===> Cleaning temporary files for robotpkgdb-20191117~csv+sqlite ===> Bulk building for robotpkgdb-20191117~csv+sqlite => Checking for clear installation => Required system package gnupg>=1: gnupg-2.2.12 found => Required system package gzip: gzip-1.9 found => Required system package pkg_install>=20110805.9: pkg_install-20110805.9 found => Required system package pkgrepo2deb>=1.6.1: pkgrepo2deb-1.6.1 found => Building with the following options: => Required system package A BSD-compatible install program: install-sh found => Required system package sqlite3>=3: sqlite3-3.27.2 found => Configuring sources => Registering installation for robotpkgdb-20191117~csv+sqlite => Linking package in /opt/robotpkg/var/lib/robotpkg/packages/bsd/Ubuntu-19.04-x86_64/pub => Updating debian binary packages ===> Logging bulk summary for robotpkgdb-20191117~csv+sqlite => Checking leftover files => Creating bulk log files => Logging bulk metadata ===> Cleaning temporary files for robotpkgdb-20191117~csv+sqlite ===> Done bulk for robotpkgdb-20191117~csv+sqlite [0%] Processing pkgtools/digest:digest-20080510~!doc ===> Cleaning temporary files for digest-20080510 ===> Bulk building for digest-20080510 => Checking for clear installation => Required system package gnupg>=1: gnupg-2.2.12 found => Required system package gzip: gzip-1.9 found => Required system package pkg_install>=20110805.9: pkg_install-20110805.9 found => Required system package pkgrepo2deb>=1.6.1: pkgrepo2deb-1.6.1 found => Building with no option. => Use the GNU C compiler: c-compiler provided by gcc>=3 => Required system package bzip2: bzip2 found => Required system package gcc>=3: gcc-8 found => Required system package zlib>=1.2.3: zlib-1.2.11 found => Extracting libarchive in place => Building libarchive in place => Modifying GNU configure scripts to avoid --recheck => Disabling fatal errors with C++ preprocessor in GNU configure scripts => Registering installation for digest-20080510 => Linking package in /opt/robotpkg/var/lib/robotpkg/packages/bsd/Ubuntu-19.04-x86_64/pub => Updating debian binary packages ===> Logging bulk summary for digest-20080510 => Checking leftover files => Creating bulk log files => Logging bulk metadata ===> Cleaning temporary files for digest-20080510 ===> Done bulk for digest-20080510 [0%] Processing archivers/bzip2:bzip2-1.0.5~!doc ===> Cleaning temporary files for bzip2-1.0.5 ===> Bulk building for bzip2-1.0.5 => Checking for clear installation => Required system package gnupg>=1: gnupg-2.2.12 found => Required system package gzip: gzip-1.9 found => Required system package pkg_install>=20110805.9: pkg_install-20110805.9 found => Required system package pkgrepo2deb>=1.6.1: pkgrepo2deb-1.6.1 found => Building with no option. => Use the GNU C compiler: c-compiler provided by gcc>=3 => Required system package gcc>=3: gcc-8 found => Required system package GNU m4>=1.4: gm4-1.4.18 found => Required system package A BSD-compatible install program: install-sh found => Required system package libtool>=1.5.22: libtool-2.4.6 found => Creating installation directories => Registering installation for bzip2-1.0.5 => Linking package in /opt/robotpkg/var/lib/robotpkg/packages/bsd/Ubuntu-19.04-x86_64/pub => Updating debian binary packages ===> Logging bulk summary for bzip2-1.0.5 => Checking leftover files => Creating bulk log files => Logging bulk metadata ===> Cleaning temporary files for bzip2-1.0.5 ===> Done bulk for bzip2-1.0.5 [0%] Processing pkgtools/url2robotpkg:url2robotpkg-2.7~!doc ===> Cleaning temporary files for url2robotpkg-2.7 ===> Bulk building for url2robotpkg-2.7 => Checking for clear installation => Required system package gnupg>=1: gnupg-2.2.12 found => Required system package gzip: gzip-1.9 found => Required system package pkg_install>=20110805.9: pkg_install-20110805.9 found => Required system package pkgrepo2deb>=1.6.1: pkgrepo2deb-1.6.1 found => Required system package A BSD-compatible install program: install-sh found => Required system package perl>=5: perl-5 found => Creating installation directories => Registering installation for url2robotpkg-2.7 => Linking package in /opt/robotpkg/var/lib/robotpkg/packages/bsd/Ubuntu-19.04-x86_64/pub => Updating debian binary packages ===> Logging bulk summary for url2robotpkg-2.7 => Checking leftover files => Creating bulk log files => Logging bulk metadata ===> Cleaning temporary files for url2robotpkg-2.7 ===> Done bulk for url2robotpkg-2.7 [0%] Processing net/libfetch:libfetch-2.33.1~!doc ===> Cleaning temporary files for libfetch-2.33.1 ===> Bulk building for libfetch-2.33.1 => Checking for clear installation => Required system package gnupg>=1: gnupg-2.2.12 found => Required system package gzip: gzip-1.9 found => Required system package pkg_install>=20110805.9: pkg_install-20110805.9 found => Required system package pkgrepo2deb>=1.6.1: pkgrepo2deb-1.6.1 found => Building with no option. => Use the GNU C compiler: c-compiler provided by gcc>=3 => Required system package gcc>=3: gcc-8 found => Required system package A BSD-compatible install program: install-sh found => Extracting libnbcompat in place => Building libnbcompat in place => Modifying GNU configure scripts to avoid --recheck => Disabling fatal errors with C++ preprocessor in GNU configure scripts => Creating installation directories => Registering installation for libfetch-2.33.1 => Linking package in /opt/robotpkg/var/lib/robotpkg/packages/bsd/Ubuntu-19.04-x86_64/pub => Updating debian binary packages ===> Logging bulk summary for libfetch-2.33.1 => Checking leftover files => Creating bulk log files => Logging bulk metadata ===> Cleaning temporary files for libfetch-2.33.1 ===> Done bulk for libfetch-2.33.1 [1%] Processing archivers/zlib:zlib-1.2.3~!doc ===> Cleaning temporary files for zlib-1.2.3 ===> Bulk building for zlib-1.2.3 => Checking for clear installation => Required system package gnupg>=1: gnupg-2.2.12 found => Required system package gzip: gzip-1.9 found => Required system package pkg_install>=20110805.9: pkg_install-20110805.9 found => Required system package pkgrepo2deb>=1.6.1: pkgrepo2deb-1.6.1 found => Building with no option. => Use the GNU C compiler: c-compiler provided by gcc>=3 => Required system package gcc>=3: gcc-8 found => Required system package GNU m4>=1.4: gm4-1.4.18 found => Required system package A BSD-compatible install program: install-sh found => Required system package libtool>=1.5.22: libtool-2.4.6 found => Creating installation directories => Registering installation for zlib-1.2.3 => Linking package in /opt/robotpkg/var/lib/robotpkg/packages/bsd/Ubuntu-19.04-x86_64/pub => Updating debian binary packages ===> Logging bulk summary for zlib-1.2.3 => Checking leftover files => Creating bulk log files => Logging bulk metadata ===> Cleaning temporary files for zlib-1.2.3 ===> Done bulk for zlib-1.2.3 [1%] Processing archivers/libarchive:libarchive-2.8.4~!doc ===> Cleaning temporary files for libarchive-2.8.4 ===> Bulk building for libarchive-2.8.4 => Checking for clear installation => Required system package gnupg>=1: gnupg-2.2.12 found => Required system package gzip: gzip-1.9 found => Required system package pkg_install>=20110805.9: pkg_install-20110805.9 found => Required system package pkgrepo2deb>=1.6.1: pkgrepo2deb-1.6.1 found => Building with no option. => Use the GNU C compiler: c-compiler provided by gcc>=3 => Required system package bzip2: bzip2 found => Required system package gcc>=3: gcc-8 found => Required system package zlib>=1.2.3: zlib-1.2.11 found => Modifying GNU configure scripts to avoid --recheck => Disabling fatal errors with C++ preprocessor in GNU configure scripts => Registering installation for libarchive-2.8.4 => Linking package in /opt/robotpkg/var/lib/robotpkg/packages/bsd/Ubuntu-19.04-x86_64/pub => Updating debian binary packages ===> Logging bulk summary for libarchive-2.8.4 => Checking leftover files => Creating bulk log files => Logging bulk metadata ===> Cleaning temporary files for libarchive-2.8.4 ===> Done bulk for libarchive-2.8.4 [1%] Processing pkgtools/libnbcompat:libnbcompat-20150615~!doc ===> Cleaning temporary files for libnbcompat-20150615 ===> Bulk building for libnbcompat-20150615 => Checking for clear installation => Required system package gnupg>=1: gnupg-2.2.12 found => Required system package gzip: gzip-1.9 found => Required system package pkg_install>=20110805.9: pkg_install-20110805.9 found => Required system package pkgrepo2deb>=1.6.1: pkgrepo2deb-1.6.1 found => Building with no option. => Use the GNU C compiler: c-compiler provided by gcc>=3 => Required system package gcc>=3: gcc-8 found => Modifying GNU configure scripts to avoid --recheck => Disabling fatal errors with C++ preprocessor in GNU configure scripts => Registering installation for libnbcompat-20150615 => Linking package in /opt/robotpkg/var/lib/robotpkg/packages/bsd/Ubuntu-19.04-x86_64/pub => Updating debian binary packages ===> Logging bulk summary for libnbcompat-20150615 => Checking leftover files => Creating bulk log files => Logging bulk metadata ===> Cleaning temporary files for libnbcompat-20150615 ===> Done bulk for libnbcompat-20150615 [1%] Processing pkgtools/robotpkg_chk:robotpkg_chk-1.1~!doc ===> Cleaning temporary files for robotpkg_chk-1.1 ===> Bulk building for robotpkg_chk-1.1 => Checking for clear installation => Required system package gnupg>=1: gnupg-2.2.12 found => Required system package gzip: gzip-1.9 found => Required system package pkg_install>=20110805.9: pkg_install-20110805.9 found => Required system package pkgrepo2deb>=1.6.1: pkgrepo2deb-1.6.1 found => Required system package A BSD-compatible install program: install-sh found => Configuring sources => Registering installation for robotpkg_chk-1.1 => Linking package in /opt/robotpkg/var/lib/robotpkg/packages/bsd/Ubuntu-19.04-x86_64/pub => Updating debian binary packages ===> Logging bulk summary for robotpkg_chk-1.1 => Checking leftover files => Creating bulk log files => Logging bulk metadata ===> Cleaning temporary files for robotpkg_chk-1.1 ===> Done bulk for robotpkg_chk-1.1 [1%] Processing doc/robotpkg:robotpkg-guide-20191117~!doc ===> Cleaning temporary files for robotpkg-guide-20191117~pdf ===> Bulk building for robotpkg-guide-20191117~pdf => Checking for clear installation => Required system package gnupg>=1: gnupg-2.2.12 found => Required system package gzip: gzip-1.9 found => Required system package pkg_install>=20110805.9: pkg_install-20110805.9 found => Required system package pkgrepo2deb>=1.6.1: pkgrepo2deb-1.6.1 found => Building with the following options: => Required system package A BSD-compatible install program: install-sh found => Required system package pdflatex: pdflatex found => Required system package TeX lmodern: tex-lmodern found => Registering installation for robotpkg-guide-20191117~pdf => Linking package in /opt/robotpkg/var/lib/robotpkg/packages/bsd/Ubuntu-19.04-x86_64/pub => Updating debian binary packages ===> Logging bulk summary for robotpkg-guide-20191117~pdf => Checking leftover files => Creating bulk log files => Logging bulk metadata ===> Cleaning temporary files for robotpkg-guide-20191117~pdf ===> Done bulk for robotpkg-guide-20191117~pdf [1%] Processing pkgtools/tnftp:tnftp-20130505~ssl+!doc ===> Cleaning temporary files for tnftp-20130505~ssl ===> Bulk building for tnftp-20130505~ssl => Checking for clear installation => Required system package gnupg>=1: gnupg-2.2.12 found => Required system package gzip: gzip-1.9 found => Required system package pkg_install>=20110805.9: pkg_install-20110805.9 found => Required system package pkgrepo2deb>=1.6.1: pkgrepo2deb-1.6.1 found => Building with the following options: => Use the GNU C compiler: c-compiler provided by gcc>=3 => Required system package gcc>=3: gcc-8 found => Required system package openssl>=0.9.6: openssl-1.1.1b found => Required system package curses, ncurses, termlib or termcap: termcap found => Modifying GNU configure scripts to avoid --recheck => Disabling fatal errors with C++ preprocessor in GNU configure scripts => Registering installation for tnftp-20130505~ssl => Linking package in /opt/robotpkg/var/lib/robotpkg/packages/bsd/Ubuntu-19.04-x86_64/pub => Updating debian binary packages ===> Logging bulk summary for tnftp-20130505~ssl => Checking leftover files => Creating bulk log files => Logging bulk metadata ===> Cleaning temporary files for tnftp-20130505~ssl ===> Done bulk for tnftp-20130505~ssl [2%] Processing hardware/sahand-libs:sahand-libs-08.08.14r1~!doc ===> Cleaning temporary files for sahand-libs-08.08.14r1 ===> Bulk building for sahand-libs-08.08.14r1 ERROR: This package cannot be extracted for the following reason: ERROR: ====================================================================== ERROR: sahand-libs-08.08.14r1 has an unacceptable license: ERROR: sahand-license ERROR: ERROR: . To view the license, enter "make show-license". ERROR: . To indicate acceptance, add this line: ERROR: ERROR: ACCEPTABLE_LICENSES+=sahand-license ERROR: ERROR: to /opt/robotpkg/etc/robotpkg.conf ERROR: ERROR: ====================================================================== make[2]: *** [/local/robotpkg/var/lib/robotpkg/mk/internal/can-be-built-here.mk:204: cbeh] Error 2 ===> Logging bulk summary for sahand-libs-08.08.14r1 => Checking leftover files => Creating bulk log files => Logging bulk metadata ===> Cleaning temporary files for sahand-libs-08.08.14r1 ===> Done bulk for sahand-libs-08.08.14r1 [2%] Processing hardware/gyro-libs:gyro-libs-3.1r3~!doc ===> Cleaning temporary files for gyro-libs-3.1r3 ===> Bulk building for gyro-libs-3.1r3 => Checking for clear installation => Installing /opt/robotpkg/var/lib/robotpkg/packages/bsd/Ubuntu-19.04-x86_64/All/digest-20080510.tgz => Installing /opt/robotpkg/var/lib/robotpkg/packages/bsd/Ubuntu-19.04-x86_64/All/tnftp-20130505~ssl.tgz => Required robotpkg package digest>=20080510: digest-20080510 found => Required robotpkg package tnftp>=20091122: tnftp-20130505~ssl found => Required system package gnupg>=1: gnupg-2.2.12 found => Required system package gzip: gzip-1.9 found => Required system package patch>=2.0: patch-2.7.6 found => Required system package pax and tar archivers: pax found => Required system package pkg_install>=20110805.9: pkg_install-20110805.9 found => Required system package pkgrepo2deb>=1.6.1: pkgrepo2deb-1.6.1 found => Dependency digest-20080510 already installed => Dependency tnftp-20130505~ssl already installed => Building with no option. => Use the GNU C compiler: c-compiler provided by gcc>=3 => Required system package gcc>=3: gcc-8 found => Required system package GNU m4>=1.4: gm4-1.4.18 found => Required system package libtool>=1.5.22: libtool-2.4.6 found => Required system package pkg-config>=0.22: pkg-config-0.29.1 found => SHA1 checksums OK => RMD160 checksums OK => Applying robotpkg patches for gyro-libs-3.1r3 => Modifying GNU configure scripts to avoid --recheck => Disabling fatal errors with C++ preprocessor in GNU configure scripts => Adding run-time search paths to pkg-config files => Registering installation for gyro-libs-3.1r3 => Linking package in /opt/robotpkg/var/lib/robotpkg/packages/bsd/Ubuntu-19.04-x86_64/pub => Updating debian binary packages ===> Logging bulk summary for gyro-libs-3.1r3 => Checking leftover files => Creating bulk log files => Logging bulk metadata ===> Cleaning temporary files for gyro-libs-3.1r3 ===> Done bulk for gyro-libs-3.1r3 [2%] Processing devel/swig:swig-2.0.4~doc ===> Cleaning temporary files for swig-2.0.4~doc ===> Bulk building for swig-2.0.4~doc => Checking for clear installation => Installing /opt/robotpkg/var/lib/robotpkg/packages/bsd/Ubuntu-19.04-x86_64/All/digest-20080510.tgz => Installing /opt/robotpkg/var/lib/robotpkg/packages/bsd/Ubuntu-19.04-x86_64/All/tnftp-20130505~ssl.tgz => Required robotpkg package digest>=20080510: digest-20080510 found => Required robotpkg package tnftp>=20091122: tnftp-20130505~ssl found => Required system package gnupg>=1: gnupg-2.2.12 found => Required system package gzip: gzip-1.9 found => Required system package patch>=2.0: patch-2.7.6 found => Required system package pax and tar archivers: pax found => Required system package pkg_install>=20110805.9: pkg_install-20110805.9 found => Required system package pkgrepo2deb>=1.6.1: pkgrepo2deb-1.6.1 found => Dependency digest-20080510 already installed => Dependency tnftp-20130505~ssl already installed => Building with the following options: => Use the GNU C++ compiler: c++-compiler provided by g++>=3 => Use the GNU C compiler: c-compiler provided by gcc>=3 => Required system package g++>=3: g++-8 found => Required system package gcc>=3: gcc-8 found => Required system package A BSD-compatible install program: install-sh found => Required system package libstdc++: libstdc++ found => Required system package pax and tar archivers: pax found => Required system package pcre>=7: pcre-8.39 found => SHA1 checksums OK => RMD160 checksums OK => Applying robotpkg patches for swig-2.0.4~doc => Modifying GNU configure scripts to avoid --recheck => Creating installation directories => Registering installation for swig-2.0.4~doc => Linking package in /opt/robotpkg/var/lib/robotpkg/packages/bsd/Ubuntu-19.04-x86_64/pub => Updating debian binary packages ===> Logging bulk summary for swig-2.0.4~doc => Checking leftover files => Creating bulk log files => Logging bulk metadata ===> Cleaning temporary files for swig-2.0.4~doc ===> Done bulk for swig-2.0.4~doc [2%] Processing devel/swig:swig-2.0.4~!doc ===> Cleaning temporary files for swig-2.0.4 ===> Bulk building for swig-2.0.4 => Checking for clear installation => Installing /opt/robotpkg/var/lib/robotpkg/packages/bsd/Ubuntu-19.04-x86_64/All/digest-20080510.tgz => Installing /opt/robotpkg/var/lib/robotpkg/packages/bsd/Ubuntu-19.04-x86_64/All/tnftp-20130505~ssl.tgz => Required robotpkg package digest>=20080510: digest-20080510 found => Required robotpkg package tnftp>=20091122: tnftp-20130505~ssl found => Required system package gnupg>=1: gnupg-2.2.12 found => Required system package gzip: gzip-1.9 found => Required system package patch>=2.0: patch-2.7.6 found => Required system package pax and tar archivers: pax found => Required system package pkg_install>=20110805.9: pkg_install-20110805.9 found => Required system package pkgrepo2deb>=1.6.1: pkgrepo2deb-1.6.1 found => Dependency digest-20080510 already installed => Dependency tnftp-20130505~ssl already installed => Building with no option. => Use the GNU C++ compiler: c++-compiler provided by g++>=3 => Use the GNU C compiler: c-compiler provided by gcc>=3 => Required system package g++>=3: g++-8 found => Required system package gcc>=3: gcc-8 found => Required system package libstdc++: libstdc++ found => Required system package pcre>=7: pcre-8.39 found => SHA1 checksums OK => RMD160 checksums OK => Applying robotpkg patches for swig-2.0.4 => Modifying GNU configure scripts to avoid --recheck => Registering installation for swig-2.0.4 => Linking package in /opt/robotpkg/var/lib/robotpkg/packages/bsd/Ubuntu-19.04-x86_64/pub => Updating debian binary packages ===> Logging bulk summary for swig-2.0.4 => Checking leftover files => Creating bulk log files => Logging bulk metadata ===> Cleaning temporary files for swig-2.0.4 ===> Done bulk for swig-2.0.4 [2%] Processing audio/festlex-cmu:festlex-cmu-1.96~!doc ===> Cleaning temporary files for festlex-cmu-1.96 ===> Bulk building for festlex-cmu-1.96 => Checking for clear installation => Installing /opt/robotpkg/var/lib/robotpkg/packages/bsd/Ubuntu-19.04-x86_64/All/digest-20080510.tgz => Installing /opt/robotpkg/var/lib/robotpkg/packages/bsd/Ubuntu-19.04-x86_64/All/tnftp-20130505~ssl.tgz => Required robotpkg package digest>=20080510: digest-20080510 found => Required robotpkg package tnftp>=20091122: tnftp-20130505~ssl found => Required system package gnupg>=1: gnupg-2.2.12 found => Required system package gzip: gzip-1.9 found => Required system package pax and tar archivers: pax found => Required system package pkg_install>=20110805.9: pkg_install-20110805.9 found => Required system package pkgrepo2deb>=1.6.1: pkgrepo2deb-1.6.1 found => Dependency digest-20080510 already installed WARNING: Cannot check installed version of festival => Dependency tnftp-20130505~ssl already installed => Building with no option. => Use the GNU C compiler: c-compiler provided by gcc>=3 => Required system package festival>=1.96 : festival found => Required system package gcc>=3: gcc-8 found => Required system package A BSD-compatible install program: install-sh found => Required system package pax and tar archivers: pax found WARNING: Cannot check installed version of festival => SHA1 checksums OK => RMD160 checksums OK robotpkg_create: Warning - directory `/opt/openrobots/share/festival/lib/dicts/cmu' in PLIST => Registering installation for festlex-cmu-1.96 robotpkg_admin: festlex-cmu-1.96: File `/opt/openrobots/share/festival/lib/dicts/cmu' is in +CONTENTS but not on filesystem! robotpkg_create: Warning - directory `/opt/openrobots/share/festival/lib/dicts/cmu' in PLIST => Linking package in /opt/robotpkg/var/lib/robotpkg/packages/bsd/Ubuntu-19.04-x86_64/pub => Updating debian binary packages robotpkg_delete: attempting to delete directory `/opt/openrobots/share/festival/lib/dicts/cmu' as a file this packing list is incorrect - ignoring delete request ===> Logging bulk summary for festlex-cmu-1.96 => Checking leftover files => Creating bulk log files => Logging bulk metadata ===> Cleaning temporary files for festlex-cmu-1.96 ===> Done bulk for festlex-cmu-1.96 [2%] Processing math/t3d:libt3d-2.6~doc Warning: DOXYGEN_PLIST_DIR in math/t3d is deprecated. Warning: use DYNAMIC_PLIST_DIRS instead. Warning: DOXYGEN_PLIST_DIR in math/t3d is deprecated. Warning: use DYNAMIC_PLIST_DIRS instead. ===> Cleaning temporary files for libt3d-2.6~doc ===> Bulk building for libt3d-2.6~doc => Checking for clear installation Warning: DOXYGEN_PLIST_DIR in math/t3d is deprecated. Warning: use DYNAMIC_PLIST_DIRS instead. => Installing /opt/robotpkg/var/lib/robotpkg/packages/bsd/Ubuntu-19.04-x86_64/All/digest-20080510.tgz => Installing /opt/robotpkg/var/lib/robotpkg/packages/bsd/Ubuntu-19.04-x86_64/All/tnftp-20130505~ssl.tgz Warning: DOXYGEN_PLIST_DIR in math/t3d is deprecated. Warning: use DYNAMIC_PLIST_DIRS instead. => Required robotpkg package digest>=20080510: digest-20080510 found => Required robotpkg package tnftp>=20091122: tnftp-20130505~ssl found => Required system package gnupg>=1: gnupg-2.2.12 found => Required system package gzip: gzip-1.9 found => Required system package patch>=2.0: patch-2.7.6 found => Required system package pax and tar archivers: pax found => Required system package pkg_install>=20110805.9: pkg_install-20110805.9 found => Required system package pkgrepo2deb>=1.6.1: pkgrepo2deb-1.6.1 found Warning: DOXYGEN_PLIST_DIR in math/t3d is deprecated. Warning: use DYNAMIC_PLIST_DIRS instead. Warning: DOXYGEN_PLIST_DIR in math/t3d is deprecated. Warning: use DYNAMIC_PLIST_DIRS instead. => Dependency digest-20080510 already installed => Dependency tnftp-20130505~ssl already installed Warning: DOXYGEN_PLIST_DIR in math/t3d is deprecated. Warning: use DYNAMIC_PLIST_DIRS instead. => Building with the following options: => Use the GNU C++ compiler: c++-compiler provided by g++>=3 => Use the GNU C compiler: c-compiler provided by gcc>=3 => Required system package doxygen>=1.5: doxygen-1.8.13 found => Required system package g++>=3: g++-8 found => Required system package gcc>=3: gcc-8 found => Required system package libstdc++: libstdc++ found Warning: DOXYGEN_PLIST_DIR in math/t3d is deprecated. Warning: use DYNAMIC_PLIST_DIRS instead. Warning: DOXYGEN_PLIST_DIR in math/t3d is deprecated. Warning: use DYNAMIC_PLIST_DIRS instead. Warning: DOXYGEN_PLIST_DIR in math/t3d is deprecated. Warning: use DYNAMIC_PLIST_DIRS instead. => SHA1 checksums OK => RMD160 checksums OK => Applying robotpkg patches for libt3d-2.6~doc => Modifying GNU configure scripts to avoid --recheck Warning: DOXYGEN_PLIST_DIR in math/t3d is deprecated. Warning: use DYNAMIC_PLIST_DIRS instead. => Registering installation for libt3d-2.6~doc Warning: DOXYGEN_PLIST_DIR in math/t3d is deprecated. Warning: use DYNAMIC_PLIST_DIRS instead. => Linking package in /opt/robotpkg/var/lib/robotpkg/packages/bsd/Ubuntu-19.04-x86_64/pub => Updating debian binary packages Warning: DOXYGEN_PLIST_DIR in math/t3d is deprecated. Warning: use DYNAMIC_PLIST_DIRS instead. ===> Logging bulk summary for libt3d-2.6~doc => Checking leftover files => Creating bulk log files => Logging bulk metadata Warning: DOXYGEN_PLIST_DIR in math/t3d is deprecated. Warning: use DYNAMIC_PLIST_DIRS instead. Warning: DOXYGEN_PLIST_DIR in math/t3d is deprecated. Warning: use DYNAMIC_PLIST_DIRS instead. Warning: DOXYGEN_PLIST_DIR in math/t3d is deprecated. Warning: use DYNAMIC_PLIST_DIRS instead. ===> Cleaning temporary files for libt3d-2.6~doc ===> Done bulk for libt3d-2.6~doc [3%] Processing math/t3d:libt3d-2.6~!doc ===> Cleaning temporary files for libt3d-2.6 ===> Bulk building for libt3d-2.6 => Checking for clear installation => Installing /opt/robotpkg/var/lib/robotpkg/packages/bsd/Ubuntu-19.04-x86_64/All/digest-20080510.tgz => Installing /opt/robotpkg/var/lib/robotpkg/packages/bsd/Ubuntu-19.04-x86_64/All/tnftp-20130505~ssl.tgz => Required robotpkg package digest>=20080510: digest-20080510 found => Required robotpkg package tnftp>=20091122: tnftp-20130505~ssl found => Required system package gnupg>=1: gnupg-2.2.12 found => Required system package gzip: gzip-1.9 found => Required system package patch>=2.0: patch-2.7.6 found => Required system package pax and tar archivers: pax found => Required system package pkg_install>=20110805.9: pkg_install-20110805.9 found => Required system package pkgrepo2deb>=1.6.1: pkgrepo2deb-1.6.1 found => Dependency digest-20080510 already installed => Dependency tnftp-20130505~ssl already installed => Building with no option. => Use the GNU C++ compiler: c++-compiler provided by g++>=3 => Use the GNU C compiler: c-compiler provided by gcc>=3 => Required system package g++>=3: g++-8 found => Required system package gcc>=3: gcc-8 found => Required system package libstdc++: libstdc++ found => SHA1 checksums OK => RMD160 checksums OK => Applying robotpkg patches for libt3d-2.6 => Modifying GNU configure scripts to avoid --recheck => Registering installation for libt3d-2.6 => Linking package in /opt/robotpkg/var/lib/robotpkg/packages/bsd/Ubuntu-19.04-x86_64/pub => Updating debian binary packages ===> Logging bulk summary for libt3d-2.6 => Checking leftover files => Creating bulk log files => Logging bulk metadata Warning: DOXYGEN_PLIST_DIR in math/t3d is deprecated. Warning: use DYNAMIC_PLIST_DIRS instead. ===> Cleaning temporary files for libt3d-2.6 ===> Done bulk for libt3d-2.6 [3%] Processing sysutils/tth:tth-4.09~!doc ===> Cleaning temporary files for tth-4.09 ===> Bulk building for tth-4.09 => Checking for clear installation => Installing /opt/robotpkg/var/lib/robotpkg/packages/bsd/Ubuntu-19.04-x86_64/All/digest-20080510.tgz => Installing /opt/robotpkg/var/lib/robotpkg/packages/bsd/Ubuntu-19.04-x86_64/All/tnftp-20130505~ssl.tgz => Required robotpkg package digest>=20080510: digest-20080510 found => Required robotpkg package tnftp>=20091122: tnftp-20130505~ssl found => Required system package gnupg>=1: gnupg-2.2.12 found => Required system package gzip: gzip-1.9 found => Required system package pax and tar archivers: pax found => Required system package pkg_install>=20110805.9: pkg_install-20110805.9 found => Required system package pkgrepo2deb>=1.6.1: pkgrepo2deb-1.6.1 found => Dependency digest-20080510 already installed => Dependency tnftp-20130505~ssl already installed => Building with no option. => Use the GNU C compiler: c-compiler provided by gcc>=3 => Required system package gcc>=3: gcc-8 found => Required system package A BSD-compatible install program: install-sh found => SHA1 checksums OK => RMD160 checksums OK => Creating installation directories => Registering installation for tth-4.09 => Linking package in /opt/robotpkg/var/lib/robotpkg/packages/bsd/Ubuntu-19.04-x86_64/pub => Updating debian binary packages ===> Logging bulk summary for tth-4.09 => Checking leftover files => Creating bulk log files => Logging bulk metadata ===> Cleaning temporary files for tth-4.09 ===> Done bulk for tth-4.09 [3%] Processing robots/tk3-mikrokopter:tk3-mikrokopter-1.8.4~!doc ===> Cleaning temporary files for tk3-mikrokopter-1.8.4 ===> Bulk building for tk3-mikrokopter-1.8.4 => Checking for clear installation => Installing /opt/robotpkg/var/lib/robotpkg/packages/bsd/Ubuntu-19.04-x86_64/All/digest-20080510.tgz => Installing /opt/robotpkg/var/lib/robotpkg/packages/bsd/Ubuntu-19.04-x86_64/All/tnftp-20130505~ssl.tgz => Required robotpkg package digest>=20080510: digest-20080510 found => Required robotpkg package tnftp>=20091122: tnftp-20130505~ssl found => Required system package gnupg>=1: gnupg-2.2.12 found => Required system package gzip: gzip-1.9 found => Required system package pax and tar archivers: pax found => Required system package pkg_install>=20110805.9: pkg_install-20110805.9 found => Required system package pkgrepo2deb>=1.6.1: pkgrepo2deb-1.6.1 found => Dependency digest-20080510 already installed => Dependency tnftp-20130505~ssl already installed => Building with no option. => Use the GNU C compiler: avr-c-compiler provided by avr-gcc>=4.6 => Required system package avr-gcc>=4.6: avr-gcc-5.4.0 found => Required system package avr-libc: avr-libc found => SHA1 checksums OK => RMD160 checksums OK => Modifying GNU configure scripts to avoid --recheck => Disabling fatal errors with C++ preprocessor in GNU configure scripts => Registering installation for tk3-mikrokopter-1.8.4 => Linking package in /opt/robotpkg/var/lib/robotpkg/packages/bsd/Ubuntu-19.04-x86_64/pub => Updating debian binary packages ===> Logging bulk summary for tk3-mikrokopter-1.8.4 => Checking leftover files => Creating bulk log files => Logging bulk metadata ===> Cleaning temporary files for tk3-mikrokopter-1.8.4 ===> Done bulk for tk3-mikrokopter-1.8.4 [3%] Processing math/lapack:lapack-3.7.0r1~!doc ===> Cleaning temporary files for lapack-3.7.0r1 ===> Bulk building for lapack-3.7.0r1 => Checking for clear installation => Installing /opt/robotpkg/var/lib/robotpkg/packages/bsd/Ubuntu-19.04-x86_64/All/digest-20080510.tgz => Installing /opt/robotpkg/var/lib/robotpkg/packages/bsd/Ubuntu-19.04-x86_64/All/tnftp-20130505~ssl.tgz => Required robotpkg package digest>=20080510: digest-20080510 found => Required robotpkg package tnftp>=20091122: tnftp-20130505~ssl found => Required system package gnupg>=1: gnupg-2.2.12 found => Required system package gzip: gzip-1.9 found => Required system package patch>=2.0: patch-2.7.6 found => Required system package pax and tar archivers: pax found => Required system package pkg_install>=20110805.9: pkg_install-20110805.9 found => Required system package pkgrepo2deb>=1.6.1: pkgrepo2deb-1.6.1 found => Dependency digest-20080510 already installed => Dependency tnftp-20130505~ssl already installed => Use the GNU fortran compiler: fortran-compiler provided by => Required system package cmake>=2.6: cmake-3.13.4 found => Required system package gcc-fortran>=3: gcc-fortran-8 found => SHA1 checksums OK => RMD160 checksums OK => Applying robotpkg patches for lapack-3.7.0r1 => Registering installation for lapack-3.7.0r1 => Linking package in /opt/robotpkg/var/lib/robotpkg/packages/bsd/Ubuntu-19.04-x86_64/pub => Updating debian binary packages ===> Logging bulk summary for lapack-3.7.0r1 => Checking leftover files => Creating bulk log files => Logging bulk metadata ===> Cleaning temporary files for lapack-3.7.0r1 ===> Done bulk for lapack-3.7.0r1 [3%] Processing graphics/openvrml-libs:openvrml-libs-0.18.9~!doc ===> Cleaning temporary files for openvrml-libs-0.18.9 ===> Bulk building for openvrml-libs-0.18.9 => Checking for clear installation => Installing /opt/robotpkg/var/lib/robotpkg/packages/bsd/Ubuntu-19.04-x86_64/All/digest-20080510.tgz => Installing /opt/robotpkg/var/lib/robotpkg/packages/bsd/Ubuntu-19.04-x86_64/All/tnftp-20130505~ssl.tgz => Required robotpkg package digest>=20080510: digest-20080510 found => Required robotpkg package tnftp>=20091122: tnftp-20130505~ssl found => Required system package gnupg>=1: gnupg-2.2.12 found => Required system package gzip: gzip-1.9 found => Required system package patch>=2.0: patch-2.7.6 found => Required system package pax and tar archivers: pax found => Required system package pkg_install>=20110805.9: pkg_install-20110805.9 found => Required system package pkgrepo2deb>=1.6.1: pkgrepo2deb-1.6.1 found => Required system package boost-headers>=1.44<1.60: MISSING WARNING: Cannot check installed version of boost-lib-filesystem WARNING: Cannot check installed version of boost-lib-system WARNING: Cannot check installed version of boost-lib-thread => Dependency digest-20080510 already installed => Dependency tnftp-20130505~ssl already installed ERROR: ====================================================================== ERROR: Missing system packages required for openvrml-libs-0.18.9: ERROR: ERROR: boost-headers>=1.44<1.60 (Ubuntu package libboost-dev) ERROR: ERROR: Please use the system package management tool to install these ERROR: dependencies. If a robotpkg version of a dependency is available, ERROR: you can configure robotpkg.conf to use this version instead. ERROR: ERROR: See /local/robotpkg/var/tmp/robotpkg/graphics/openvrml-libs/work/sysdep.log for details. ERROR: ====================================================================== make[2]: *** [/local/robotpkg/var/lib/robotpkg/mk/depends/sysdep.mk:35: sys-depends] Error 2 ===> Logging bulk summary for openvrml-libs-0.18.9 => Checking leftover files => Creating bulk log files => Logging bulk metadata ===> Cleaning temporary files for openvrml-libs-0.18.9 ===> Done bulk for openvrml-libs-0.18.9 [3%] Processing audio/festival:festival-1.96~!doc ===> Cleaning temporary files for festival-1.96~ogireslpc ===> Bulk building for festival-1.96~ogireslpc ERROR: This package cannot be extracted for the following reason: ERROR: ====================================================================== ERROR: festival-1.96~ogireslpc has an unacceptable license: ERROR: ohsu-license ERROR: ERROR: . To view the license, enter "make show-license". ERROR: . To indicate acceptance, add this line: ERROR: ERROR: ACCEPTABLE_LICENSES+=ohsu-license ERROR: ERROR: to /opt/robotpkg/etc/robotpkg.conf ERROR: ERROR: ====================================================================== make[2]: *** [/local/robotpkg/var/lib/robotpkg/mk/internal/can-be-built-here.mk:204: cbeh] Error 2 ===> Logging bulk summary for festival-1.96~ogireslpc => Checking leftover files => Creating bulk log files => Logging bulk metadata ===> Cleaning temporary files for festival-1.96~ogireslpc ===> Done bulk for festival-1.96~ogireslpc [4%] Processing graphics/vcglib:vcglib-20100824~doc Warning: DOXYGEN_PLIST_DIR in graphics/vcglib is deprecated. Warning: use DYNAMIC_PLIST_DIRS instead. Warning: DOXYGEN_PLIST_DIR in graphics/vcglib is deprecated. Warning: use DYNAMIC_PLIST_DIRS instead. ===> Cleaning temporary files for vcglib-20100824~doc ===> Bulk building for vcglib-20100824~doc => Checking for clear installation Warning: DOXYGEN_PLIST_DIR in graphics/vcglib is deprecated. Warning: use DYNAMIC_PLIST_DIRS instead. => Installing /opt/robotpkg/var/lib/robotpkg/packages/bsd/Ubuntu-19.04-x86_64/All/digest-20080510.tgz => Installing /opt/robotpkg/var/lib/robotpkg/packages/bsd/Ubuntu-19.04-x86_64/All/tnftp-20130505~ssl.tgz Warning: DOXYGEN_PLIST_DIR in graphics/vcglib is deprecated. Warning: use DYNAMIC_PLIST_DIRS instead. => Required robotpkg package digest>=20080510: digest-20080510 found => Required robotpkg package tnftp>=20091122: tnftp-20130505~ssl found => Required system package gnupg>=1: gnupg-2.2.12 found => Required system package gzip: gzip-1.9 found => Required system package pax and tar archivers: pax found => Required system package pkg_install>=20110805.9: pkg_install-20110805.9 found => Required system package pkgrepo2deb>=1.6.1: pkgrepo2deb-1.6.1 found => Required system package svn>=1.6: svn-1.10.0 found Warning: DOXYGEN_PLIST_DIR in graphics/vcglib is deprecated. Warning: use DYNAMIC_PLIST_DIRS instead. Warning: DOXYGEN_PLIST_DIR in graphics/vcglib is deprecated. Warning: use DYNAMIC_PLIST_DIRS instead. => Dependency digest-20080510 already installed => Required system package eigen2>=2.0.12: MISSING => Dependency tnftp-20130505~ssl already installed Warning: DOXYGEN_PLIST_DIR in graphics/vcglib is deprecated. Warning: use DYNAMIC_PLIST_DIRS instead. ERROR: ====================================================================== ERROR: Missing system packages required for vcglib-20100824~doc: ERROR: ERROR: eigen2>=2.0.12 (Ubuntu package libeigen2-dev) ERROR: ERROR: Please use the system package management tool to install these ERROR: dependencies. If a robotpkg version of a dependency is available, ERROR: you can configure robotpkg.conf to use this version instead. ERROR: ERROR: See /local/robotpkg/var/tmp/robotpkg/graphics/vcglib/work/sysdep.log for details. ERROR: ====================================================================== make[2]: *** [/local/robotpkg/var/lib/robotpkg/mk/depends/sysdep.mk:35: sys-depends] Error 2 Warning: DOXYGEN_PLIST_DIR in graphics/vcglib is deprecated. Warning: use DYNAMIC_PLIST_DIRS instead. ===> Logging bulk summary for vcglib-20100824~doc => Checking leftover files => Creating bulk log files => Logging bulk metadata Warning: DOXYGEN_PLIST_DIR in graphics/vcglib is deprecated. Warning: use DYNAMIC_PLIST_DIRS instead. Warning: DOXYGEN_PLIST_DIR in graphics/vcglib is deprecated. Warning: use DYNAMIC_PLIST_DIRS instead. Warning: DOXYGEN_PLIST_DIR in graphics/vcglib is deprecated. Warning: use DYNAMIC_PLIST_DIRS instead. ===> Cleaning temporary files for vcglib-20100824~doc ===> Done bulk for vcglib-20100824~doc [4%] Processing graphics/vcglib:vcglib-20100824~!doc ===> Cleaning temporary files for vcglib-20100824 ===> Bulk building for vcglib-20100824 => Checking for clear installation => Installing /opt/robotpkg/var/lib/robotpkg/packages/bsd/Ubuntu-19.04-x86_64/All/digest-20080510.tgz => Installing /opt/robotpkg/var/lib/robotpkg/packages/bsd/Ubuntu-19.04-x86_64/All/tnftp-20130505~ssl.tgz => Required robotpkg package digest>=20080510: digest-20080510 found => Required robotpkg package tnftp>=20091122: tnftp-20130505~ssl found => Required system package gnupg>=1: gnupg-2.2.12 found => Required system package gzip: gzip-1.9 found => Required system package pax and tar archivers: pax found => Required system package pkg_install>=20110805.9: pkg_install-20110805.9 found => Required system package pkgrepo2deb>=1.6.1: pkgrepo2deb-1.6.1 found => Required system package svn>=1.6: svn-1.10.0 found => Dependency digest-20080510 already installed => Required system package eigen2>=2.0.12: MISSING => Dependency tnftp-20130505~ssl already installed ERROR: ====================================================================== ERROR: Missing system packages required for vcglib-20100824: ERROR: ERROR: eigen2>=2.0.12 (Ubuntu package libeigen2-dev) ERROR: ERROR: Please use the system package management tool to install these ERROR: dependencies. If a robotpkg version of a dependency is available, ERROR: you can configure robotpkg.conf to use this version instead. ERROR: ERROR: See /local/robotpkg/var/tmp/robotpkg/graphics/vcglib/work/sysdep.log for details. ERROR: ====================================================================== make[2]: *** [/local/robotpkg/var/lib/robotpkg/mk/depends/sysdep.mk:35: sys-depends] Error 2 ===> Logging bulk summary for vcglib-20100824 => Checking leftover files => Creating bulk log files => Logging bulk metadata Warning: DOXYGEN_PLIST_DIR in graphics/vcglib is deprecated. Warning: use DYNAMIC_PLIST_DIRS instead. ===> Cleaning temporary files for vcglib-20100824 ===> Done bulk for vcglib-20100824 [4%] Processing pkgtools/install-sh:install-sh-20070712~!doc ===> Cleaning temporary files for install-sh-20070712 ===> Bulk building for install-sh-20070712 => Checking for clear installation => Required system package gnupg>=1: gnupg-2.2.12 found => Required system package gzip: gzip-1.9 found => Required system package pkg_install>=20110805.9: pkg_install-20110805.9 found => Required system package pkgrepo2deb>=1.6.1: pkgrepo2deb-1.6.1 found => Building with no option. => Use the GNU C compiler: c-compiler provided by gcc>=3 => Required system package gcc>=3: gcc-8 found => Configuring default programs => Registering installation for install-sh-20070712 => Linking package in /opt/robotpkg/var/lib/robotpkg/packages/bsd/Ubuntu-19.04-x86_64/pub => Updating debian binary packages ===> Logging bulk summary for install-sh-20070712 => Checking leftover files => Creating bulk log files => Logging bulk metadata ===> Cleaning temporary files for install-sh-20070712 ===> Done bulk for install-sh-20070712 [4%] Processing net/evart-client:evart-client-2.2~doc Warning: DOXYGEN_PLIST_DIR in net/evart-client is deprecated. Warning: use DYNAMIC_PLIST_DIRS instead. Warning: DOXYGEN_PLIST_DIR in net/evart-client is deprecated. Warning: use DYNAMIC_PLIST_DIRS instead. ===> Cleaning temporary files for evart-client-2.2~doc ===> Bulk building for evart-client-2.2~doc => Checking for clear installation Warning: DOXYGEN_PLIST_DIR in net/evart-client is deprecated. Warning: use DYNAMIC_PLIST_DIRS instead. => Installing /opt/robotpkg/var/lib/robotpkg/packages/bsd/Ubuntu-19.04-x86_64/All/digest-20080510.tgz => Installing /opt/robotpkg/var/lib/robotpkg/packages/bsd/Ubuntu-19.04-x86_64/All/tnftp-20130505~ssl.tgz Warning: DOXYGEN_PLIST_DIR in net/evart-client is deprecated. Warning: use DYNAMIC_PLIST_DIRS instead. => Required robotpkg package digest>=20080510: digest-20080510 found => Required robotpkg package tnftp>=20091122: tnftp-20130505~ssl found => Required system package gnupg>=1: gnupg-2.2.12 found => Required system package gzip: gzip-1.9 found => Required system package patch>=2.0: patch-2.7.6 found => Required system package pax and tar archivers: pax found => Required system package pkg_install>=20110805.9: pkg_install-20110805.9 found => Required system package pkgrepo2deb>=1.6.1: pkgrepo2deb-1.6.1 found Warning: DOXYGEN_PLIST_DIR in net/evart-client is deprecated. Warning: use DYNAMIC_PLIST_DIRS instead. Warning: DOXYGEN_PLIST_DIR in net/evart-client is deprecated. Warning: use DYNAMIC_PLIST_DIRS instead. => Dependency digest-20080510 already installed => Dependency tnftp-20130505~ssl already installed Warning: DOXYGEN_PLIST_DIR in net/evart-client is deprecated. Warning: use DYNAMIC_PLIST_DIRS instead. => Building with the following options: => Use the GNU C compiler: c-compiler provided by gcc>=3 => Required system package doxygen>=1.5: doxygen-1.8.13 found => Required system package gcc>=3: gcc-8 found Warning: DOXYGEN_PLIST_DIR in net/evart-client is deprecated. Warning: use DYNAMIC_PLIST_DIRS instead. Warning: DOXYGEN_PLIST_DIR in net/evart-client is deprecated. Warning: use DYNAMIC_PLIST_DIRS instead. Warning: DOXYGEN_PLIST_DIR in net/evart-client is deprecated. Warning: use DYNAMIC_PLIST_DIRS instead. => SHA1 checksums OK => RMD160 checksums OK => Applying robotpkg patches for evart-client-2.2~doc => Modifying GNU configure scripts to avoid --recheck => Disabling fatal errors with C++ preprocessor in GNU configure scripts Warning: DOXYGEN_PLIST_DIR in net/evart-client is deprecated. Warning: use DYNAMIC_PLIST_DIRS instead. => Registering installation for evart-client-2.2~doc Warning: DOXYGEN_PLIST_DIR in net/evart-client is deprecated. Warning: use DYNAMIC_PLIST_DIRS instead. => Linking package in /opt/robotpkg/var/lib/robotpkg/packages/bsd/Ubuntu-19.04-x86_64/pub => Updating debian binary packages Warning: DOXYGEN_PLIST_DIR in net/evart-client is deprecated. Warning: use DYNAMIC_PLIST_DIRS instead. ===> Logging bulk summary for evart-client-2.2~doc => Checking leftover files => Creating bulk log files => Logging bulk metadata Warning: DOXYGEN_PLIST_DIR in net/evart-client is deprecated. Warning: use DYNAMIC_PLIST_DIRS instead. Warning: DOXYGEN_PLIST_DIR in net/evart-client is deprecated. Warning: use DYNAMIC_PLIST_DIRS instead. Warning: DOXYGEN_PLIST_DIR in net/evart-client is deprecated. Warning: use DYNAMIC_PLIST_DIRS instead. ===> Cleaning temporary files for evart-client-2.2~doc ===> Done bulk for evart-client-2.2~doc [4%] Processing net/evart-client:evart-client-2.2~!doc ===> Cleaning temporary files for evart-client-2.2 ===> Bulk building for evart-client-2.2 => Checking for clear installation => Installing /opt/robotpkg/var/lib/robotpkg/packages/bsd/Ubuntu-19.04-x86_64/All/digest-20080510.tgz => Installing /opt/robotpkg/var/lib/robotpkg/packages/bsd/Ubuntu-19.04-x86_64/All/tnftp-20130505~ssl.tgz => Required robotpkg package digest>=20080510: digest-20080510 found => Required robotpkg package tnftp>=20091122: tnftp-20130505~ssl found => Required system package gnupg>=1: gnupg-2.2.12 found => Required system package gzip: gzip-1.9 found => Required system package patch>=2.0: patch-2.7.6 found => Required system package pax and tar archivers: pax found => Required system package pkg_install>=20110805.9: pkg_install-20110805.9 found => Required system package pkgrepo2deb>=1.6.1: pkgrepo2deb-1.6.1 found => Dependency digest-20080510 already installed => Dependency tnftp-20130505~ssl already installed => Building with no option. => Use the GNU C compiler: c-compiler provided by gcc>=3 => Required system package gcc>=3: gcc-8 found => SHA1 checksums OK => RMD160 checksums OK => Applying robotpkg patches for evart-client-2.2 => Modifying GNU configure scripts to avoid --recheck => Disabling fatal errors with C++ preprocessor in GNU configure scripts An unexpected error occured. The last 10 log lines are shown below. | make[3]: Entering directory '/local/robotpkg/var/tmp/robotpkg/net/evart-client/work/evart-client-2.2' | doc/doxyfile | make[3]: execvp: doc/doxyfile: Permission denied | make[3]: *** [Makefile:797: doc] Error 127 | make[3]: Leaving directory '/local/robotpkg/var/tmp/robotpkg/net/evart-client/work/evart-client-2.2' | make[2]: Leaving directory '/local/robotpkg/var/tmp/robotpkg/net/evart-client/work/evart-client-2.2' | make[1]: Leaving directory '/local/robotpkg/var/tmp/robotpkg/net/evart-client/work/evart-client-2.2' | make[2]: *** [Makefile:725: install-data-am] Error 2 | make[1]: *** [Makefile:682: install-am] Error 2 | make: *** [Makefile:365: install-recursive] Error 1 For details or bug reports, check the complete log file in: /local/robotpkg/var/tmp/robotpkg/net/evart-client/work/install.log make[4]: *** [/local/robotpkg/var/lib/robotpkg/mk/install/install.mk:304: do-install] Error 2 => Undoing failed installation ERROR: ====================================================================== ERROR: Installation of evart-client-2.2 failed. ERROR: ERROR: Check /local/robotpkg/var/tmp/robotpkg/net/evart-client/work/install.log for details ERROR: ====================================================================== make[3]: *** [/local/robotpkg/var/lib/robotpkg/mk/install/install.mk:263: install-failed] Error 2 => Marking evart-client-2.2 as broken make[2]: *** [/local/robotpkg/var/lib/robotpkg/mk/pkg/package.mk:42: pkg-check-installed] Error 2 ERROR: make: *** [package] Error 2 ===> Logging bulk summary for evart-client-2.2 => Checking leftover files => Creating bulk log files => Logging bulk metadata Warning: DOXYGEN_PLIST_DIR in net/evart-client is deprecated. Warning: use DYNAMIC_PLIST_DIRS instead. ===> Cleaning temporary files for evart-client-2.2 ===> Done bulk for evart-client-2.2 [4%] Processing optimization/roboptim-core:roboptim-core-3.1r1~!doc ===> Cleaning temporary files for roboptim-core-3.1r1 ===> Bulk building for roboptim-core-3.1r1 => Checking for clear installation => Installing /opt/robotpkg/var/lib/robotpkg/packages/bsd/Ubuntu-19.04-x86_64/All/digest-20080510.tgz => Installing /opt/robotpkg/var/lib/robotpkg/packages/bsd/Ubuntu-19.04-x86_64/All/tnftp-20130505~ssl.tgz => Required robotpkg package digest>=20080510: digest-20080510 found => Required robotpkg package tnftp>=20130505~ssl: tnftp-20130505~ssl found => Required system package gnupg>=1: gnupg-2.2.12 found => Required system package gzip: gzip-1.9 found => Required system package patch>=2.0: patch-2.7.6 found => Required system package pax and tar archivers: pax found => Required system package pkg_install>=20110805.9: pkg_install-20110805.9 found => Required system package pkgrepo2deb>=1.6.1: pkgrepo2deb-1.6.1 found => Dependency digest-20080510 already installed => Dependency tnftp-20130505~ssl already installed => Building with no option. => Use the GNU C++ compiler: c++-compiler provided by g++>=4.6 => Use the GNU C compiler: c-compiler provided by gcc>=3 => Required system package boost-headers>=1.34.1: boost-headers-1.67 found => Required system package boostlib-filesystem>=1.34.1: boost-libs-1.67.0 found => Required system package boostlib-iostreams>=1.34.1: boost-libs-1.67.0 found => Required system package boostlib-math>=1.34.1: boost-libs-1.67.0 found => Required system package boostlib-thread>=1.34.1: boost-libs-1.67.0 found => Required system package cmake>=2.6: cmake-3.13.4 found => Required system package doxygen>=1.5: doxygen-1.8.13 found => Required system package eigen3>=3.2.0: eigen3-3.3.7 found => Required system package g++>=4.6: g++-8 found => Required system package gcc>=3: gcc-8 found => Required system package GNU m4>=1.4: gm4-1.4.18 found => Required system package latex>=3.14: latex-3.14159265 found => Required system package libstdc++: libstdc++ found => Required system package libtool>=1.5.22: libtool-2.4.6 found => Required system package libtool-ltdl>=1.5.22: libtool-ltdl-2.4.6 found => Required system package log4cxx>=0.10: log4cxx-0.10.0 found => Required system package pkg-config>=0.22: pkg-config-0.29.1 found => SHA1 checksums OK => RMD160 checksums OK => Applying robotpkg patches for roboptim-core-3.1r1 => Adding run-time search paths to pkg-config files => Registering installation for roboptim-core-3.1r1 => Linking package in /opt/robotpkg/var/lib/robotpkg/packages/bsd/Ubuntu-19.04-x86_64/pub => Updating debian binary packages ===> Logging bulk summary for roboptim-core-3.1r1 => Checking leftover files => Creating bulk log files => Logging bulk metadata ===> Cleaning temporary files for roboptim-core-3.1r1 ===> Done bulk for roboptim-core-3.1r1 [5%] Processing graphics/gerard-bauzil:gerard-bauzil-1.1.0~!doc ===> Cleaning temporary files for gerard-bauzil-1.1.0 ===> Bulk building for gerard-bauzil-1.1.0 => Checking for clear installation => Installing /opt/robotpkg/var/lib/robotpkg/packages/bsd/Ubuntu-19.04-x86_64/All/digest-20080510.tgz => Installing /opt/robotpkg/var/lib/robotpkg/packages/bsd/Ubuntu-19.04-x86_64/All/tnftp-20130505~ssl.tgz => Required robotpkg package digest>=20080510: digest-20080510 found => Required robotpkg package tnftp>=20091122: tnftp-20130505~ssl found => Required system package gnupg>=1: gnupg-2.2.12 found => Required system package gzip: gzip-1.9 found => Required system package pax and tar archivers: pax found => Required system package pkg_install>=20110805.9: pkg_install-20110805.9 found => Required system package pkgrepo2deb>=1.6.1: pkgrepo2deb-1.6.1 found => Dependency digest-20080510 already installed => Dependency tnftp-20130505~ssl already installed => Building with no option. => Use the GNU C++ compiler: c++-compiler provided by g++>=3 => Use the GNU C compiler: c-compiler provided by gcc>=3 => Required system package cmake>=2.6: cmake-3.13.4 found => Required system package doxygen>=1.5: doxygen-1.8.13 found => Required system package g++>=3: g++-8 found => Required system package gcc>=3: gcc-8 found => Required system package latex>=3.14: latex-3.14159265 found => Required system package libstdc++: libstdc++ found => Required system package pkg-config>=0.22: pkg-config-0.29.1 found => SHA1 checksums OK => RMD160 checksums OK => Adding run-time search paths to pkg-config files => Registering installation for gerard-bauzil-1.1.0 => Linking package in /opt/robotpkg/var/lib/robotpkg/packages/bsd/Ubuntu-19.04-x86_64/pub => Updating debian binary packages ===> Logging bulk summary for gerard-bauzil-1.1.0 => Checking leftover files => Creating bulk log files => Logging bulk metadata ===> Cleaning temporary files for gerard-bauzil-1.1.0 ===> Done bulk for gerard-bauzil-1.1.0 [5%] Processing graphics/laaswm-libs:laaswm-libs-1.2~!doc ===> Cleaning temporary files for laaswm-libs-1.2 ===> Bulk building for laaswm-libs-1.2 => Checking for clear installation => Installing /opt/robotpkg/var/lib/robotpkg/packages/bsd/Ubuntu-19.04-x86_64/All/digest-20080510.tgz => Installing /opt/robotpkg/var/lib/robotpkg/packages/bsd/Ubuntu-19.04-x86_64/All/tnftp-20130505~ssl.tgz => Required robotpkg package digest>=20080510: digest-20080510 found => Required robotpkg package tnftp>=20091122: tnftp-20130505~ssl found => Required system package gnupg>=1: gnupg-2.2.12 found => Required system package gzip: gzip-1.9 found => Required system package patch>=2.0: patch-2.7.6 found => Required system package pax and tar archivers: pax found => Required system package pkg_install>=20110805.9: pkg_install-20110805.9 found => Required system package pkgrepo2deb>=1.6.1: pkgrepo2deb-1.6.1 found => Dependency digest-20080510 already installed => Dependency tnftp-20130505~ssl already installed => Building with no option. => Use the GNU C compiler: c-compiler provided by gcc>=3 => Use tcl-8.6: tcl>=8.4 provided by tcl86>=8.6<8.7 => Required system package gcc>=3: gcc-8 found => Required system package GNU m4>=1.4: gm4-1.4.18 found => Required system package libtool>=1.5.22: libtool-2.4.6 found => Required system package tcl86>=8.6<8.7: tcl86-8.6 found => SHA1 checksums OK => RMD160 checksums OK => Applying robotpkg patches for laaswm-libs-1.2 => Modifying GNU configure scripts to avoid --recheck => Disabling fatal errors with C++ preprocessor in GNU configure scripts => Registering installation for laaswm-libs-1.2 => Linking package in /opt/robotpkg/var/lib/robotpkg/packages/bsd/Ubuntu-19.04-x86_64/pub => Updating debian binary packages ===> Logging bulk summary for laaswm-libs-1.2 => Checking leftover files => Creating bulk log files => Logging bulk metadata ===> Cleaning temporary files for laaswm-libs-1.2 ===> Done bulk for laaswm-libs-1.2 [5%] Processing graphics/flann:flann-1.7.1r1~!doc ===> Cleaning temporary files for flann-1.7.1r1 ===> Bulk building for flann-1.7.1r1 => Checking for clear installation => Installing /opt/robotpkg/var/lib/robotpkg/packages/bsd/Ubuntu-19.04-x86_64/All/digest-20080510.tgz => Installing /opt/robotpkg/var/lib/robotpkg/packages/bsd/Ubuntu-19.04-x86_64/All/tnftp-20130505~ssl.tgz => Required robotpkg package digest>=20080510: digest-20080510 found => Required robotpkg package tnftp>=20091122: tnftp-20130505~ssl found => Required system package gnupg>=1: gnupg-2.2.12 found => Required system package gzip: gzip-1.9 found => Required system package patch>=2.0: patch-2.7.6 found => Required system package pkg_install>=20110805.9: pkg_install-20110805.9 found => Required system package pkgrepo2deb>=1.6.1: pkgrepo2deb-1.6.1 found => Required system package unzip: unzip found => Dependency digest-20080510 already installed => Dependency tnftp-20130505~ssl already installed => Building with no option. => Use the GNU C++ compiler: c++-compiler provided by g++>=3 => Use the GNU C compiler: c-compiler provided by gcc>=3 => Required system package cmake>=2.6: cmake-3.13.4 found => Required system package g++>=3: g++-8 found => Required system package gcc>=3: gcc-8 found => Required system package latex>=3.14: latex-3.14159265 found => Required system package libstdc++: libstdc++ found => SHA1 checksums OK => RMD160 checksums OK => Applying robotpkg patches for flann-1.7.1r1 => Registering installation for flann-1.7.1r1 => Linking package in /opt/robotpkg/var/lib/robotpkg/packages/bsd/Ubuntu-19.04-x86_64/pub => Updating debian binary packages ===> Logging bulk summary for flann-1.7.1r1 => Checking leftover files => Creating bulk log files => Logging bulk metadata ===> Cleaning temporary files for flann-1.7.1r1 ===> Done bulk for flann-1.7.1r1 [5%] Processing middleware/ace:ace-6.4.6~!doc ===> Cleaning temporary files for ace-6.4.6 ===> Bulk building for ace-6.4.6 => Checking for clear installation => Installing /opt/robotpkg/var/lib/robotpkg/packages/bsd/Ubuntu-19.04-x86_64/All/digest-20080510.tgz => Installing /opt/robotpkg/var/lib/robotpkg/packages/bsd/Ubuntu-19.04-x86_64/All/tnftp-20130505~ssl.tgz => Required robotpkg package digest>=20080510: digest-20080510 found => Required robotpkg package tnftp>=20091122: tnftp-20130505~ssl found => Required system package gnupg>=1: gnupg-2.2.12 found => Required system package GNU tar: gtar-1.30 found => Required system package gzip: gzip-1.9 found => Required system package patch>=2.0: patch-2.7.6 found => Required system package pax and tar archivers: pax found => Required system package pkg_install>=20110805.9: pkg_install-20110805.9 found => Required system package pkgrepo2deb>=1.6.1: pkgrepo2deb-1.6.1 found => Dependency digest-20080510 already installed => Dependency tnftp-20130505~ssl already installed => Building with no option. => Use the GNU C++ compiler: c++-compiler provided by g++>=3 => Use the GNU C compiler: c-compiler provided by gcc>=3 => Required system package g++>=3: g++-8 found => Required system package gcc>=3: gcc-8 found => Required system package libstdc++: libstdc++ found => Required system package perl>=5: perl-5 found => Required system package pkg-config>=0.22: pkg-config-0.29.1 found => SHA1 checksums OK => RMD160 checksums OK => Applying robotpkg patches for ace-6.4.6 => Replacing perl interpreter path => Adding run-time search paths to pkg-config files Full pathname symlink `/opt/openrobots/bin/ace_gperf' is target of `/opt/openrobots/share/ace/bin/ace_gperf' - adjusting to `../../../bin/ace_gperf' => Registering installation for ace-6.4.6 => Linking package in /opt/robotpkg/var/lib/robotpkg/packages/bsd/Ubuntu-19.04-x86_64/pub => Updating debian binary packages ===> Logging bulk summary for ace-6.4.6 => Checking leftover files => Creating bulk log files => Logging bulk metadata ===> Cleaning temporary files for ace-6.4.6 ===> Done bulk for ace-6.4.6 [5%] Processing graphics/sun-java3d:sun-java3d-1.5.1~!doc ===> Bulk building for sun-java3d-1.5.1 => Bulk cancelled by /local/robotpkg/var/log/bulk/STOP ERROR: Interrupt ===> Done bulk for rbulk base set 10558.26user 1187.77system 1:12:01elapsed 271%CPU (0avgtext+0avgdata 1121916maxresident)k 1485712inputs+4915672outputs (1651major+108659320minor)pagefaults 0swaps --- Updating bulk database --------------------------------------- Collecting session logs in /local/robotpkg/var/log/bulk updated robotpkg-guide-20191117~pdf updated zlib-1.2.3 updated ace-6.4.6 updated festlex-cmu-1.96 updated libnbcompat-20150615 updated tk3-mikrokopter-1.8.4 updated libt3d-2.6 updated digest-20080510 updated vcglib-20100824~doc updated libarchive-2.8.4 updated tnftp-20130505~ssl updated roboptim-core-3.1r1 updated lapack-3.7.0r1 updated gerard-bauzil-1.1.0 updated install-sh-20070712 updated swig-2.0.4 updated sahand-libs-08.08.14r1 updated vcglib-20100824 updated pkg_install-20110805.9 updated robotpkg_chk-1.1 updated flann-1.7.1r1 updated libfetch-2.33.1 updated libt3d-2.6~doc updated openvrml-libs-0.18.9 updated gyro-libs-3.1r3 updated swig-2.0.4~doc updated evart-client-2.2~doc updated url2robotpkg-2.7 updated tth-4.09 updated laaswm-libs-1.2 updated pax-20080110 updated robotpkgdb-20191117~csv+sqlite updated evart-client-2.2 updated festival-1.96~ogireslpc updated bzip2-1.0.5 processed 35 packages