robotpkg bulk build results

Log for Fedora-23-x86_64 (Back)

--- Updating robotpkg ------------------------------------------------ Pulling /local/robotpkg/var/lib/robotpkg/ Updating 72f1091..1b9e854 Fast-forward localization/pom-genom3/Makefile | 1 + localization/pom-genom3/distinfo | 1 + localization/pom-genom3/patches/patch-aa | 23 +++++++++++++++++++++++ 3 files changed, 25 insertions(+) create mode 100644 localization/pom-genom3/patches/patch-aa Updating pkgtools/pkg_install ===> Updating for pkg_install-20110805.7 pkg_install-20110805.7 is already installed and up-to-date. Updating pkgtools/rbulkit ===> Updating for rbulkit-20170123 rbulkit-20170123 is already installed and up-to-date. --- Running build for bulk-rbulk ----------------------------------- ===> Sorting packages for rbulk base set Scanning mapping/segkit:* [mapping/segkit:*] Warning: the LICENSE of mapping/segkit is undefined. Scanning hardware/velodyne-genom:* Scanning devel/jafar-kernel:* Scanning sysutils/arduio:* Scanning meta-pkgs/ros-desktop:* Scanning devel/gbx-share:* [devel/gbx-share:*] Warning: USE_LANGUAGES in devel/gbx-share is deprecated. Scanning devel/orocos-log4cpp:* Scanning simulation/bullet:* Scanning audio/ogi-voice-as-diphone:* Scanning robots/neobotix-libs:* Scanning archivers/zlib:* Scanning path/hpp-kwsio:* Scanning optimization/roboptim-core:* Scanning devel/log4cxx:* Scanning pkgtools/pkgin:* Scanning interfaces/ros-common-msgs:* Scanning pkgtools/tnftp:tnftp>=20130505~ssl Scanning graphics/gepetto-viewer:* Scanning graphics/jafar-gdhe:* Scanning robots/mor-libs:* Scanning mapping/mapkit:* [mapping/mapkit:*] Warning: the LICENSE of mapping/mapkit is undefined. Scanning localization/MTI-genom:* [localization/MTI-genom:*] Warning: the LICENSE of localization/MTI-genom is undefined. Scanning doc/boost-docs:* Scanning hardware/libftdi:* Scanning path/hpp-manipulation-corba:* Scanning interfaces/abstract-gik-task:* Scanning audio/festlex-cmu:* Scanning image/libdc1394-1:* Scanning graphics/coldman-genom:* Scanning meta-pkgs/mana:* Scanning audio/clone-genom:* [audio/clone-genom:*] Warning: the LICENSE of audio/clone-genom is undefined. Scanning math/meschach:* Scanning net/rosix:* Scanning interfaces/genPos-genom:* Scanning hardware/ros-driver-common:* Scanning devel/ros-filters:* Scanning math/tvmet:* [math/tvmet:*] Warning: the LICENSE of math/tvmet is undefined. Scanning sysutils/y2l:* Scanning image/visp:* Scanning image/viam-libs:* Scanning math/hpp-geometry:* Scanning meta-pkgs/hpp:* Scanning image/ros-image-common:* Scanning optimization/roboptim-trajectory:* Scanning graphics/ros-interactive-markers:* Scanning graphics/pqp:* Scanning interfaces/jrl-mal:* Scanning path/hpp-wholebody-step-corba:* Scanning audio/OGIlexicon:* Scanning graphics/ros-shape-tools:* Scanning devel/ros-realtime-tools:* Scanning robots/player20-libs:* Scanning net/py-poco:* Scanning graphics/laaswm-libs:* Scanning hardware/gyro-libs:* Scanning math/ros-geometry2:* Scanning math/jrl-dynamics-urdf:* Scanning lang/ros-message-generation:* Scanning devel/ros-roscpp-core:* Scanning localization/GPS-genom:* Scanning sysutils/py-catkin-pkg:* Scanning mapping/worldmodelgrid3dg-genom:* [mapping/worldmodelgrid3dg-genom:*] Warning: the LICENSE of mapping/worldmodelgrid3dg-genom is undefined. Scanning devel/ros-nodelet-core:* Scanning hardware/serial:* Scanning motion/dynamic-graph-corba:* Scanning graphics/collada-dom:* Scanning math/jafar-jmath:* Scanning graphics/ros-geometric-shapes:* Scanning optimization/roboptim-core-cfsqp-plugin:* [optimization/roboptim-core-cfsqp-plugin:*] Warning: DOXYGEN_PLIST_DIR in optimization/roboptim-core-cfsqp-plugin is deprecated. [optimization/roboptim-core-cfsqp-plugin:*] Warning: use DYNAMIC_PLIST_DIRS instead. Scanning net/evart-stream:* Scanning interfaces/ros-control-msgs:* Scanning path/maneuver-genom3:* Scanning motion/sot-dynamic:* Scanning pkgtools/pkg-config:* Scanning interfaces/ros-map-msgs:* Scanning path/hpp-environment-data:* Scanning motion/softMotion-libs:* Scanning sysutils/py-aafigure:* Scanning robots/rmp440-genom:* Scanning motion/ros-orocos-kdl:* Scanning devel/ros-pluginlib:* Scanning robots/ivmob-libs:* Scanning path/hpp-dynamic-obstacle:* [path/hpp-dynamic-obstacle:*] Warning: DOXYGEN_PLIST_DIR in path/hpp-dynamic-obstacle is deprecated. [path/hpp-dynamic-obstacle:*] Warning: use DYNAMIC_PLIST_DIRS instead. [path/hpp-dynamic-obstacle:*] Warning: the LICENSE of path/hpp-dynamic-obstacle is undefined. Scanning sysutils/py-rospkg:* Scanning sysutils/console-bridge:* Scanning doc/demo-genom:* Scanning math/t3d:* [math/t3d:*] Warning: DOXYGEN_PLIST_DIR in math/t3d is deprecated. [math/t3d:*] Warning: use DYNAMIC_PLIST_DIRS instead. Scanning middleware/ros-genmsg:* Scanning lang/sun-jdk:* Scanning math/liblbfgs:* Scanning devel/ros-cmake-modules:* Scanning audio/sphinx2:* Scanning image/jafar-correl:* Scanning robots/jloco-genom:* [robots/jloco-genom:*] Warning: the LICENSE of robots/jloco-genom is undefined. Scanning lang/ros-message-runtime:* Scanning pkgtools/digest:* Scanning localization/gyro-genom:* [localization/gyro-genom:*] Warning: the LICENSE of localization/gyro-genom is undefined. Scanning path/hpp-statistics:* Scanning math/geometric-tools:* Scanning hardware/sickLib:* Scanning motion/pilo-genom:* [motion/pilo-genom:*] Warning: the LICENSE of motion/pilo-genom is undefined. Scanning graphics/ros-convex-decomposition:* Scanning graphics/ros-rqt-common-plugins:* Scanning motion/ros-control-toolbox:* Scanning motion/locoDemo-genom:* Scanning optimization/acado:* Scanning audio/speett-genom:* Scanning localization/hueblob-genom:* Scanning speech/gspeett:* Scanning pkgtools/pkg_install:* Scanning hardware/velodyne-libs:* Scanning architecture/genom3:* Scanning middleware/ros-comm:* Scanning middleware/omniORBpy:* Scanning graphics/flann:* Scanning hardware/GPSNovatel:* [hardware/GPSNovatel:*] Warning: the LICENSE of hardware/GPSNovatel is undefined. Scanning image/artoolkitplus:* Scanning motion/orocos-kdl:* Scanning robots/ivmob-genom:* Scanning robots/tk3-mikrokopter:* Scanning sysutils/alog:* Scanning middleware/openni2:* Scanning middleware/naoqi:* Scanning motion/dynamic-graph:* Scanning sysutils/tk3-flash:* Scanning interfaces/openrobots-idl:* Scanning simulation/morse-yarp:* Scanning path/ndd-genom:* [path/ndd-genom:*] Warning: the LICENSE of path/ndd-genom is undefined. Scanning math/eigen2:* Scanning math/eigen3:* Scanning localization/odokit:* [localization/odokit:*] Warning: the LICENSE of localization/odokit is undefined. Scanning hardware/sahand-libs:* Scanning graphics/gdhe:* Scanning hardware/sahand-genom:* [hardware/sahand-genom:*] Warning: the LICENSE of hardware/sahand-genom is undefined. Scanning supervision/matlab-genomix:* Scanning path/hpp-localstepper:* [path/hpp-localstepper:*] Warning: DOXYGEN_PLIST_DIR in path/hpp-localstepper is deprecated. [path/hpp-localstepper:*] Warning: use DYNAMIC_PLIST_DIRS instead. Scanning middleware/openni:* Scanning knowledge/py-oro:* Scanning lang/python31:* Scanning path/hpp-worldmodelplanner:* [path/hpp-worldmodelplanner:*] Warning: DOXYGEN_PLIST_DIR in path/hpp-worldmodelplanner is deprecated. [path/hpp-worldmodelplanner:*] Warning: use DYNAMIC_PLIST_DIRS instead. [path/hpp-worldmodelplanner:*] Warning: the LICENSE of path/hpp-worldmodelplanner is undefined. Scanning lang/python32:* Scanning lang/python33:* Scanning mapping/zone-genom:* [mapping/zone-genom:*] Warning: the LICENSE of mapping/zone-genom is undefined. Scanning interfaces/genHum-genom:* Scanning audio/festvox-cmu-us-awb-arctic-hts:* Scanning math/ros-random-numbers:* Scanning lang/ros-gencpp:* Scanning devel/ros-xacro:* Scanning math/gbM:* Scanning math/fsqp:* [math/fsqp:*] Warning: DOXYGEN_PLIST_DIR in math/fsqp is deprecated. [math/fsqp:*] Warning: use DYNAMIC_PLIST_DIRS instead. Scanning image/viman-genom:* Scanning supervision/openprs:* Scanning audio/festival:* Scanning pkgtools/robotpkgdb:* Scanning math/hrp2-dynamics:* Scanning knowledge/pellet:* Scanning pkgtools/install-sh:* Scanning hardware/platine-genom:* Scanning pkgtools/libtool:* Scanning graphics/assimp:* Scanning shell/eltclsh:* Scanning image/libimages3d:* Scanning hardware/openni-sensor:* Scanning graphics/Togl:* Scanning hardware/force-genom:* [hardware/force-genom:*] Warning: the LICENSE of hardware/force-genom is undefined. Scanning hardware/daqflex-libs:* Scanning lang/ros-genlisp:* Scanning hardware/gyroKVH1000:* Scanning devel/boost-build:* Scanning robots/romeo-description:* Scanning graphics/grh2:* Scanning math/ros-eigen-stl-containers:* Scanning robots/rmp-libs:* Scanning interfaces/ros-std-msgs:* Scanning devel/gbx-flexiport:* [devel/gbx-flexiport:*] Warning: USE_LANGUAGES in devel/gbx-flexiport is deprecated. Scanning graphics/ros-qt-gui-core:* Scanning image/libraw1394:* Scanning robots/nao-robot:* Scanning localization/libpom:* Scanning localization/imu-genom:* [localization/imu-genom:*] Warning: the LICENSE of localization/imu-genom is undefined. Scanning net/evart-client:* [net/evart-client:*] Warning: DOXYGEN_PLIST_DIR in net/evart-client is deprecated. [net/evart-client:*] Warning: use DYNAMIC_PLIST_DIRS instead. Scanning hardware/sick-genom:* [hardware/sick-genom:*] Warning: the LICENSE of hardware/sick-genom is undefined. Scanning net/ros-resource-retriever:* Scanning archivers/libarchive:* Scanning architecture/genom:* Scanning graphics/ros-python-qt-binding:* Scanning path/hpp-walkplanner:* [path/hpp-walkplanner:*] Warning: DOXYGEN_PLIST_DIR in is deprecated. [path/hpp-walkplanner:*] Warning: use DYNAMIC_PLIST_DIRS instead. Scanning path/hpp-model:* Scanning manipulation/genManip-genom:* Scanning graphics/rcpdf-interface:* Scanning path/hpp-manipulation:* Scanning path/hpp-hik:* [path/hpp-hik:*] Warning: DOXYGEN_PLIST_DIR in path/hpp-hik is deprecated. [path/hpp-hik:*] Warning: use DYNAMIC_PLIST_DIRS instead. Scanning interfaces/abstract-robot-dynamics:* Scanning robots/rmp400-genom:* Scanning devel/boost-jam:* Scanning optimization/roboptim-core-ipopt-plugin:* [optimization/roboptim-core-ipopt-plugin:*] Warning: DOXYGEN_PLIST_DIR in optimization/roboptim-core-ipopt-plugin is deprecated. [optimization/roboptim-core-ipopt-plugin:*] Warning: use DYNAMIC_PLIST_DIRS instead. Scanning image/libdc1394:* Scanning graphics/kpp-interfacewalk:* [graphics/kpp-interfacewalk:*] Warning: DOXYGEN_PLIST_DIR in is deprecated. [graphics/kpp-interfacewalk:*] Warning: use DYNAMIC_PLIST_DIRS instead. Scanning knowledge/oro-server:* Scanning motion/sot-romeo:* Scanning localization/pom-genom:* Scanning hardware/gyroKVH5000:* Scanning robots/play-genom:* [robots/play-genom:*] Warning: the LICENSE of robots/play-genom is undefined. Scanning graphics/urdfdom-headers:* Scanning middleware/orocos-rtt:* Scanning optimization/ipopt:* Scanning sysutils/ros-console-bridge:* Scanning meta-pkgs/orocos-toolchain:* Scanning net/tclpcap:* Scanning graphics/hpp-gepetto-viewer:* Scanning motion/py-orocos-kdl:* Scanning audio/textos-genom:* Scanning net/libtclserv_client:* Scanning devel/cortex-sdk:* Scanning net/netshring:* Scanning graphics/primitiveShapes-libs:* Scanning supervision/genom3-openprs:* Scanning path/hpp-corbaserver:* Scanning doc/demo-genom3:* Scanning localization/segloc-genom:* [localization/segloc-genom:*] Warning: the LICENSE of localization/segloc-genom is undefined. Scanning graphics/ros-ivcon:* Scanning image/ros-vision-opencv:* Scanning scripts/pilo-demo:* Scanning robots/mor-genom:* Scanning path/hpp-kwsplus:* Scanning robots/rflexclients:* Scanning doc/hpp-tutorial:* [doc/hpp-tutorial:*] Warning: the LICENSE of doc/hpp-tutorial is undefined. Scanning localization/ros-robot-state-publisher:* Scanning mapping/regionMap-lib:* Scanning sysutils/py-rosdistro:* Scanning hardware/dynamixel-genom3:* Scanning robots/tk3-matlab:* Scanning path/hpp-walkfootplanner:* [path/hpp-walkfootplanner:*] Warning: DOXYGEN_PLIST_DIR in is deprecated. [path/hpp-walkfootplanner:*] Warning: use DYNAMIC_PLIST_DIRS instead. Scanning graphics/robot-capsule-urdf:* Scanning devel/boost-libs:* Scanning supervision/ros-executive-smach:* Scanning path/libp3d:* Scanning path/libkdtp:* Scanning devel/libedit:* Scanning motion/dynamic-graph-bridge-msgs:* Scanning architecture/genom3-pocolibs:* Scanning middleware/pocolibs:pocolibs>=2.12 Scanning image/jafar-image:* Scanning meta-pkgs/boost:* Scanning editors/mg:* Scanning graphics/blender:* Scanning graphics/kpp-interface:* Scanning simulation/gazebo-ros-pkgs:* Scanning sysutils/ros-diagnostics:* Scanning supervision/transgen:* Scanning graphics/laaswm:* Scanning archivers/bzip2:* Scanning path/aspect-genom:* [path/aspect-genom:*] Warning: the LICENSE of path/aspect-genom is undefined. Scanning localization/insitu:* Scanning hardware/peak-linux-driver:* Scanning pkgtools/pkgrepo2deb:* Scanning robots/rmp440-libs:* Scanning math/libccd:* Scanning devel/ros-catkin:* Scanning meta-pkgs/minnie:* Scanning path/p3d-genom:p3d-genom>=1.1~rmp400+rmp440 [path/p3d-genom:p3d-genom>=1.1~rmp400+rmp440] Warning: the LICENSE of path/p3d-genom is undefined. Scanning image/libstereopixel:* Scanning math/lapack:* Scanning middleware/ace:* Scanning meta-pkgs/ros-robot:* Scanning speech/dialogs:* Scanning motion/py-sot-tools:* Scanning image/coriander:* Scanning robots/rflex-genom:* [robots/rflex-genom:*] Warning: the LICENSE of robots/rflex-genom is undefined. Scanning middleware/ros-dynamic-reconfigure:* Scanning simulation/mrsim-genom3:* Scanning sysutils/tth:* Scanning mapping/dtm-genom:* [mapping/dtm-genom:*] Warning: the LICENSE of mapping/dtm-genom is undefined. Scanning archivers/lz4:* Scanning devel/ros-ros:* Scanning path/p3d-genom:* [path/p3d-genom:*] Warning: the LICENSE of path/p3d-genom is undefined. Scanning doc/robotpkg:* Scanning image/viam-genom:* Scanning knowledge/jena:* Scanning path/jrl-walkgen:* Scanning image/viam-dc1394-driver:* Scanning supervision/tcl-genomix:* Scanning lang/ros-genpy:* Scanning math/ros-angles:* Scanning localization/pom-genom3:* Scanning graphics/gepetto-viewer-corba:* Scanning robots/hrp2-10:* Scanning architecture/genom3-ros:* Scanning localization/mocap-genom:* Scanning robots/hrp2-14:* Scanning math/jrl-mathtools:* Scanning robots/scout-genom:* [robots/scout-genom:*] Warning: the LICENSE of robots/scout-genom is undefined. Scanning robots/mikrokopter-genom3:* Scanning doc/hpp-doc:* Scanning devel/boost-headers:* Scanning sysutils/py-rosdep:* Scanning image/openni-nite:* Scanning meta-pkgs/ros-base:* Scanning meta-pkgs/gearbox:* Scanning math/boost-numeric-bindings:* Scanning path/hpp-manipulation-urdf:* Scanning net/genomix:* Scanning simulation/morse:* Scanning graphics/coldman-libs:* Scanning devel/yaml-cpp:* Scanning pkgtools/url2robotpkg:* Scanning robots/mana-emergency:* Scanning hardware/cwiid:* Scanning knowledge/liboro:* [knowledge/liboro:*] Warning: DOXYGEN_PLIST_DIR in knowledge/liboro is deprecated. [knowledge/liboro:*] Warning: use DYNAMIC_PLIST_DIRS instead. Scanning sysutils/arduio-genom3:* Scanning devel/ros-class-loader:* Scanning pkgtools/tnftp:* Scanning architecture/orocos-ocl:* Scanning math/boost-numeric-bindings-v1:* Scanning graphics/ros-robot-model:* Scanning path/hpp-util:* Scanning motion/contlaw:* [motion/contlaw:*] Warning: the LICENSE of motion/contlaw is undefined. Scanning mapping/libdtm:* [mapping/libdtm:*] Warning: the LICENSE of mapping/libdtm is undefined. Scanning math/sensFusion-libs:* Scanning motion/nhfc-genom3:* Scanning devel/swig:* Scanning pkgtools/libnbcompat:* Scanning middleware/py-yarp:* Scanning middleware/yarp:yarp>=2.3.64<2.3.70 Scanning motion/sot-core:* Scanning middleware/hpp-template-corba:* Scanning meta-pkgs/jafar:* Scanning archivers/pax:* Scanning image/niut-genom:* Scanning motion/dynamic-graph-bridge:* Scanning image/stereopixel-genom:* Scanning interfaces/ros-humanoid-msgs:* Scanning middleware/ros-actionlib:* Scanning www/picoweb:* Scanning middleware/yarp:* Scanning graphics/kpp-interfacedisplay:* [graphics/kpp-interfacedisplay:*] Warning: DOXYGEN_PLIST_DIR in is deprecated. [graphics/kpp-interfacedisplay:*] Warning: use DYNAMIC_PLIST_DIRS instead. Scanning graphics/openvrml-libs:* Scanning path/hpp-fcl:* Scanning net/zeromq:* Scanning math/jrl-dynamics:* Scanning interfaces/genBasic-genom:* Scanning interfaces/ros-comm-msgs:* Scanning devel/mkdep:* Scanning pkgtools/rbulkit:* Scanning sysutils/ros-rospack:* Scanning mapping/worldmodelgrid3d:* [mapping/worldmodelgrid3d:*] Warning: the LICENSE of mapping/worldmodelgrid3d is undefined. Scanning supervision/transgen3:* Scanning hardware/sahand-kmod:* Scanning devel/ros-lint:* Scanning middleware/pocolibs:* Scanning middleware/libjyarp:* Scanning graphics/rcpdf:* Scanning mapping/regionMap-genom:* Scanning middleware/openrtm-aist:* Scanning hardware/joystick-genom3:* Scanning hardware/MTI:* [hardware/MTI:*] Warning: the LICENSE of hardware/MTI is undefined. Scanning audio/festlex-poslex:* Scanning image/sift:* Scanning middleware/omniORB:* Scanning devel/ros-bond-core:* Scanning devel/jsoncpp:* [devel/jsoncpp:*] Warning: DOXYGEN_PLIST_DIR in devel/jsoncpp is deprecated. [devel/jsoncpp:*] Warning: use DYNAMIC_PLIST_DIRS instead. Scanning graphics/ros-rqt:* Scanning path/hpp-model-urdf:* Scanning graphics/vcglib:* [graphics/vcglib:*] Warning: DOXYGEN_PLIST_DIR in graphics/vcglib is deprecated. [graphics/vcglib:*] Warning: use DYNAMIC_PLIST_DIRS instead. Scanning motion/sot-pattern-generator:* Scanning path/hpp-gik:* Scanning mapping/ros-laser-geometry:* Scanning path/hpp-wholebody-step:* Scanning motion/ros-control:* Scanning net/tclserv:* Scanning hardware/gbx-hokuyo-aist:* [hardware/gbx-hokuyo-aist:*] Warning: USE_LANGUAGES in hardware/gbx-hokuyo-aist is deprecated. Scanning hardware/mouse3d-genom:* Scanning mapping/octomap:* Scanning graphics/ros-srdfdom:* Scanning pkgtools/robotpkg_chk:* Scanning image/viam-v4l-driver:* Scanning sysutils/interceptty:* Scanning motion/py-dynamic-graph:* Scanning devel/py-simpleparse:* Scanning sysutils/ros-rviz:* Scanning path/hpp-core:* Scanning lang/jython:* Scanning math/ros-geometry:* Scanning localization/optitrack-genom3:* Scanning net/libfetch:* Scanning graphics/urdfdom:* Scanning graphics/sun-java3d:* Scanning robots/sot-openhrp:* [robots/sot-openhrp:*] Warning: DOXYGEN_PLIST_DIR in robots/sot-openhrp is deprecated. [robots/sot-openhrp:*] Warning: use DYNAMIC_PLIST_DIRS instead. Scanning image/opencv:* Scanning path/hpp-constraints:* Scanning image/opencv:opencv-2.4.8r1~doc+gtk+!* Scanning image/opencv:opencv-2.4.8r1~camera+doc+!* Scanning image/opencv:opencv-2.4.8r1~doc+!* Scanning localization/optitrack-genom3:optitrack-genom3-1.6.1~codels+openprs+ros-client-c+ros-client-ros+ros-server+!* Scanning localization/optitrack-genom3:optitrack-genom3-1.6.1~codels+pocolibs-client-c+openprs+pocolibs-server+!* Scanning graphics/ros-interactive-markers:ros-interactive-markers>=1.11<=1.11.0 Scanning hardware/joystick-genom3:joystick-genom3-1.0~codels+openprs+ros-client-c+ros-client-ros+ros-server+!* Scanning hardware/joystick-genom3:joystick-genom3-1.0~codels+pocolibs-client-c+openprs+pocolibs-server+!* Scanning graphics/rcpdf-interface:rcpdf-interface>=0.2 Scanning middleware/yarp:yarp-2.3.64r2~!* Scanning middleware/py-yarp:py35-yarp-2.3.64 Scanning motion/nhfc-genom3:nhfc-genom3-1.3~codels+openprs+ros-client-c+ros-client-ros+ros-server+!* Scanning motion/nhfc-genom3:nhfc-genom3-1.3~codels+pocolibs-client-c+openprs+pocolibs-server+!* Scanning motion/orocos-kdl:orocos-kdl>=1.3<=1.3.0 Scanning pkgtools/tnftp:tnftp-20130505~ssl Scanning sysutils/arduio-genom3:arduio-genom3-1.1~codels+openprs+ros-client-c+ros-client-ros+ros-server+!* Scanning sysutils/arduio-genom3:arduio-genom3-1.1~codels+pocolibs-client-c+openprs+pocolibs-server+!* Scanning graphics/coldman-libs:coldman-libs-1.4~display Scanning simulation/morse:morse-1.4~doc+!* Scanning hardware/openni-sensor:openni-sensor-5.1.0.41r1~sse3 Scanning sysutils/py-rosdep:py35-rosdep-0.10.30 Scanning robots/mikrokopter-genom3:mikrokopter-genom3-1.6.1~codels+openprs+ros-client-c+ros-client-ros+ros-server+!* Scanning robots/mikrokopter-genom3:mikrokopter-genom3-1.6.1~codels+pocolibs-client-c+openprs+pocolibs-server+!* Scanning localization/pom-genom3:pom-genom3-2.2r1~codels+openprs+ros-client-c+ros-client-ros+ros-server+!* Scanning localization/pom-genom3:pom-genom3-2.2r1~codels+pocolibs-client-c+openprs+pocolibs-server+!* Scanning image/viam-libs:viam-libs-1.12~opencv Scanning path/p3d-genom:p3d-genom-1.5r2~rmp400 [path/p3d-genom:p3d-genom-1.5r2~rmp400] Warning: the LICENSE of path/p3d-genom is undefined. Scanning path/libp3d:libp3d-1.4r2~rmp400 Scanning simulation/mrsim-genom3:mrsim-genom3-1.1~codels+openprs+ros-client-c+ros-client-ros+ros-server+!* Scanning simulation/mrsim-genom3:mrsim-genom3-1.1~codels+pocolibs-client-c+openprs+pocolibs-server+!* Scanning supervision/ros-executive-smach:ros-executive-smach>=2.0<=2.0.0 Scanning path/p3d-genom:p3d-genom>=1.1~rmp440 [path/p3d-genom:p3d-genom>=1.1~rmp440] Warning: the LICENSE of path/p3d-genom is undefined. Scanning path/libp3d:libp3d>=1.4~rmp440 Scanning robots/rmp440-genom:rmp440-genom-0.6~gyro Scanning hardware/dynamixel-genom3:dynamixel-genom3-1.0~codels+openprs+ros-client-c+ros-client-ros+ros-server+!* Scanning hardware/dynamixel-genom3:dynamixel-genom3-1.0~codels+pocolibs-client-c+openprs+pocolibs-server+!* Scanning sysutils/py-rosdistro:py35-rosdistro-0.3.5 Scanning motion/pilo-genom:pilo-genom>=1.2~locoDemo [motion/pilo-genom:pilo-genom>=1.2~locoDemo] Warning: the LICENSE of motion/pilo-genom is undefined. Scanning doc/demo-genom3:demo-genom3-1.3~codels+openprs+ros-client-c+ros-client-ros+ros-server+!* Scanning doc/demo-genom3:demo-genom3-1.3~codels+pocolibs-client-c+openprs+pocolibs-server+!* Scanning robots/rmp400-genom:rmp400-genom-0.11~gyro Scanning hardware/sick-genom:sick-genom-0.2~atrv [hardware/sick-genom:sick-genom-0.2~atrv] Warning: the LICENSE of hardware/sick-genom is undefined. Scanning localization/imu-genom:imu-genom-0.2r1~atrv-junior+openprs [localization/imu-genom:imu-genom-0.2r1~atrv-junior+openprs] Warning: the LICENSE of localization/imu-genom is undefined. Scanning localization/imu-genom:imu-genom-0.2r1~atrv+openprs [localization/imu-genom:imu-genom-0.2r1~atrv+openprs] Warning: the LICENSE of localization/imu-genom is undefined. Scanning devel/ros-nodelet-core:ros-nodelet-core>=1.9<=1.9.0 Scanning middleware/openni:openni-1.5.2.23r1~sse3 Scanning motion/pilo-genom:pilo-genom-1.2r1~rmp400 [motion/pilo-genom:pilo-genom-1.2r1~rmp400] Warning: the LICENSE of motion/pilo-genom is undefined. Scanning localization/gyro-genom:gyro-genom-0.3r1~gyroKVH5000+openprs [localization/gyro-genom:gyro-genom-0.3r1~gyroKVH5000+openprs] Warning: the LICENSE of localization/gyro-genom is undefined. Scanning localization/gyro-genom:gyro-genom-0.3r1~openprs+gyroKVH1000 [localization/gyro-genom:gyro-genom-0.3r1~openprs+gyroKVH1000] Warning: the LICENSE of localization/gyro-genom is undefined. Scanning sysutils/py-rospkg:py35-rospkg-1.0.29r1 Scanning motion/softMotion-libs:softMotion-libs-3.12~tcl+!* Scanning path/maneuver-genom3:maneuver-genom3-1.0~codels+openprs+ros-client-c+ros-client-ros+ros-server+!* Scanning path/maneuver-genom3:maneuver-genom3-1.0~codels+pocolibs-client-c+openprs+pocolibs-server+!* Scanning sysutils/py-catkin-pkg:py35-catkin-pkg-0.2.4 Scanned 581 packages (411 unique) [0%] Processing archivers/zlib:zlib-1.2.3 ===> Bulk building for zlib-1.2.3 Binary package for zlib-1.2.3 is up-to-date. [0%] Processing pkgtools/digest:digest-20080510 ===> Bulk building for digest-20080510 Binary package for digest-20080510 is up-to-date. [0%] Processing pkgtools/pkg_install:pkg_install-20110805.7 ===> Bulk building for pkg_install-20110805.7 Binary package for pkg_install-20110805.7 is up-to-date. [0%] Processing pkgtools/robotpkgdb:robotpkgdb-20170718 ===> Bulk building for robotpkgdb-20170718~csv+sqlite Binary package for robotpkgdb-20170718~csv+sqlite is up-to-date. [0%] Processing pkgtools/install-sh:install-sh-20070712 ===> Bulk building for install-sh-20070712 Binary package for install-sh-20070712 is up-to-date. [1%] Processing archivers/libarchive:libarchive-2.8.4 ===> Bulk building for libarchive-2.8.4 Binary package for libarchive-2.8.4 is up-to-date. [1%] Processing archivers/bzip2:bzip2-1.0.5 ===> Bulk building for bzip2-1.0.5 Binary package for bzip2-1.0.5 is up-to-date. [1%] Processing doc/robotpkg:robotpkg-guide-20170718 ===> Bulk building for robotpkg-guide-20170718~pdf Binary package for robotpkg-guide-20170718~pdf is up-to-date. [1%] Processing pkgtools/url2robotpkg:url2robotpkg-2.7 ===> Bulk building for url2robotpkg-2.7 Binary package for url2robotpkg-2.7 is up-to-date. [2%] Processing pkgtools/tnftp:tnftp-20130505~ssl ===> Bulk building for tnftp-20130505~ssl Binary package for tnftp-20130505~ssl is up-to-date. [2%] Processing math/boost-numeric-bindings-v1:boost-numeric-bindings-v1-20100322 ===> Bulk building for boost-numeric-bindings-v1-20100322 Binary package for boost-numeric-bindings-v1-20100322 is up-to-date. [2%] Processing path/hpp-util:hpp-util-3.1.0 ===> Bulk building for hpp-util-3.1.0 Binary package for hpp-util-3.1.0 is up-to-date. [2%] Processing math/sensFusion-libs:sensFusion-libs-1.3 ===> Bulk building for sensFusion-libs-1.3 Binary package for sensFusion-libs-1.3 is up-to-date. [3%] Processing devel/swig:swig-2.0.4 ===> Bulk building for swig-2.0.4~doc Binary package for swig-2.0.4~doc is up-to-date. [3%] Processing pkgtools/libnbcompat:libnbcompat-20150615 ===> Bulk building for libnbcompat-20150615 Binary package for libnbcompat-20150615 is up-to-date. [3%] Processing middleware/hpp-template-corba:hpp-template-corba-1.1.3r1 ===> Bulk building for hpp-template-corba-1.1.3r1 Binary package for hpp-template-corba-1.1.3r1 is up-to-date. [3%] Processing archivers/pax:pax-20080110 ===> Bulk building for pax-20080110 Binary package for pax-20080110 is up-to-date. [4%] Processing graphics/openvrml-libs:openvrml-libs-0.18.9 ===> Bulk building for openvrml-libs-0.18.9 Binary package for openvrml-libs-0.18.9 is up-to-date. [4%] Processing net/zeromq:zeromq-2.0.10 ===> Bulk building for zeromq-2.0.10~pgm Binary package for zeromq-2.0.10~pgm is up-to-date. [4%] Processing devel/mkdep:mkdep-2.7r1 ===> Bulk building for mkdep-2.7r1 Binary package for mkdep-2.7r1 is up-to-date. [4%] Processing pkgtools/rbulkit:rbulkit-20170123 ===> Bulk building for rbulkit-20170123 Binary package for rbulkit-20170123 is up-to-date. [5%] Processing mapping/worldmodelgrid3d:worldmodelgrid3d-1.0 ===> Bulk building for worldmodelgrid3d-1.0~boost Binary package for worldmodelgrid3d-1.0~boost is up-to-date. [5%] Processing hardware/sahand-kmod:sahand-kmod-2008.01.10 ===> Bulk building for sahand-kmod-2008.01.10 Binary package for sahand-kmod-2008.01.10 is up-to-date. [5%] Processing middleware/pocolibs:pocolibs-2.16 ===> Bulk building for pocolibs-2.16 Binary package for pocolibs-2.16 is up-to-date. [5%] Processing hardware/MTI:MTI-0.6 ===> Bulk building for MTI-0.6 Binary package for MTI-0.6 is up-to-date. [6%] Processing audio/festlex-poslex:festlex-poslex-1.96 ===> Bulk building for festlex-poslex-1.96 Binary package for festlex-poslex-1.96 is up-to-date. [6%] Processing image/sift:sift-1.1.2r1 ===> Bulk building for sift-1.1.2r1~doc Binary package for sift-1.1.2r1~doc is up-to-date. [6%] Processing middleware/omniORB:omniORB-4.1.4r2 ===> Bulk building for omniORB-4.1.4r2 Binary package for omniORB-4.1.4r2 is up-to-date. [6%] Processing devel/jsoncpp:jsoncpp-0.5.0 ===> Bulk building for jsoncpp-0.5.0~doc Binary package for jsoncpp-0.5.0~doc is up-to-date. [7%] Processing graphics/vcglib:vcglib-20100824 ===> Bulk building for vcglib-20100824~doc Binary package for vcglib-20100824~doc is up-to-date. [7%] Processing net/tclserv:tclserv-2.8.1 ===> Bulk building for tclserv-2.8.1 Binary package for tclserv-2.8.1 is up-to-date. [7%] Processing mapping/octomap:octomap-1.6.1 ===> Bulk building for octomap-1.6.1 Binary package for octomap-1.6.1 is up-to-date. [7%] Processing pkgtools/robotpkg_chk:robotpkg_chk-1.1 ===> Bulk building for robotpkg_chk-1.1 Binary package for robotpkg_chk-1.1 is up-to-date. [8%] Processing sysutils/interceptty:interceptty-0.6 ===> Bulk building for interceptty-0.6 Binary package for interceptty-0.6 is up-to-date. [8%] Processing devel/py-simpleparse:py27-simpleparse-2.1.1a2r1 ===> Bulk building for py27-simpleparse-2.1.1a2r1 Binary package for py27-simpleparse-2.1.1a2r1 is up-to-date. [8%] Processing lang/jython:jython-2.5.3b1 ===> Bulk building for jython-2.5.3b1 Binary package for jython-2.5.3b1 is up-to-date. [8%] Processing net/libfetch:libfetch-2.33.1 ===> Bulk building for libfetch-2.33.1 Binary package for libfetch-2.33.1 is up-to-date. [9%] Processing graphics/sun-java3d:sun-java3d-1.5.1 ===> Bulk building for sun-java3d-1.5.1 Binary package for sun-java3d-1.5.1 is up-to-date. [9%] Processing image/opencv:opencv-2.4.8r1~doc+!* ===> Bulk building for opencv-2.4.8r1~doc Binary package for opencv-2.4.8r1~doc is up-to-date. [9%] Processing image/opencv:opencv-2.4.8r1~camera+doc+!* ===> Bulk building for opencv-2.4.8r1~camera+doc Binary package for opencv-2.4.8r1~camera+doc is up-to-date. [9%] Processing image/opencv:opencv-2.4.8r1~doc+gtk+!* ===> Bulk building for opencv-2.4.8r1~doc+gtk Binary package for opencv-2.4.8r1~doc+gtk is up-to-date. [9%] Processing image/opencv:opencv-2.4.8r1~camera+doc+gtk+!* ===> Bulk building for opencv-2.4.8r1~camera+doc+gtk Binary package for opencv-2.4.8r1~camera+doc+gtk is up-to-date. [10%] Processing mapping/segkit:segkit-1.0 ===> Bulk building for segkit-1.0 Binary package for segkit-1.0 is up-to-date. [10%] Processing devel/jafar-kernel:jafar-kernel-0.6r1 ===> Bulk building for jafar-kernel-0.6r1 Binary package for jafar-kernel-0.6r1 is up-to-date. [10%] Processing sysutils/arduio:arduio-1.1 ===> Cleaning temporary files for arduio-1.1 ===> Bulk building for arduio-1.1 => Checking for clear installation => Installing digest-20080510.tgz => Installing tnftp-20130505~ssl.tgz => Required robotpkg package digest>=20080510: digest-20080510 found => Required robotpkg package tnftp>=20091122: tnftp-20130505~ssl found => Required system package gzip: gzip-1.6 found => Required system package pax and tar archivers: pax found => Required system package pkg_install>=20110805.7: pkg_install-20110805.7 found => Required system package avr-gcc>=4.6: MISSING => Required system package avr-libc: MISSING => Dependency digest-20080510 already installed => Dependency tnftp-20130505~ssl already installed ERROR: ====================================================================== ERROR: Missing system packages required for arduio-1.1: ERROR: ERROR: avr-gcc>=4.6 (Fedora package avr-gcc) ERROR: avr-libc (Fedora package avr-libc) ERROR: ERROR: Please use the system package management tool to install these ERROR: dependencies. If a robotpkg version of a dependency is available, ERROR: you can configure robotpkg.conf to use this version instead. ERROR: ERROR: See /local/robotpkg/var/tmp/robotpkg/sysutils/arduio/work/sysdep.log for details. ERROR: ====================================================================== make[2]: *** [sys-depends] Error 2 ===> Logging bulk summary for arduio-1.1 => Checking leftover files => Creating bulk log files => Logging bulk metadata ===> Cleaning temporary files for arduio-1.1 ===> Done bulk for arduio-1.1 [10%] Processing devel/gbx-share:gbx-share-10.11 ===> Bulk building for gbx-share-10.11 Binary package for gbx-share-10.11 is up-to-date. [11%] Processing devel/orocos-log4cpp:orocos-log4cpp-2.8.1 ===> Bulk building for orocos-log4cpp-2.8.1 Binary package for orocos-log4cpp-2.8.1 is up-to-date. [11%] Processing simulation/bullet:bullet-2.81 ===> Bulk building for bullet-2.81 Binary package for bullet-2.81 is up-to-date. [11%] Processing audio/ogi-voice-as-diphone:ogi-voice_as_diphone-2.3 ===> Bulk building for ogi-voice_as_diphone-2.3 Binary package for ogi-voice_as_diphone-2.3 is up-to-date. [11%] Processing robots/neobotix-libs:neobotix-libs-2.1r1 ===> Bulk building for neobotix-libs-2.1r1 Binary package for neobotix-libs-2.1r1 is up-to-date. [12%] Processing path/hpp-kwsio:hpp-kwsio-1.2 ===> Cleaning temporary files for hpp-kwsio-1.2 ===> Bulk building for hpp-kwsio-1.2 => Checking for clear installation => Installing digest-20080510.tgz => Installing tnftp-20130505~ssl.tgz => Required robotpkg package digest>=20080510: digest-20080510 found => Required robotpkg package tnftp>=20091122: tnftp-20130505~ssl found => Required system package gzip: gzip-1.6 found => Required system package pax and tar archivers: pax found => Required system package pkg_install>=20110805.7: pkg_install-20110805.7 found => Dependency digest-20080510 already installed => Installing hpp-util-3.1.0.tgz => Required system package kineoworks>=2.07<3: MISSING => Dependency tnftp-20130505~ssl already installed ERROR: ====================================================================== ERROR: Missing system packages required for hpp-kwsio-1.2: ERROR: ERROR: kineoworks>=2.07<3 ERROR: ERROR: Please use the system package management tool to install these ERROR: dependencies. If a robotpkg version of a dependency is available, ERROR: you can configure robotpkg.conf to use this version instead. ERROR: ERROR: See /local/robotpkg/var/tmp/robotpkg/path/hpp-kwsio/work/sysdep.log for details. ERROR: ====================================================================== make[2]: *** [sys-depends] Error 2 ===> Logging bulk summary for hpp-kwsio-1.2 => Checking leftover files => Creating bulk log files => Logging bulk metadata ===> Cleaning temporary files for hpp-kwsio-1.2 ===> Done bulk for hpp-kwsio-1.2 [12%] Processing optimization/roboptim-core:roboptim-core-1.0r3 ===> Bulk building for roboptim-core-1.0r3 Binary package for roboptim-core-1.0r3 is up-to-date. [12%] Processing devel/log4cxx:log4cxx-0.10.0r1 ===> Bulk building for log4cxx-0.10.0r1~doc Binary package for log4cxx-0.10.0r1~doc is up-to-date. [12%] Processing pkgtools/pkgin:pkgin-0.6.4r2 ===> Bulk building for pkgin-0.6.4r2 Binary package for pkgin-0.6.4r2 is up-to-date. [13%] Processing doc/boost-docs:boost-docs-1.52.0 ===> Bulk building for boost-docs-1.52.0 Binary package for boost-docs-1.52.0 is up-to-date. [13%] Processing hardware/libftdi:libftdi-0.19 ===> Bulk building for libftdi-0.19~doc Binary package for libftdi-0.19~doc is up-to-date. [13%] Processing audio/festlex-cmu:festlex-cmu-1.96 ===> Bulk building for festlex-cmu-1.96 Binary package for festlex-cmu-1.96 is up-to-date. [13%] Processing image/libdc1394-1:libdc1394_1-1.2.1 ===> Bulk building for libdc1394_1-1.2.1 Binary package for libdc1394_1-1.2.1 is up-to-date. [14%] Processing math/meschach:meschach-1.2b ===> Bulk building for meschach-1.2b Binary package for meschach-1.2b is up-to-date. [14%] Processing math/tvmet:tvmet-1.7.2 ===> Bulk building for tvmet-1.7.2 Binary package for tvmet-1.7.2 is up-to-date. [14%] Processing sysutils/y2l:y2l-1.0 ===> Bulk building for y2l-1.0 Binary package for y2l-1.0 is up-to-date. [14%] Processing image/visp:visp-2.6.1r2 ===> Bulk building for visp-2.6.1r2~opencv Binary package for visp-2.6.1r2~opencv is up-to-date. [15%] Processing image/viam-libs:viam-libs-1.12~opencv ===> Bulk building for viam-libs-1.12~doc+opencv Binary package for viam-libs-1.12~doc+opencv is up-to-date. [15%] Processing optimization/roboptim-trajectory:roboptim-trajectory-1.0r2 ===> Bulk building for roboptim-trajectory-1.0r2 Binary package for roboptim-trajectory-1.0r2 is up-to-date. [15%] Processing graphics/pqp:pqp-1.3r3 ===> Bulk building for pqp-1.3r3 Binary package for pqp-1.3r3 is up-to-date. [15%] Processing audio/OGIlexicon:OGIlexicon-2.2 ===> Bulk building for OGIlexicon-2.2 Binary package for OGIlexicon-2.2 is up-to-date. [16%] Processing robots/player20-libs:player20-libs-2.0.5r2 ===> Bulk building for player20-libs-2.0.5r2 Binary package for player20-libs-2.0.5r2 is up-to-date. [16%] Processing net/py-poco:py27-poco-1.5 ===> Bulk building for py27-poco-1.5 Binary package for py27-poco-1.5 is up-to-date. [16%] Processing graphics/laaswm-libs:laaswm-libs-1.2 ===> Bulk building for laaswm-libs-1.2 Binary package for laaswm-libs-1.2 is up-to-date. [16%] Processing hardware/gyro-libs:gyro-libs-3.1r2 ===> Bulk building for gyro-libs-3.1r2 Binary package for gyro-libs-3.1r2 is up-to-date. [17%] Processing sysutils/py-catkin-pkg:py27-catkin-pkg-0.2.4 ===> Bulk building for py27-catkin-pkg-0.2.4 Binary package for py27-catkin-pkg-0.2.4 is up-to-date. [17%] Processing sysutils/py-catkin-pkg:py35-catkin-pkg-0.2.4 ===> Cleaning temporary files for py35-catkin-pkg-0.2.4 ===> Bulk building for py35-catkin-pkg-0.2.4 => Checking for clear installation => Installing digest-20080510.tgz => Installing tnftp-20130505~ssl.tgz => Required robotpkg package digest>=20080510: digest-20080510 found => Required robotpkg package tnftp>=20130505~ssl: tnftp-20130505~ssl found => Required system package gzip: gzip-1.6 found => Required system package patch>=2.0: patch-2.7.5 found => Required system package pax and tar archivers: pax found => Required system package pkg_install>=20110805.7: pkg_install-20110805.7 found => Dependency digest-20080510 already installed => Required system package python35>=3.5<3.6: MISSING => Dependency tnftp-20130505~ssl already installed ERROR: ====================================================================== ERROR: Missing system packages required for py35-catkin-pkg-0.2.4: ERROR: ERROR: python35>=3.5<3.6 (Fedora package python3.5-devel) ERROR: ERROR: Please use the system package management tool to install these ERROR: dependencies. If a robotpkg version of a dependency is available, ERROR: you can configure robotpkg.conf to use this version instead. ERROR: ERROR: See /local/robotpkg/var/tmp/robotpkg/sysutils/py-catkin-pkg/work/sysdep.log for details. ERROR: ====================================================================== make[2]: *** [sys-depends] Error 2 ===> Logging bulk summary for py35-catkin-pkg-0.2.4 => Checking leftover files => Creating bulk log files => Logging bulk metadata ===> Cleaning temporary files for py35-catkin-pkg-0.2.4 ===> Done bulk for py35-catkin-pkg-0.2.4 [17%] Processing hardware/serial:serial-1.1 ===> Bulk building for serial-1.1 Binary package for serial-1.1 is up-to-date. [17%] Processing graphics/collada-dom:collada-dom-2.3.1r2 ===> Bulk building for collada-dom-2.3.1r2 Binary package for collada-dom-2.3.1r2 is up-to-date. [18%] Processing optimization/roboptim-core-cfsqp-plugin:roboptim-core-cfsqp-plugin-0.4 ===> Bulk building for roboptim-core-cfsqp-plugin-0.4 Binary package for roboptim-core-cfsqp-plugin-0.4 is up-to-date. [18%] Processing pkgtools/pkg-config:pkg-config-0.29 ===> Bulk building for pkg-config-0.29 Binary package for pkg-config-0.29 is up-to-date. [18%] Processing path/hpp-environment-data:hpp-environment-data-1.0 ===> Bulk building for hpp-environment-data-1.0 Binary package for hpp-environment-data-1.0 is up-to-date. [18%] Processing motion/softMotion-libs:softMotion-libs-3.12~!* ===> Bulk building for softMotion-libs-3.12 Binary package for softMotion-libs-3.12 is up-to-date. [18%] Processing motion/softMotion-libs:softMotion-libs-3.12~tcl+!* ===> Bulk building for softMotion-libs-3.12~tcl Binary package for softMotion-libs-3.12~tcl is up-to-date. [19%] Processing sysutils/py-aafigure:py27-aafigure-0.5 ===> Bulk building for py27-aafigure-0.5 Binary package for py27-aafigure-0.5 is up-to-date. [19%] Processing robots/ivmob-libs:ivmob-libs-1.0 ===> Bulk building for ivmob-libs-1.0 Binary package for ivmob-libs-1.0 is up-to-date. [19%] Processing sysutils/py-rospkg:py27-rospkg-1.0.29r1 ===> Bulk building for py27-rospkg-1.0.29r1 Binary package for py27-rospkg-1.0.29r1 is up-to-date. [19%] Processing sysutils/py-rospkg:py35-rospkg-1.0.29r1 ===> Cleaning temporary files for py35-rospkg-1.0.29r1 ===> Bulk building for py35-rospkg-1.0.29r1 => Checking for clear installation => Installing digest-20080510.tgz => Installing tnftp-20130505~ssl.tgz => Required robotpkg package digest>=20080510: digest-20080510 found => Required robotpkg package tnftp>=20130505~ssl: tnftp-20130505~ssl found => Required system package gzip: gzip-1.6 found => Required system package patch>=2.0: patch-2.7.5 found => Required system package pax and tar archivers: pax found => Required system package pkg_install>=20110805.7: pkg_install-20110805.7 found => Dependency digest-20080510 already installed => Required system package python35>=3.5<3.6: MISSING => Dependency tnftp-20130505~ssl already installed ERROR: ====================================================================== ERROR: Missing system packages required for py35-rospkg-1.0.29r1: ERROR: ERROR: python35>=3.5<3.6 (Fedora package python3.5-devel) ERROR: ERROR: Please use the system package management tool to install these ERROR: dependencies. If a robotpkg version of a dependency is available, ERROR: you can configure robotpkg.conf to use this version instead. ERROR: ERROR: See /local/robotpkg/var/tmp/robotpkg/sysutils/py-rospkg/work/sysdep.log for details. ERROR: ====================================================================== make[2]: *** [sys-depends] Error 2 ===> Logging bulk summary for py35-rospkg-1.0.29r1 => Checking leftover files => Creating bulk log files => Logging bulk metadata ===> Cleaning temporary files for py35-rospkg-1.0.29r1 ===> Done bulk for py35-rospkg-1.0.29r1 [20%] Processing sysutils/console-bridge:console-bridge-0.2.7 ===> Bulk building for console-bridge-0.2.7 Binary package for console-bridge-0.2.7 is up-to-date. [20%] Processing math/t3d:libt3d-2.6 ===> Bulk building for libt3d-2.6~doc Binary package for libt3d-2.6~doc is up-to-date. [20%] Processing lang/sun-jdk:sun-jdk-1.6.0.33 ===> Bulk building for sun-jdk-1.6.0.33 Binary package for sun-jdk-1.6.0.33 is up-to-date. [20%] Processing math/liblbfgs:liblbfgs-1.10 ===> Bulk building for liblbfgs-1.10 Binary package for liblbfgs-1.10 is up-to-date. [21%] Processing audio/sphinx2:sphinx2-0.6 ===> Bulk building for sphinx2-0.6 Binary package for sphinx2-0.6 is up-to-date. [21%] Processing path/hpp-statistics:hpp-statistics-1.0.0 ===> Bulk building for hpp-statistics-1.0.0 Binary package for hpp-statistics-1.0.0 is up-to-date. [21%] Processing math/geometric-tools:geometric-tools-5p7r1 ===> Bulk building for geometric-tools-5p7r1 Binary package for geometric-tools-5p7r1 is up-to-date. [21%] Processing hardware/sickLib:sickLib-1.1.0 ===> Bulk building for sickLib-1.1.0 Binary package for sickLib-1.1.0 is up-to-date. [22%] Processing optimization/acado:acado-1.2.2beta.20160615 ===> Bulk building for acado-1.2.2beta.20160615 Binary package for acado-1.2.2beta.20160615 is up-to-date. [22%] Processing speech/gspeett:gspeett-1.2 ===> Bulk building for gspeett-1.2 Binary package for gspeett-1.2 is up-to-date. [22%] Processing hardware/velodyne-libs:velodyne-libs-0.8r1 ===> Bulk building for velodyne-libs-0.8r1 Binary package for velodyne-libs-0.8r1 is up-to-date. [22%] Processing middleware/omniORBpy:omniORBpy-3.1r3 ===> Cleaning temporary files for omniORBpy-3.1r3 ===> Bulk building for omniORBpy-3.1r3 => Checking for clear installation => Installing digest-20080510.tgz => Installing tnftp-20130505~ssl.tgz => Required robotpkg package digest>=20080510: digest-20080510 found => Required robotpkg package tnftp>=20091122: tnftp-20130505~ssl found => Required system package gzip: gzip-1.6 found => Required system package patch>=2.0: patch-2.7.5 found => Required system package pax and tar archivers: pax found => Required system package pkg_install>=20110805.7: pkg_install-20110805.7 found => Dependency digest-20080510 already installed => Required system package omniORB>=4.1<4.2: MISSING => Dependency tnftp-20130505~ssl already installed ERROR: ====================================================================== ERROR: Missing system packages required for omniORBpy-3.1r3: ERROR: ERROR: omniORB>=4.1<4.2 (Fedora package omniORB-devel omniORB-servers) ERROR: ERROR: Please use the system package management tool to install these ERROR: dependencies. If a robotpkg version of a dependency is available, ERROR: you can configure robotpkg.conf to use this version instead. ERROR: ERROR: See /local/robotpkg/var/tmp/robotpkg/middleware/omniORBpy/work/sysdep.log for details. ERROR: ====================================================================== make[2]: *** [sys-depends] Error 2 ===> Logging bulk summary for omniORBpy-3.1r3 => Checking leftover files => Creating bulk log files => Logging bulk metadata ===> Cleaning temporary files for omniORBpy-3.1r3 ===> Done bulk for omniORBpy-3.1r3 [23%] Processing graphics/flann:flann-1.7.1 ===> Bulk building for flann-1.7.1 Binary package for flann-1.7.1 is up-to-date. [23%] Processing hardware/GPSNovatel:GPSNovatel-1.9r1 ===> Bulk building for GPSNovatel-1.9r1 Binary package for GPSNovatel-1.9r1 is up-to-date. [23%] Processing image/artoolkitplus:artoolkitplus-2.1.1r4 ===> Bulk building for artoolkitplus-2.1.1r4 Binary package for artoolkitplus-2.1.1r4 is up-to-date. [23%] Processing motion/orocos-kdl:orocos-kdl>=1.3<=1.3.0 ===> Bulk building for orocos-kdl-1.3.0 Binary package for orocos-kdl-1.3.0 is up-to-date. [24%] Processing robots/tk3-mikrokopter:tk3-mikrokopter-1.8 ===> Cleaning temporary files for tk3-mikrokopter-1.8 ===> Bulk building for tk3-mikrokopter-1.8 => Checking for clear installation => Installing digest-20080510.tgz => Installing tnftp-20130505~ssl.tgz => Required robotpkg package digest>=20080510: digest-20080510 found => Required robotpkg package tnftp>=20091122: tnftp-20130505~ssl found => Required system package gzip: gzip-1.6 found => Required system package pax and tar archivers: pax found => Required system package pkg_install>=20110805.7: pkg_install-20110805.7 found => Required system package avr-gcc>=4.6: MISSING => Required system package avr-libc: MISSING => Dependency digest-20080510 already installed => Dependency tnftp-20130505~ssl already installed ERROR: ====================================================================== ERROR: Missing system packages required for tk3-mikrokopter-1.8: ERROR: ERROR: avr-gcc>=4.6 (Fedora package avr-gcc) ERROR: avr-libc (Fedora package avr-libc) ERROR: ERROR: Please use the system package management tool to install these ERROR: dependencies. If a robotpkg version of a dependency is available, ERROR: you can configure robotpkg.conf to use this version instead. ERROR: ERROR: See /local/robotpkg/var/tmp/robotpkg/robots/tk3-mikrokopter/work/sysdep.log for details. ERROR: ====================================================================== make[2]: *** [sys-depends] Error 2 ===> Logging bulk summary for tk3-mikrokopter-1.8 => Checking leftover files => Creating bulk log files => Logging bulk metadata ===> Cleaning temporary files for tk3-mikrokopter-1.8 ===> Done bulk for tk3-mikrokopter-1.8 [24%] Processing sysutils/alog:alog-0.5 ===> Bulk building for alog-0.5 Binary package for alog-0.5 is up-to-date. [24%] Processing middleware/openni2:openni2-2.2beta2r1 ===> Bulk building for openni2-2.2beta2r1~sse3 Binary package for openni2-2.2beta2r1~sse3 is up-to-date. [24%] Processing middleware/naoqi:naoqi-2.1.0.19 ===> Bulk building for naoqi-2.1.0.19 Binary package for naoqi-2.1.0.19 is up-to-date. [25%] Processing sysutils/tk3-flash:tk3-flash-1.3.1 ===> Bulk building for tk3-flash-1.3.1 Binary package for tk3-flash-1.3.1 is up-to-date. [25%] Processing interfaces/openrobots-idl:openrobots-idl-1.4 ===> Bulk building for openrobots-idl-1.4 Binary package for openrobots-idl-1.4 is up-to-date. [25%] Processing math/eigen2:eigen2-2.0.15 ===> Bulk building for eigen2-2.0.15 Binary package for eigen2-2.0.15 is up-to-date. [25%] Processing math/eigen3:eigen3-3.2.4 ===> Bulk building for eigen3-3.2.4 Binary package for eigen3-3.2.4 is up-to-date. [26%] Processing localization/odokit:odokit-1.0 ===> Bulk building for odokit-1.0 Binary package for odokit-1.0 is up-to-date. [26%] Processing hardware/sahand-libs:sahand-libs-08.08.14r1 ===> Bulk building for sahand-libs-08.08.14r1 Binary package for sahand-libs-08.08.14r1 is up-to-date. [26%] Processing graphics/gdhe:gdhe-3.8.4 ===> Bulk building for gdhe-3.8.4 Binary package for gdhe-3.8.4 is up-to-date. [26%] Processing supervision/matlab-genomix:matlab-genomix-1.7.1 ===> Cleaning temporary files for matlab-genomix-1.7.1 ===> Bulk building for matlab-genomix-1.7.1 => Checking for clear installation => Installing digest-20080510.tgz => Installing tnftp-20130505~ssl.tgz => Required robotpkg package digest>=20080510: digest-20080510 found => Required robotpkg package tnftp>=20091122: tnftp-20130505~ssl found => Required system package gzip: gzip-1.6 found => Required system package pax and tar archivers: pax found => Required system package pkg_install>=20110805.7: pkg_install-20110805.7 found => Dependency digest-20080510 already installed => Required system package matlab: MISSING => Dependency tnftp-20130505~ssl already installed ERROR: ====================================================================== ERROR: Missing system packages required for matlab-genomix-1.7.1: ERROR: ERROR: matlab ERROR: ERROR: Please use the system package management tool to install these ERROR: dependencies. If a robotpkg version of a dependency is available, ERROR: you can configure robotpkg.conf to use this version instead. ERROR: ERROR: See /local/robotpkg/var/tmp/robotpkg/supervision/matlab-genomix/work/sysdep.log for details. ERROR: ====================================================================== make[2]: *** [sys-depends] Error 2 ===> Logging bulk summary for matlab-genomix-1.7.1 => Checking leftover files => Creating bulk log files => Logging bulk metadata ===> Cleaning temporary files for matlab-genomix-1.7.1 ===> Done bulk for matlab-genomix-1.7.1 [27%] Processing middleware/openni:openni-1.5.2.23r1~sse3 ===> Bulk building for openni-1.5.2.23r1~sse3 Binary package for openni-1.5.2.23r1~sse3 is up-to-date. [27%] Processing knowledge/py-oro:py27-oro-1.0.1 ===> Bulk building for py27-oro-1.0.1 Binary package for py27-oro-1.0.1 is up-to-date. [27%] Processing lang/python31:python31-3.1.5r1 ===> Bulk building for python31-3.1.5r1 Binary package for python31-3.1.5r1 is up-to-date. [27%] Processing lang/python32:python32-3.2.2r1 ===> Bulk building for python32-3.2.2r1 Binary package for python32-3.2.2r1 is up-to-date. [27%] Processing lang/python33:python33-3.3.5r4 ===> Bulk building for python33-3.3.5r4 Binary package for python33-3.3.5r4 is up-to-date. [28%] Processing audio/festvox-cmu-us-awb-arctic-hts:festvox-cmu-us-awb-arctic-hts-20041209 ===> Bulk building for festvox-cmu-us-awb-arctic-hts-20041209 Binary package for festvox-cmu-us-awb-arctic-hts-20041209 is up-to-date. [28%] Processing math/gbM:gbM-0.11 ===> Bulk building for gbM-0.11~tcl Binary package for gbM-0.11~tcl is up-to-date. [28%] Processing math/fsqp:fsqp-2.5d ===> Bulk building for fsqp-2.5d Binary package for fsqp-2.5d is up-to-date. [28%] Processing supervision/openprs:openprs-1.1b10 ===> Bulk building for openprs-1.1b10 Binary package for openprs-1.1b10 is up-to-date. [29%] Processing audio/festival:festival-1.96 ===> Bulk building for festival-1.96~ogireslpc Binary package for festival-1.96~ogireslpc is up-to-date. [29%] Processing pkgtools/libtool:libtool-2.2.6b ===> Bulk building for libtool-2.2.6b Binary package for libtool-2.2.6b is up-to-date. [29%] Processing graphics/assimp:assimp-3.0.1270 ===> Bulk building for assimp-3.0.1270 Binary package for assimp-3.0.1270 is up-to-date. [29%] Processing image/libimages3d:libimages3d-3.4r3 ===> Bulk building for libimages3d-3.4r3 Binary package for libimages3d-3.4r3 is up-to-date. [30%] Processing hardware/openni-sensor:openni-sensor-5.1.0.41r1~sse3 ===> Bulk building for openni-sensor-5.1.0.41r1~sse3 Binary package for openni-sensor-5.1.0.41r1~sse3 is up-to-date. [30%] Processing graphics/Togl:Togl-2.0 ===> Bulk building for Togl-2.0 Binary package for Togl-2.0 is up-to-date. [30%] Processing hardware/daqflex-libs:daqflex-libs-0.1r1 ===> Bulk building for daqflex-libs-0.1r1 Binary package for daqflex-libs-0.1r1 is up-to-date. [30%] Processing hardware/gyroKVH1000:gyroKVH1000-1.4 ===> Bulk building for gyroKVH1000-1.4 Binary package for gyroKVH1000-1.4 is up-to-date. [31%] Processing devel/boost-build:boost-build-1.52.0 ===> Bulk building for boost-build-1.52.0 Binary package for boost-build-1.52.0 is up-to-date. [31%] Processing graphics/grh2:grh2-2.1r3 ===> Bulk building for grh2-2.1r3 Binary package for grh2-2.1r3 is up-to-date. [31%] Processing robots/rmp-libs:rmp-libs-0.4r1 ===> Bulk building for rmp-libs-0.4r1 Binary package for rmp-libs-0.4r1 is up-to-date. [31%] Processing devel/gbx-flexiport:gbx-flexiport-1.0.0r1 ===> Bulk building for gbx-flexiport-1.0.0r1 Binary package for gbx-flexiport-1.0.0r1 is up-to-date. [32%] Processing image/libraw1394:libraw1394-2.0.4 ===> Bulk building for libraw1394-2.0.4 Binary package for libraw1394-2.0.4 is up-to-date. [32%] Processing localization/libpom:libpom-1.2 ===> Bulk building for libpom-1.2 Binary package for libpom-1.2 is up-to-date. [32%] Processing net/evart-client:evart-client-2.2 ===> Bulk building for evart-client-2.2~doc Binary package for evart-client-2.2~doc is up-to-date. [32%] Processing architecture/genom:genom-2.12 ===> Bulk building for genom-2.12~doc Binary package for genom-2.12~doc is up-to-date. [33%] Processing devel/boost-jam:boost-jam-1.52.0 ===> Bulk building for boost-jam-1.52.0 Binary package for boost-jam-1.52.0 is up-to-date. [33%] Processing image/libdc1394:libdc1394-2.1.2 ===> Bulk building for libdc1394-2.1.2 Binary package for libdc1394-2.1.2 is up-to-date. [33%] Processing hardware/gyroKVH5000:gyroKVH5000-1.4 ===> Bulk building for gyroKVH5000-1.4 Binary package for gyroKVH5000-1.4 is up-to-date. [33%] Processing graphics/urdfdom-headers:urdfdom-headers-0.3.0 ===> Bulk building for urdfdom-headers-0.3.0 Binary package for urdfdom-headers-0.3.0 is up-to-date. [34%] Processing middleware/orocos-rtt:orocos-rtt-2.8.1 ===> Bulk building for orocos-rtt-2.8.1 Binary package for orocos-rtt-2.8.1 is up-to-date. [34%] Processing optimization/ipopt:ipopt-3.6.1 ===> Bulk building for ipopt-3.6.1 Binary package for ipopt-3.6.1 is up-to-date. [34%] Processing net/tclpcap:tclpcap-2.0.0 ===> Bulk building for tclpcap-2.0.0 Binary package for tclpcap-2.0.0 is up-to-date. [34%] Processing motion/py-orocos-kdl:py27-orocos-kdl-1.3.0r1 ===> Bulk building for py27-orocos-kdl-1.3.0r1 Binary package for py27-orocos-kdl-1.3.0r1 is up-to-date. [35%] Processing net/libtclserv_client:libtclserv_client-0.5r1 ===> Bulk building for libtclserv_client-0.5r1 Binary package for libtclserv_client-0.5r1 is up-to-date. [35%] Processing devel/cortex-sdk:cortex-sdk-1.0.3 ===> Bulk building for cortex-sdk-1.0.3 Binary package for cortex-sdk-1.0.3 is up-to-date. [35%] Processing net/netshring:netshring-1.2 ===> Bulk building for netshring-1.2 Binary package for netshring-1.2 is up-to-date. [35%] Processing graphics/primitiveShapes-libs:primitiveShapes-libs-1.1 ===> Bulk building for primitiveShapes-libs-1.1 Binary package for primitiveShapes-libs-1.1 is up-to-date. [36%] Processing path/hpp-kwsplus:hpp-kwsplus-2.4.1 ===> Cleaning temporary files for hpp-kwsplus-2.4.1 ===> Bulk building for hpp-kwsplus-2.4.1 => Checking for clear installation => Installing digest-20080510.tgz => Installing tnftp-20130505~ssl.tgz => Required robotpkg package digest>=20080510: digest-20080510 found => Required robotpkg package tnftp>=20091122: tnftp-20130505~ssl found => Required system package gzip: gzip-1.6 found => Required system package pax and tar archivers: pax found => Required system package pkg_install>=20110805.7: pkg_install-20110805.7 found => Installing boost-numeric-bindings-v1-20100322.tgz => Dependency digest-20080510 already installed => Required robotpkg package hpp-kwsio>=1.2: N/A => Installing hpp-util-3.1.0.tgz => Required system package kineoworks>=2.07<3: MISSING => Dependency tnftp-20130505~ssl already installed ERROR: ====================================================================== ERROR: Missing system packages required for hpp-kwsplus-2.4.1: ERROR: ERROR: kineoworks>=2.07<3 ERROR: ERROR: Please use the system package management tool to install these ERROR: dependencies. If a robotpkg version of a dependency is available, ERROR: you can configure robotpkg.conf to use this version instead. ERROR: ERROR: See /local/robotpkg/var/tmp/robotpkg/path/hpp-kwsplus/work/sysdep.log for details. ERROR: ====================================================================== make[2]: *** [sys-depends] Error 2 ===> Logging bulk summary for hpp-kwsplus-2.4.1 => Checking leftover files => Creating bulk log files => Logging bulk metadata ===> Cleaning temporary files for hpp-kwsplus-2.4.1 ===> Done bulk for hpp-kwsplus-2.4.1 [36%] Processing robots/rflexclients:rflexclients-2.0 ===> Bulk building for rflexclients-2.0 Binary package for rflexclients-2.0 is up-to-date. [36%] Processing sysutils/py-rosdistro:py27-rosdistro-0.3.5 ===> Bulk building for py27-rosdistro-0.3.5 Binary package for py27-rosdistro-0.3.5 is up-to-date. [36%] Processing sysutils/py-rosdistro:py35-rosdistro-0.3.5 ===> Cleaning temporary files for py35-rosdistro-0.3.5 ===> Bulk building for py35-rosdistro-0.3.5 => Checking for clear installation => Installing digest-20080510.tgz => Installing tnftp-20130505~ssl.tgz => Required robotpkg package digest>=20080510: digest-20080510 found => Required robotpkg package tnftp>=20130505~ssl: tnftp-20130505~ssl found => Required system package gzip: gzip-1.6 found => Required system package patch>=2.0: patch-2.7.5 found => Required system package pax and tar archivers: pax found => Required system package pkg_install>=20110805.7: pkg_install-20110805.7 found => Dependency digest-20080510 already installed => Required robotpkg package py35-catkin-pkg>=0.2: N/A => Required robotpkg package py35-rospkg>=1.0.29: N/A => Required system package py35-yaml>=3: MISSING => Required system package python35>=3.5<3.6: MISSING => Dependency tnftp-20130505~ssl already installed ERROR: ====================================================================== ERROR: Missing system packages required for py35-rosdistro-0.3.5: ERROR: ERROR: py35-yaml>=3 (Fedora package PyYAML (python-3.5)) ERROR: python35>=3.5<3.6 (Fedora package python3.5-devel) ERROR: ERROR: Please use the system package management tool to install these ERROR: dependencies. If a robotpkg version of a dependency is available, ERROR: you can configure robotpkg.conf to use this version instead. ERROR: ERROR: See /local/robotpkg/var/tmp/robotpkg/sysutils/py-rosdistro/work/sysdep.log for details. ERROR: ====================================================================== make[2]: *** [sys-depends] Error 2 ===> Logging bulk summary for py35-rosdistro-0.3.5 => Checking leftover files => Creating bulk log files => Logging bulk metadata ===> Cleaning temporary files for py35-rosdistro-0.3.5 ===> Done bulk for py35-rosdistro-0.3.5 [36%] Processing robots/tk3-matlab:tk3-matlab-1.6 ===> Cleaning temporary files for tk3-matlab-1.6 ===> Bulk building for tk3-matlab-1.6 => Checking for clear installation => Installing digest-20080510.tgz => Installing tnftp-20130505~ssl.tgz => Required robotpkg package digest>=20080510: digest-20080510 found => Required robotpkg package tnftp>=20091122: tnftp-20130505~ssl found => Required system package gzip: gzip-1.6 found => Required system package pax and tar archivers: pax found => Required system package pkg_install>=20110805.7: pkg_install-20110805.7 found => Dependency digest-20080510 already installed => Required system package matlab: MISSING => Dependency tnftp-20130505~ssl already installed ERROR: ====================================================================== ERROR: Missing system packages required for tk3-matlab-1.6: ERROR: ERROR: matlab ERROR: ERROR: Please use the system package management tool to install these ERROR: dependencies. If a robotpkg version of a dependency is available, ERROR: you can configure robotpkg.conf to use this version instead. ERROR: ERROR: See /local/robotpkg/var/tmp/robotpkg/robots/tk3-matlab/work/sysdep.log for details. ERROR: ====================================================================== make[2]: *** [sys-depends] Error 2 ===> Logging bulk summary for tk3-matlab-1.6 => Checking leftover files => Creating bulk log files => Logging bulk metadata ===> Cleaning temporary files for tk3-matlab-1.6 ===> Done bulk for tk3-matlab-1.6 [37%] Processing devel/boost-libs:boost-libs-1.52.0 ===> Bulk building for boost-libs-1.52.0 Binary package for boost-libs-1.52.0 is up-to-date. [37%] Processing path/libp3d:libp3d-1.4r2~rmp400 ===> Bulk building for libp3d-1.4r2~display+rmp400 Binary package for libp3d-1.4r2~display+rmp400 is up-to-date. [37%] Processing path/libp3d:libp3d>=1.4~rmp440 ===> Bulk building for libp3d-1.4r2~display+rmp440 Binary package for libp3d-1.4r2~display+rmp440 is up-to-date. [37%] Processing path/libkdtp:libkdtp-1.0 ===> Bulk building for libkdtp-1.0 Binary package for libkdtp-1.0 is up-to-date. [38%] Processing devel/libedit:libedit-3.1r20160903 ===> Bulk building for libedit-3.1r20160903 Binary package for libedit-3.1r20160903 is up-to-date. [38%] Processing editors/mg:mg-20110905 ===> Bulk building for mg-20110905 Binary package for mg-20110905 is up-to-date. [38%] Processing supervision/transgen:transgen-1.1b1 ===> Bulk building for transgen-1.1b1 Binary package for transgen-1.1b1 is up-to-date. [38%] Processing graphics/laaswm:laaswm-1.2 ===> Bulk building for laaswm-1.2 Binary package for laaswm-1.2 is up-to-date. [39%] Processing localization/insitu:insitu-1.3 ===> Bulk building for insitu-1.3 Binary package for insitu-1.3 is up-to-date. [39%] Processing hardware/peak-linux-driver:peak-linux-driver-7.15.2 ===> Bulk building for peak-linux-driver-7.15.2 Binary package for peak-linux-driver-7.15.2 is up-to-date. [39%] Processing pkgtools/pkgrepo2deb:pkgrepo2deb-1.2 ===> Cleaning temporary files for pkgrepo2deb-1.2 ===> Bulk building for pkgrepo2deb-1.2 => Checking for clear installation => Installing digest-20080510.tgz => Installing tnftp-20130505~ssl.tgz => Required robotpkg package digest>=20080510: digest-20080510 found => Required robotpkg package tnftp>=20091122: tnftp-20130505~ssl found => Required system package gzip: gzip-1.6 found => Required system package pax and tar archivers: pax found => Required system package pkg_install>=20110805.7: pkg_install-20110805.7 found => Required system package apt>=0: MISSING => Dependency digest-20080510 already installed => Required system package dpkg>=1: MISSING => Dependency tnftp-20130505~ssl already installed ERROR: ====================================================================== ERROR: Missing system packages required for pkgrepo2deb-1.2: ERROR: ERROR: apt>=0 (Fedora package apt) ERROR: dpkg>=1 (Fedora package dpkg) ERROR: ERROR: Please use the system package management tool to install these ERROR: dependencies. If a robotpkg version of a dependency is available, ERROR: you can configure robotpkg.conf to use this version instead. ERROR: ERROR: See /local/robotpkg/var/tmp/robotpkg/pkgtools/pkgrepo2deb/work/sysdep.log for details. ERROR: ====================================================================== make[2]: *** [sys-depends] Error 2 ===> Logging bulk summary for pkgrepo2deb-1.2 => Checking leftover files => Creating bulk log files => Logging bulk metadata ===> Cleaning temporary files for pkgrepo2deb-1.2 ===> Done bulk for pkgrepo2deb-1.2 [39%] Processing robots/rmp440-libs:rmp440-libs-0.5r2 ===> Bulk building for rmp440-libs-0.5r2 Binary package for rmp440-libs-0.5r2 is up-to-date. [40%] Processing math/libccd:libccd-2.0 ===> Bulk building for libccd-2.0 Binary package for libccd-2.0 is up-to-date. [40%] Processing devel/ros-catkin:ros-catkin-0.6.9r2 ===> Bulk building for ros-catkin-0.6.9r2 Binary package for ros-catkin-0.6.9r2 is up-to-date. [40%] Processing image/libstereopixel:libstereopixel-1.5 ===> Bulk building for libstereopixel-1.5 Binary package for libstereopixel-1.5 is up-to-date. [40%] Processing math/lapack:lapack-3.7.0r1 ===> Bulk building for lapack-3.7.0r1 Binary package for lapack-3.7.0r1 is up-to-date. [41%] Processing middleware/ace:ace-6.0.4r1 ===> Bulk building for ace-6.0.4r1 Binary package for ace-6.0.4r1 is up-to-date. [41%] Processing speech/dialogs:dialogs-0.9 ===> Bulk building for dialogs-0.9 Binary package for dialogs-0.9 is up-to-date. [41%] Processing image/coriander:coriander-2.0.0rc6r1 ===> Bulk building for coriander-2.0.0rc6r1 Binary package for coriander-2.0.0rc6r1 is up-to-date. [41%] Processing sysutils/tth:tth-4.09 ===> Bulk building for tth-4.09 Binary package for tth-4.09 is up-to-date. [42%] Processing archivers/lz4:lz4-121r1 ===> Bulk building for lz4-121r1 Binary package for lz4-121r1 is up-to-date. [42%] Processing knowledge/jena:jena-2.6.4 ===> Bulk building for jena-2.6.4~doc Binary package for jena-2.6.4~doc is up-to-date. [42%] Processing image/viam-dc1394-driver:viam-dc1394-driver-1.12 ===> Bulk building for viam-dc1394-driver-1.12~opencv Binary package for viam-dc1394-driver-1.12~opencv is up-to-date. [42%] Processing supervision/tcl-genomix:tcl-genomix-1.6 ===> Bulk building for tcl-genomix-1.6 Binary package for tcl-genomix-1.6 is up-to-date. [43%] Processing math/ros-angles:ros-angles-1.9.9 ===> Bulk building for ros-angles-1.9.9 Binary package for ros-angles-1.9.9 is up-to-date. [43%] Processing robots/hrp2-10:hrp2-10-1.1 ===> Bulk building for hrp2-10-1.1 Binary package for hrp2-10-1.1 is up-to-date. [43%] Processing localization/mocap-genom:mocap-genom-1.3 ===> Bulk building for mocap-genom-1.3~openprs+tcl+tclserv_client Binary package for mocap-genom-1.3~openprs+tcl+tclserv_client is up-to-date. [43%] Processing robots/hrp2-14:hrp2-14-1.9.3 ===> Bulk building for hrp2-14-1.9.3 Binary package for hrp2-14-1.9.3 is up-to-date. [44%] Processing math/jrl-mathtools:jrl-mathtools-1.5.2r3 ===> Bulk building for jrl-mathtools-1.5.2r3 Binary package for jrl-mathtools-1.5.2r3 is up-to-date. [44%] Processing robots/scout-genom:scout-genom-0.1 ===> Bulk building for scout-genom-0.1~openprs+tcl+tclserv_client Binary package for scout-genom-0.1~openprs+tcl+tclserv_client is up-to-date. [44%] Processing doc/hpp-doc:hpp-doc-3.0.0 ===> Cleaning temporary files for hpp-doc-3.0.0 ===> Bulk building for hpp-doc-3.0.0 => Checking for clear installation => Installing digest-20080510.tgz => Installing tnftp-20130505~ssl.tgz => Required robotpkg package digest>=20080510: digest-20080510 found => Required robotpkg package tnftp>=20091122: tnftp-20130505~ssl found => Required system package gzip: gzip-1.6 found => Required system package pax and tar archivers: pax found => Required system package pkg_install>=20110805.7: pkg_install-20110805.7 found => Required system package asciidoc>=8.2.5: MISSING => Dependency digest-20080510 already installed => Dependency tnftp-20130505~ssl already installed ERROR: ====================================================================== ERROR: Missing system packages required for hpp-doc-3.0.0: ERROR: ERROR: asciidoc>=8.2.5 (Fedora package asciidoc) ERROR: ERROR: Please use the system package management tool to install these ERROR: dependencies. If a robotpkg version of a dependency is available, ERROR: you can configure robotpkg.conf to use this version instead. ERROR: ERROR: See /local/robotpkg/var/tmp/robotpkg/doc/hpp-doc/work/sysdep.log for details. ERROR: ====================================================================== make[2]: *** [sys-depends] Error 2 ===> Logging bulk summary for hpp-doc-3.0.0 => Checking leftover files => Creating bulk log files => Logging bulk metadata ===> Cleaning temporary files for hpp-doc-3.0.0 ===> Done bulk for hpp-doc-3.0.0 [44%] Processing devel/boost-headers:boost-headers-1.52.0 ===> Bulk building for boost-headers-1.52.0 Binary package for boost-headers-1.52.0 is up-to-date. [45%] Processing sysutils/py-rosdep:py27-rosdep-0.10.30 ===> Bulk building for py27-rosdep-0.10.30 Binary package for py27-rosdep-0.10.30 is up-to-date. [45%] Processing sysutils/py-rosdep:py35-rosdep-0.10.30 ===> Cleaning temporary files for py35-rosdep-0.10.30 ===> Bulk building for py35-rosdep-0.10.30 => Checking for clear installation => Installing digest-20080510.tgz => Installing tnftp-20130505~ssl.tgz => Required robotpkg package digest>=20080510: digest-20080510 found => Required robotpkg package tnftp>=20130505~ssl: tnftp-20130505~ssl found => Required system package gzip: gzip-1.6 found => Required system package patch>=2.0: patch-2.7.5 found => Required system package pax and tar archivers: pax found => Required system package pkg_install>=20110805.7: pkg_install-20110805.7 found => Dependency digest-20080510 already installed => Required robotpkg package py35-catkin-pkg>=0.2: N/A => Required system package py35-nose>=0.10: MISSING => Required robotpkg package py35-rosdistro>=0.2.9: N/A => Required robotpkg package py35-rospkg>=1.0.29: N/A => Required system package py35-yaml>=3: MISSING => Required system package python35>=3.5<3.6: MISSING => Dependency tnftp-20130505~ssl already installed ERROR: ====================================================================== ERROR: Missing system packages required for py35-rosdep-0.10.30: ERROR: ERROR: py35-nose>=0.10 (Fedora package python-nose (python-3.5)) ERROR: py35-yaml>=3 (Fedora package PyYAML (python-3.5)) ERROR: python35>=3.5<3.6 (Fedora package python3.5-devel) ERROR: ERROR: Please use the system package management tool to install these ERROR: dependencies. If a robotpkg version of a dependency is available, ERROR: you can configure robotpkg.conf to use this version instead. ERROR: ERROR: See /local/robotpkg/var/tmp/robotpkg/sysutils/py-rosdep/work/sysdep.log for details. ERROR: ====================================================================== make[2]: *** [sys-depends] Error 2 ===> Logging bulk summary for py35-rosdep-0.10.30 => Checking leftover files => Creating bulk log files => Logging bulk metadata ===> Cleaning temporary files for py35-rosdep-0.10.30 ===> Done bulk for py35-rosdep-0.10.30 [45%] Processing image/openni-nite:openni-nite-1.5.2.21r3 ===> Bulk building for openni-nite-1.5.2.21r3 Binary package for openni-nite-1.5.2.21r3 is up-to-date. [45%] Processing math/boost-numeric-bindings:boost-numeric-bindings-20101109 ===> Bulk building for boost-numeric-bindings-20101109 Binary package for boost-numeric-bindings-20101109 is up-to-date. [45%] Processing simulation/morse:morse-1.4~!* ===> Cleaning temporary files for morse-1.4 ===> Bulk building for morse-1.4 => Checking for clear installation => Installing digest-20080510.tgz => Installing tnftp-20130505~ssl.tgz => Required robotpkg package digest>=20080510: digest-20080510 found => Required robotpkg package tnftp>=20091122: tnftp-20130505~ssl found => Required system package gzip: gzip-1.6 found => Required system package patch>=2.0: patch-2.7.5 found => Required system package pax and tar archivers: pax found => Required system package pkg_install>=20110805.7: pkg_install-20110805.7 found WARNING: Cannot check installed version of blender => Dependency digest-20080510 already installed => Required system package py35-numpy>=1: MISSING => Required system package python35>=3.5<3.6: MISSING => Dependency tnftp-20130505~ssl already installed ERROR: ====================================================================== ERROR: Missing system packages required for morse-1.4: ERROR: ERROR: py35-numpy>=1 (Fedora package python-numpy (python-3.5)) ERROR: python35>=3.5<3.6 (Fedora package python3.5-devel) ERROR: ERROR: Please use the system package management tool to install these ERROR: dependencies. If a robotpkg version of a dependency is available, ERROR: you can configure robotpkg.conf to use this version instead. ERROR: ERROR: See /local/robotpkg/var/tmp/robotpkg/simulation/morse/work/sysdep.log for details. ERROR: ====================================================================== make[2]: *** [sys-depends] Error 2 ===> Logging bulk summary for morse-1.4 => Checking leftover files => Creating bulk log files => Logging bulk metadata ===> Cleaning temporary files for morse-1.4 ===> Done bulk for morse-1.4 [46%] Processing simulation/morse:morse-1.4~doc+!* ===> Cleaning temporary files for morse-1.4~doc ===> Bulk building for morse-1.4~doc => Checking for clear installation => Installing digest-20080510.tgz => Installing tnftp-20130505~ssl.tgz => Required robotpkg package digest>=20080510: digest-20080510 found => Required robotpkg package tnftp>=20091122: tnftp-20130505~ssl found => Required system package gzip: gzip-1.6 found => Required system package patch>=2.0: patch-2.7.5 found => Required system package pax and tar archivers: pax found => Required system package pkg_install>=20110805.7: pkg_install-20110805.7 found WARNING: Cannot check installed version of blender => Dependency digest-20080510 already installed => Required system package py35-numpy>=1: MISSING => Required system package py-sphinx>=1.1: MISSING => Required system package python35>=3.5<3.6: MISSING => Dependency tnftp-20130505~ssl already installed ERROR: ====================================================================== ERROR: Missing system packages required for morse-1.4~doc: ERROR: ERROR: py35-numpy>=1 (Fedora package python-numpy (python-3.5)) ERROR: py-sphinx>=1.1 (Fedora package python-sphinx (python-3.5)) ERROR: python35>=3.5<3.6 (Fedora package python3.5-devel) ERROR: ERROR: Please use the system package management tool to install these ERROR: dependencies. If a robotpkg version of a dependency is available, ERROR: you can configure robotpkg.conf to use this version instead. ERROR: ERROR: See /local/robotpkg/var/tmp/robotpkg/simulation/morse/work/sysdep.log for details. ERROR: ====================================================================== make[2]: *** [sys-depends] Error 2 ===> Logging bulk summary for morse-1.4~doc => Checking leftover files => Creating bulk log files => Logging bulk metadata ===> Cleaning temporary files for morse-1.4~doc ===> Done bulk for morse-1.4~doc [46%] Processing graphics/coldman-libs:coldman-libs-1.4~display ===> Bulk building for coldman-libs-1.4~display Binary package for coldman-libs-1.4~display is up-to-date. [46%] Processing devel/yaml-cpp:yaml-cpp-0.3.0 ===> Bulk building for yaml-cpp-0.3.0 Binary package for yaml-cpp-0.3.0 is up-to-date. [46%] Processing robots/mana-emergency:mana-emergency-0.2.1r1 ===> Bulk building for mana-emergency-0.2.1r1 Binary package for mana-emergency-0.2.1r1 is up-to-date. [47%] Processing hardware/cwiid:cwiid-0.6.00 ===> Bulk building for cwiid-0.6.00 Binary package for cwiid-0.6.00 is up-to-date. [47%] Processing knowledge/liboro:liboro-1.1r1 ===> Bulk building for liboro-1.1r1~doc Binary package for liboro-1.1r1~doc is up-to-date. [47%] Processing devel/ros-class-loader:ros-class-loader-0.3.0 ===> Bulk building for ros-class-loader-0.3.0 Binary package for ros-class-loader-0.3.0 is up-to-date. [47%] Processing architecture/orocos-ocl:orocos-ocl-2.8.1 ===> Bulk building for orocos-ocl-2.8.1 Binary package for orocos-ocl-2.8.1 is up-to-date. [48%] Processing mapping/libdtm:libdtm-1.4r1 ===> Bulk building for libdtm-1.4r1 Binary package for libdtm-1.4r1 is up-to-date. [48%] Processing www/picoweb:picoweb-1.3 ===> Bulk building for picoweb-1.3 Binary package for picoweb-1.3 is up-to-date. [48%] Processing middleware/yarp:yarp-2.3.64r2~!* ===> Bulk building for yarp-2.3.64r2 Binary package for yarp-2.3.64r2 is up-to-date. [48%] Processing middleware/yarp:yarp-2.3.64r2~gui+!* ===> Bulk building for yarp-2.3.64r2~gui Binary package for yarp-2.3.64r2~gui is up-to-date. [49%] Processing path/hpp-fcl:hpp-fcl-0.4.2r2 ===> Bulk building for hpp-fcl-0.4.2r2 Binary package for hpp-fcl-0.4.2r2 is up-to-date. [49%] Processing interfaces/genBasic-genom:genBasic-genom-0.4r1 ===> Bulk building for genBasic-genom-0.4r1~openprs+tcl+tclserv_client Binary package for genBasic-genom-0.4r1~openprs+tcl+tclserv_client is up-to-date. [49%] Processing devel/ros-lint:ros-lint-0.9.2 ===> Bulk building for ros-lint-0.9.2 Binary package for ros-lint-0.9.2 is up-to-date. [49%] Processing middleware/libjyarp:libjyarp-2.3.64 ===> Bulk building for libjyarp-2.3.64 Binary package for libjyarp-2.3.64 is up-to-date. [50%] Processing middleware/openrtm-aist:openrtm-aist-1.1.1 ===> Bulk building for openrtm-aist-1.1.1 Binary package for openrtm-aist-1.1.1 is up-to-date. [50%] Processing hardware/gbx-hokuyo-aist:gbx-hokuyo-aist-2.0.0 ===> Bulk building for gbx-hokuyo-aist-2.0.0 Binary package for gbx-hokuyo-aist-2.0.0 is up-to-date. [50%] Processing image/viam-v4l-driver:viam-v4l-driver-1.12 ===> Bulk building for viam-v4l-driver-1.12~opencv Binary package for viam-v4l-driver-1.12~opencv is up-to-date. [50%] Processing graphics/urdfdom:urdfdom-0.3.0r2 ===> Bulk building for urdfdom-0.3.0r2 Binary package for urdfdom-0.3.0r2 is up-to-date. [51%] Processing graphics/gepetto-viewer:gepetto-viewer-1.2.1 ===> Bulk building for gepetto-viewer-1.2.1 Binary package for gepetto-viewer-1.2.1 is up-to-date. [51%] Processing robots/mor-libs:mor-libs-0.1r1 ===> Bulk building for mor-libs-0.1r1 Binary package for mor-libs-0.1r1 is up-to-date. [51%] Processing mapping/mapkit:mapkit-1.0 ===> Bulk building for mapkit-1.0 Binary package for mapkit-1.0 is up-to-date. [51%] Processing interfaces/genPos-genom:genPos-genom-0.3r1 ===> Bulk building for genPos-genom-0.3r1~openprs+tcl+tclserv_client Binary package for genPos-genom-0.3r1~openprs+tcl+tclserv_client is up-to-date. [52%] Processing math/hpp-geometry:hpp-geometry-1.3.2 ===> Cleaning temporary files for hpp-geometry-1.3.2 ===> Bulk building for hpp-geometry-1.3.2 => Checking for clear installation => Installing digest-20080510.tgz => Installing tnftp-20130505~ssl.tgz => Required robotpkg package digest>=20080510: digest-20080510 found => Required robotpkg package tnftp>=20091122: tnftp-20130505~ssl found => Required system package gzip: gzip-1.6 found => Required system package pax and tar archivers: pax found => Required system package pkg_install>=20110805.7: pkg_install-20110805.7 found => Dependency digest-20080510 already installed => Installing geometric-tools-5p7r1.tgz => Installing hpp-util-3.1.0.tgz => Required system package kineoworks>=2.07<3: MISSING => Dependency tnftp-20130505~ssl already installed ERROR: ====================================================================== ERROR: Missing system packages required for hpp-geometry-1.3.2: ERROR: ERROR: kineoworks>=2.07<3 ERROR: ERROR: Please use the system package management tool to install these ERROR: dependencies. If a robotpkg version of a dependency is available, ERROR: you can configure robotpkg.conf to use this version instead. ERROR: ERROR: See /local/robotpkg/var/tmp/robotpkg/math/hpp-geometry/work/sysdep.log for details. ERROR: ====================================================================== make[2]: *** [sys-depends] Error 2 ===> Logging bulk summary for hpp-geometry-1.3.2 => Checking leftover files => Creating bulk log files => Logging bulk metadata ===> Cleaning temporary files for hpp-geometry-1.3.2 ===> Done bulk for hpp-geometry-1.3.2 [52%] Processing interfaces/jrl-mal:jrl-mal-1.19.6r1 ===> Bulk building for jrl-mal-1.19.6r1~jrl-mathtools Binary package for jrl-mal-1.19.6r1~jrl-mathtools is up-to-date. [52%] Processing devel/ros-roscpp-core:ros-roscpp-core-0.5.4r1 ===> Bulk building for ros-roscpp-core-0.5.4r1 Binary package for ros-roscpp-core-0.5.4r1 is up-to-date. [52%] Processing math/jafar-jmath:jafar-jmath-0.5 ===> Bulk building for jafar-jmath-0.5 Binary package for jafar-jmath-0.5 is up-to-date. [53%] Processing net/evart-stream:evart-stream-2.1 ===> Bulk building for evart-stream-2.1 Binary package for evart-stream-2.1 is up-to-date. [53%] Processing motion/ros-orocos-kdl:ros-orocos-kdl-1.3.0 ===> Bulk building for ros-orocos-kdl-1.3.0 Binary package for ros-orocos-kdl-1.3.0 is up-to-date. [53%] Processing doc/demo-genom:demo-genom-0.1 ===> Bulk building for demo-genom-0.1~openprs+tcl+tclserv_client Binary package for demo-genom-0.1~openprs+tcl+tclserv_client is up-to-date. [53%] Processing middleware/ros-genmsg:ros-genmsg-0.5.3 ===> Bulk building for ros-genmsg-0.5.3 Binary package for ros-genmsg-0.5.3 is up-to-date. [54%] Processing devel/ros-cmake-modules:ros-cmake-modules-0.3.1 ===> Bulk building for ros-cmake-modules-0.3.1 Binary package for ros-cmake-modules-0.3.1 is up-to-date. [54%] Processing localization/gyro-genom:gyro-genom-0.3r1~openprs+gyroKVH1000 ===> Bulk building for gyro-genom-0.3r1~gyroKVH1000+openprs+tcl+tclserv_client Binary package for gyro-genom-0.3r1~gyroKVH1000+openprs+tcl+tclserv_client is up-to-date. [54%] Processing localization/gyro-genom:gyro-genom-0.3r1~gyroKVH5000+openprs ===> Bulk building for gyro-genom-0.3r1~gyroKVH5000+openprs+tcl+tclserv_client Binary package for gyro-genom-0.3r1~gyroKVH5000+openprs+tcl+tclserv_client is up-to-date. [54%] Processing graphics/ros-convex-decomposition:ros-convex-decomposition-0.1.9 ===> Bulk building for ros-convex-decomposition-0.1.9 Binary package for ros-convex-decomposition-0.1.9 is up-to-date. [54%] Processing audio/speett-genom:speett-genom-1.0 ===> Bulk building for speett-genom-1.0~openprs+tcl+tclserv_client Binary package for speett-genom-1.0~openprs+tcl+tclserv_client is up-to-date. [55%] Processing motion/dynamic-graph:dynamic-graph-2.5.7 ===> Bulk building for dynamic-graph-2.5.7 Binary package for dynamic-graph-2.5.7 is up-to-date. [55%] Processing interfaces/genHum-genom:genHum-genom-1.1r1 ===> Bulk building for genHum-genom-1.1r1~openprs+tcl+tclserv_client Binary package for genHum-genom-1.1r1~openprs+tcl+tclserv_client is up-to-date. [55%] Processing math/ros-random-numbers:ros-random-numbers-0.2.0 ===> Bulk building for ros-random-numbers-0.2.0 Binary package for ros-random-numbers-0.2.0 is up-to-date. [55%] Processing lang/ros-gencpp:ros-gencpp-0.5.2 ===> Bulk building for ros-gencpp-0.5.2 Binary package for ros-gencpp-0.5.2 is up-to-date. [56%] Processing devel/ros-xacro:ros-xacro-1.9.2 ===> Bulk building for ros-xacro-1.9.2 Binary package for ros-xacro-1.9.2 is up-to-date. [56%] Processing knowledge/pellet:pellet-2.3.0 ===> Bulk building for pellet-2.3.0~doc Binary package for pellet-2.3.0~doc is up-to-date. [56%] Processing shell/eltclsh:eltclsh-1.16 ===> Bulk building for eltclsh-1.16 Binary package for eltclsh-1.16 is up-to-date. [56%] Processing hardware/force-genom:force-genom-1.1.1 ===> Bulk building for force-genom-1.1.1~openprs+tcl+tclserv_client Binary package for force-genom-1.1.1~openprs+tcl+tclserv_client is up-to-date. [57%] Processing lang/ros-genlisp:ros-genlisp-0.4.14 ===> Bulk building for ros-genlisp-0.4.14 Binary package for ros-genlisp-0.4.14 is up-to-date. [57%] Processing robots/romeo-description:romeo-description-0.4.0r1 ===> Bulk building for romeo-description-0.4.0r1 Binary package for romeo-description-0.4.0r1 is up-to-date. [57%] Processing math/ros-eigen-stl-containers:ros-eigen-stl-containers-0.1.4 ===> Bulk building for ros-eigen-stl-containers-0.1.4 Binary package for ros-eigen-stl-containers-0.1.4 is up-to-date. [57%] Processing path/hpp-model:hpp-model-3.1.1 ===> Bulk building for hpp-model-3.1.1 Binary package for hpp-model-3.1.1 is up-to-date. [58%] Processing manipulation/genManip-genom:genManip-genom-0.9 ===> Bulk building for genManip-genom-0.9~openprs+tcl+tclserv_client Binary package for genManip-genom-0.9~openprs+tcl+tclserv_client is up-to-date. [58%] Processing interfaces/abstract-robot-dynamics:abstract-robot-dynamics-1.20r1 ===> Bulk building for abstract-robot-dynamics-1.20r1 Binary package for abstract-robot-dynamics-1.20r1 is up-to-date. [58%] Processing optimization/roboptim-core-ipopt-plugin:roboptim-core-ipopt-plugin-0.2 ===> Bulk building for roboptim-core-ipopt-plugin-0.2 Binary package for roboptim-core-ipopt-plugin-0.2 is up-to-date. [58%] Processing knowledge/oro-server:oro-server-0.8.1 ===> Bulk building for oro-server-0.8.1 Binary package for oro-server-0.8.1 is up-to-date. [59%] Processing localization/pom-genom:pom-genom-0.7 ===> Bulk building for pom-genom-0.7~openprs+tcl+tclserv_client Binary package for pom-genom-0.7~openprs+tcl+tclserv_client is up-to-date. [59%] Processing robots/play-genom:play-genom-0.1 ===> Bulk building for play-genom-0.1~openprs+tcl+tclserv_client Binary package for play-genom-0.1~openprs+tcl+tclserv_client is up-to-date. [59%] Processing meta-pkgs/orocos-toolchain:orocos-toolchain-2.8.1 ===> Bulk building for orocos-toolchain-2.8.1 Binary package for orocos-toolchain-2.8.1 is up-to-date. [59%] Processing audio/textos-genom:textos-genom-1.0.2 ===> Bulk building for textos-genom-1.0.2~openprs+tcl+tclserv_client Binary package for textos-genom-1.0.2~openprs+tcl+tclserv_client is up-to-date. [60%] Processing graphics/ros-ivcon:ros-ivcon-0.1.4 ===> Bulk building for ros-ivcon-0.1.4 Binary package for ros-ivcon-0.1.4 is up-to-date. [60%] Processing mapping/regionMap-lib:regionMap-lib-0.4r3 ===> Bulk building for regionMap-lib-0.4r3 Binary package for regionMap-lib-0.4r3 is up-to-date. [60%] Processing graphics/robot-capsule-urdf:robot-capsule-urdf-1.0.1r2 ===> Bulk building for robot-capsule-urdf-1.0.1r2 Binary package for robot-capsule-urdf-1.0.1r2 is up-to-date. [60%] Processing image/jafar-image:jafar-image-2.3 ===> Bulk building for jafar-image-2.3 Binary package for jafar-image-2.3 is up-to-date. [61%] Processing meta-pkgs/boost:boost-1.52.0 ===> Bulk building for boost-1.52.0 Binary package for boost-1.52.0 is up-to-date. [61%] Processing robots/rflex-genom:rflex-genom-0.3r1 ===> Bulk building for rflex-genom-0.3r1~openprs+tcl+tclserv_client Binary package for rflex-genom-0.3r1~openprs+tcl+tclserv_client is up-to-date. [61%] Processing image/viam-genom:viam-genom-1.10 ===> Bulk building for viam-genom-1.10~display+openprs+tcl+tclserv_client Binary package for viam-genom-1.10~display+openprs+tcl+tclserv_client is up-to-date. [61%] Processing lang/ros-genpy:ros-genpy-0.5.3 ===> Bulk building for ros-genpy-0.5.3 Binary package for ros-genpy-0.5.3 is up-to-date. [62%] Processing graphics/gepetto-viewer-corba:gepetto-viewer-corba-1.2.0r1 ===> Bulk building for gepetto-viewer-corba-1.2.0r1 Binary package for gepetto-viewer-corba-1.2.0r1 is up-to-date. [62%] Processing meta-pkgs/gearbox:gearbox-10.11 ===> Bulk building for gearbox-10.11 Binary package for gearbox-10.11 is up-to-date. [62%] Processing motion/contlaw:contlaw-1.0 ===> Bulk building for contlaw-1.0 Binary package for contlaw-1.0 is up-to-date. [62%] Processing middleware/py-yarp:py35-yarp-2.3.64 ===> Cleaning temporary files for py35-yarp-2.3.64 ===> Bulk building for py35-yarp-2.3.64 => Checking for clear installation => Installing digest-20080510.tgz => Installing tnftp-20130505~ssl.tgz => Required robotpkg package digest>=20080510: digest-20080510 found => Required robotpkg package tnftp>=20130505~ssl: tnftp-20130505~ssl found => Required system package gzip: gzip-1.6 found => Required system package pax and tar archivers: pax found => Required system package pkg_install>=20110805.7: pkg_install-20110805.7 found => Installing ace-6.0.4r1.tgz => Dependency digest-20080510 already installed => Required system package python35>=3.5<3.6: MISSING => Dependency tnftp-20130505~ssl already installed => Installing yarp-2.3.64r2~gui.tgz ERROR: ====================================================================== ERROR: Missing system packages required for py35-yarp-2.3.64: ERROR: ERROR: python35>=3.5<3.6 (Fedora package python3.5-devel) ERROR: ERROR: Please use the system package management tool to install these ERROR: dependencies. If a robotpkg version of a dependency is available, ERROR: you can configure robotpkg.conf to use this version instead. ERROR: ERROR: See /local/robotpkg/var/tmp/robotpkg/middleware/py-yarp/work/sysdep.log for details. ERROR: ====================================================================== make[2]: *** [sys-depends] Error 2 ===> Logging bulk summary for py35-yarp-2.3.64 => Checking leftover files => Creating bulk log files => Logging bulk metadata ===> Cleaning temporary files for py35-yarp-2.3.64 ===> Done bulk for py35-yarp-2.3.64 [63%] Processing middleware/py-yarp:py27-yarp-2.3.64 ===> Bulk building for py27-yarp-2.3.64 Binary package for py27-yarp-2.3.64 is up-to-date. [63%] Processing image/niut-genom:niut-genom-0.6 ===> Bulk building for niut-genom-0.6~openprs+tcl+tclserv_client Binary package for niut-genom-0.6~openprs+tcl+tclserv_client is up-to-date. [63%] Processing image/stereopixel-genom:stereopixel-genom-1.3 ===> Bulk building for stereopixel-genom-1.3~openprs+tcl+tclserv_client Binary package for stereopixel-genom-1.3~openprs+tcl+tclserv_client is up-to-date. [63%] Processing math/jrl-dynamics:jrl-dynamics-1.25.0r1 ===> Bulk building for jrl-dynamics-1.25.0r1 Binary package for jrl-dynamics-1.25.0r1 is up-to-date. [63%] Processing sysutils/ros-rospack:ros-rospack-2.2.4 ===> Bulk building for ros-rospack-2.2.4 Binary package for ros-rospack-2.2.4 is up-to-date. [64%] Processing hardware/mouse3d-genom:mouse3d-genom-1.2 ===> Bulk building for mouse3d-genom-1.2~openprs+tcl+tclserv_client Binary package for mouse3d-genom-1.2~openprs+tcl+tclserv_client is up-to-date. [64%] Processing graphics/ros-srdfdom:ros-srdfdom-0.2.7 ===> Bulk building for ros-srdfdom-0.2.7 Binary package for ros-srdfdom-0.2.7 is up-to-date. [64%] Processing motion/py-dynamic-graph:py27-dynamic-graph-2.5.6r1 ===> Bulk building for py27-dynamic-graph-2.5.6r1 Binary package for py27-dynamic-graph-2.5.6r1 is up-to-date. [64%] Processing path/hpp-constraints:hpp-constraints-3.1.0r1 ===> Bulk building for hpp-constraints-3.1.0r1 Binary package for hpp-constraints-3.1.0r1 is up-to-date. [65%] Processing hardware/velodyne-genom:velodyne-genom-1.6 ===> Bulk building for velodyne-genom-1.6~openprs+tcl+tclserv_client Binary package for velodyne-genom-1.6~openprs+tcl+tclserv_client is up-to-date. [65%] Processing graphics/jafar-gdhe:jafar-gdhe-0.1r3 ===> Bulk building for jafar-gdhe-0.1r3 Binary package for jafar-gdhe-0.1r3 is up-to-date. [65%] Processing localization/MTI-genom:MTI-genom-0.4r1 ===> Bulk building for MTI-genom-0.4r1~openprs+tcl+tclserv_client Binary package for MTI-genom-0.4r1~openprs+tcl+tclserv_client is up-to-date. [65%] Processing interfaces/abstract-gik-task:abstract-gik-task-2.7 ===> Bulk building for abstract-gik-task-2.7 Binary package for abstract-gik-task-2.7 is up-to-date. [66%] Processing graphics/coldman-genom:coldman-genom-1.3r1 ===> Bulk building for coldman-genom-1.3r1~openprs+tcl+tclserv_client Binary package for coldman-genom-1.3r1~openprs+tcl+tclserv_client is up-to-date. [66%] Processing audio/clone-genom:clone-genom-0.2r1 ===> Bulk building for clone-genom-0.2r1~openprs+tcl+tclserv_client Binary package for clone-genom-0.2r1~openprs+tcl+tclserv_client is up-to-date. [66%] Processing lang/ros-message-generation:ros-message-generation-0.2.10 ===> Bulk building for ros-message-generation-0.2.10 Binary package for ros-message-generation-0.2.10 is up-to-date. [66%] Processing localization/GPS-genom:GPS-genom-1.7 ===> Bulk building for GPS-genom-1.7~openprs+tcl+tclserv_client Binary package for GPS-genom-1.7~openprs+tcl+tclserv_client is up-to-date. [67%] Processing mapping/worldmodelgrid3dg-genom:worldmodelgrid3dg-genom-1.0 ===> Bulk building for worldmodelgrid3dg-genom-1.0~openprs+tcl+tclserv_client Binary package for worldmodelgrid3dg-genom-1.0~openprs+tcl+tclserv_client is up-to-date. [67%] Processing robots/rmp440-genom:rmp440-genom-0.6~gyro ===> Bulk building for rmp440-genom-0.6~gyro+openprs+tcl+tclserv_client Binary package for rmp440-genom-0.6~gyro+openprs+tcl+tclserv_client is up-to-date. [67%] Processing image/jafar-correl:jafar-correl-0.3 ===> Bulk building for jafar-correl-0.3 Binary package for jafar-correl-0.3 is up-to-date. [67%] Processing robots/jloco-genom:jloco-genom-2.0 ===> Bulk building for jloco-genom-2.0~openprs+tcl+tclserv_client Binary package for jloco-genom-2.0~openprs+tcl+tclserv_client is up-to-date. [68%] Processing lang/ros-message-runtime:ros-message-runtime-0.4.12 ===> Bulk building for ros-message-runtime-0.4.12 Binary package for ros-message-runtime-0.4.12 is up-to-date. [68%] Processing motion/locoDemo-genom:locoDemo-genom-1.5 ===> Bulk building for locoDemo-genom-1.5~openprs+tcl+tclserv_client Binary package for locoDemo-genom-1.5~openprs+tcl+tclserv_client is up-to-date. [68%] Processing localization/hueblob-genom:hueblob-genom-1.4 ===> Bulk building for hueblob-genom-1.4~display+openprs+tcl+tclserv_client Binary package for hueblob-genom-1.4~display+openprs+tcl+tclserv_client is up-to-date. [68%] Processing architecture/genom3:genom3-2.99.29 ===> Bulk building for genom3-2.99.29 Binary package for genom3-2.99.29 is up-to-date. [69%] Processing robots/ivmob-genom:ivmob-genom-1.4 ===> Bulk building for ivmob-genom-1.4~openprs+tcl+tclserv_client Binary package for ivmob-genom-1.4~openprs+tcl+tclserv_client is up-to-date. [69%] Processing simulation/morse-yarp:morse-yarp-1.4 ===> Cleaning temporary files for morse-yarp-1.4 ===> Bulk building for morse-yarp-1.4 => Checking for clear installation => Installing digest-20080510.tgz => Installing tnftp-20130505~ssl.tgz => Required robotpkg package digest>=20080510: digest-20080510 found => Required robotpkg package tnftp>=20091122: tnftp-20130505~ssl found => Required system package gzip: gzip-1.6 found => Required system package patch>=2.0: patch-2.7.5 found => Required system package pax and tar archivers: pax found => Required system package pkg_install>=20110805.7: pkg_install-20110805.7 found => Installing ace-6.0.4r1.tgz WARNING: Cannot check installed version of blender => Dependency digest-20080510 already installed => Installing morse-1.4~doc.tgz => Required system package py35-numpy>=1: MISSING => Required robotpkg package py35-yarp>=2.3.1: N/A => Required system package python35>=3.5<3.6: MISSING => Dependency tnftp-20130505~ssl already installed => Installing yarp-2.3.64r2~gui.tgz ERROR: ====================================================================== ERROR: Missing system packages required for morse-yarp-1.4: ERROR: ERROR: py35-numpy>=1 (Fedora package python-numpy (python-3.5)) ERROR: python35>=3.5<3.6 (Fedora package python3.5-devel) ERROR: ERROR: Please use the system package management tool to install these ERROR: dependencies. If a robotpkg version of a dependency is available, ERROR: you can configure robotpkg.conf to use this version instead. ERROR: ERROR: See /local/robotpkg/var/tmp/robotpkg/simulation/morse-yarp/work/sysdep.log for details. ERROR: ====================================================================== make[2]: *** [sys-depends] Error 2 ===> Logging bulk summary for morse-yarp-1.4 => Checking leftover files => Creating bulk log files => Logging bulk metadata ===> Cleaning temporary files for morse-yarp-1.4 ===> Done bulk for morse-yarp-1.4 [69%] Processing hardware/sahand-genom:sahand-genom-1.1 ===> Bulk building for sahand-genom-1.1~openprs+tcl+tclserv_client Binary package for sahand-genom-1.1~openprs+tcl+tclserv_client is up-to-date. [69%] Processing image/viman-genom:viman-genom-1.6 ===> Bulk building for viman-genom-1.6~openprs+tcl+tclserv_client Binary package for viman-genom-1.6~openprs+tcl+tclserv_client is up-to-date. [70%] Processing math/hrp2-dynamics:hrp2-dynamics-1.5.3 ===> Bulk building for hrp2-dynamics-1.5.3 Binary package for hrp2-dynamics-1.5.3 is up-to-date. [70%] Processing hardware/platine-genom:platine-genom-0.5 ===> Bulk building for platine-genom-0.5~openprs+tcl+tclserv_client Binary package for platine-genom-0.5~openprs+tcl+tclserv_client is up-to-date. [70%] Processing interfaces/ros-std-msgs:ros-std-msgs-0.5.9 ===> Bulk building for ros-std-msgs-0.5.9 Binary package for ros-std-msgs-0.5.9 is up-to-date. [70%] Processing localization/imu-genom:imu-genom-0.2r1~atrv+openprs ===> Bulk building for imu-genom-0.2r1~atrv+openprs+tcl+tclserv_client Binary package for imu-genom-0.2r1~atrv+openprs+tcl+tclserv_client is up-to-date. [71%] Processing localization/imu-genom:imu-genom-0.2r1~atrv-junior+openprs ===> Bulk building for imu-genom-0.2r1~atrv-junior+openprs+tcl+tclserv_client Binary package for imu-genom-0.2r1~atrv-junior+openprs+tcl+tclserv_client is up-to-date. [71%] Processing hardware/sick-genom:sick-genom-0.2~atrv ===> Bulk building for sick-genom-0.2~atrv+openprs+tcl+tclserv_client Binary package for sick-genom-0.2~atrv+openprs+tcl+tclserv_client is up-to-date. [71%] Processing robots/rmp400-genom:rmp400-genom-0.11~gyro ===> Bulk building for rmp400-genom-0.11~gyro+openprs+tcl+tclserv_client Binary package for rmp400-genom-0.11~gyro+openprs+tcl+tclserv_client is up-to-date. [71%] Processing localization/segloc-genom:segloc-genom-0.3 ===> Bulk building for segloc-genom-0.3~openprs+tcl+tclserv_client Binary package for segloc-genom-0.3~openprs+tcl+tclserv_client is up-to-date. [72%] Processing robots/mor-genom:mor-genom-0.1r1 ===> Bulk building for mor-genom-0.1r1~openprs+tcl+tclserv_client Binary package for mor-genom-0.1r1~openprs+tcl+tclserv_client is up-to-date. [72%] Processing architecture/genom3-pocolibs:genom3-pocolibs-1.10 ===> Bulk building for genom3-pocolibs-1.10 Binary package for genom3-pocolibs-1.10 is up-to-date. [72%] Processing path/aspect-genom:aspect-genom-0.1 ===> Bulk building for aspect-genom-0.1~openprs+tcl+tclserv_client Binary package for aspect-genom-0.1~openprs+tcl+tclserv_client is up-to-date. [72%] Processing mapping/dtm-genom:dtm-genom-1.5 ===> Bulk building for dtm-genom-1.5~openprs+tcl+tclserv_client Binary package for dtm-genom-1.5~openprs+tcl+tclserv_client is up-to-date. [72%] Processing devel/ros-ros:ros-ros-1.11.4 ===> Bulk building for ros-ros-1.11.4 Binary package for ros-ros-1.11.4 is up-to-date. [73%] Processing path/p3d-genom:p3d-genom-1.5r2~rmp400 ===> Bulk building for p3d-genom-1.5r2~openprs+rmp400+tcl+tclserv_client Binary package for p3d-genom-1.5r2~openprs+rmp400+tcl+tclserv_client is up-to-date. [73%] Processing path/p3d-genom:p3d-genom>=1.1~rmp440 ===> Bulk building for p3d-genom-1.5r2~openprs+rmp440+tcl+tclserv_client Binary package for p3d-genom-1.5r2~openprs+rmp440+tcl+tclserv_client is up-to-date. [73%] Processing path/jrl-walkgen:jrl-walkgen-3.2.0 ===> Bulk building for jrl-walkgen-3.2.0 Binary package for jrl-walkgen-3.2.0 is up-to-date. [73%] Processing net/genomix:genomix-1.6.1 ===> Bulk building for genomix-1.6.1 Binary package for genomix-1.6.1 is up-to-date. [74%] Processing motion/sot-core:sot-core-2.9.10 ===> Bulk building for sot-core-2.9.10 Binary package for sot-core-2.9.10 is up-to-date. [74%] Processing meta-pkgs/jafar:jafar-20130522 ===> Bulk building for jafar-20130522 Binary package for jafar-20130522 is up-to-date. [74%] Processing interfaces/ros-comm-msgs:ros-comm-msgs-1.11.2r1 ===> Bulk building for ros-comm-msgs-1.11.2r1 Binary package for ros-comm-msgs-1.11.2r1 is up-to-date. [74%] Processing supervision/transgen3:transgen3-1.0b5 ===> Bulk building for transgen3-1.0b5 Binary package for transgen3-1.0b5 is up-to-date. [75%] Processing mapping/regionMap-genom:regionMap-genom-0.4 ===> Bulk building for regionMap-genom-0.4~openprs+tcl+tclserv_client Binary package for regionMap-genom-0.4~openprs+tcl+tclserv_client is up-to-date. [75%] Processing path/hpp-gik:hpp-gik-2.10.1 ===> Bulk building for hpp-gik-2.10.1 Binary package for hpp-gik-2.10.1 is up-to-date. [75%] Processing path/hpp-core:hpp-core-3.1.0r1 ===> Bulk building for hpp-core-3.1.0r1 Binary package for hpp-core-3.1.0r1 is up-to-date. [75%] Processing interfaces/ros-common-msgs:ros-common-msgs-1.11.4 ===> Bulk building for ros-common-msgs-1.11.4 Binary package for ros-common-msgs-1.11.4 is up-to-date. [76%] Processing graphics/ros-shape-tools:ros-shape-tools-0.2.1 ===> Bulk building for ros-shape-tools-0.2.1 Binary package for ros-shape-tools-0.2.1 is up-to-date. [76%] Processing motion/dynamic-graph-corba:dynamic-graph-corba-2.5.1r3 ===> Bulk building for dynamic-graph-corba-2.5.1r3 Binary package for dynamic-graph-corba-2.5.1r3 is up-to-date. [76%] Processing interfaces/ros-control-msgs:ros-control-msgs-1.3.1 ===> Bulk building for ros-control-msgs-1.3.1 Binary package for ros-control-msgs-1.3.1 is up-to-date. [76%] Processing interfaces/ros-map-msgs:ros-map-msgs-0.0.2 ===> Bulk building for ros-map-msgs-0.0.2 Binary package for ros-map-msgs-0.0.2 is up-to-date. [77%] Processing path/hpp-dynamic-obstacle:hpp-dynamic-obstacle-1.0 ===> Cleaning temporary files for hpp-dynamic-obstacle-1.0 ===> Bulk building for hpp-dynamic-obstacle-1.0 => Checking for clear installation Warning: DOXYGEN_PLIST_DIR in path/hpp-dynamic-obstacle is deprecated. Warning: use DYNAMIC_PLIST_DIRS instead. Warning: the LICENSE of path/hpp-dynamic-obstacle is undefined. => Installing digest-20080510.tgz => Installing tnftp-20130505~ssl.tgz Warning: DOXYGEN_PLIST_DIR in path/hpp-dynamic-obstacle is deprecated. Warning: use DYNAMIC_PLIST_DIRS instead. Warning: the LICENSE of path/hpp-dynamic-obstacle is undefined. => Required robotpkg package digest>=20080510: digest-20080510 found => Required robotpkg package tnftp>=20091122: tnftp-20130505~ssl found => Required system package gzip: gzip-1.6 found => Required system package pax and tar archivers: pax found => Required system package pkg_install>=20110805.7: pkg_install-20110805.7 found Warning: DOXYGEN_PLIST_DIR in path/hpp-dynamic-obstacle is deprecated. Warning: use DYNAMIC_PLIST_DIRS instead. Warning: the LICENSE of path/hpp-dynamic-obstacle is undefined. Warning: DOXYGEN_PLIST_DIR in path/hpp-dynamic-obstacle is deprecated. Warning: use DYNAMIC_PLIST_DIRS instead. Warning: the LICENSE of path/hpp-dynamic-obstacle is undefined. => Dependency digest-20080510 already installed => Installing hpp-core-3.1.0r1.tgz => Required robotpkg package hpp-kwsplus>=2.3: N/A => Dependency hpp-model-3.1.1 already installed => Required system package kineoworks>=2.07<3: MISSING => Dependency tnftp-20130505~ssl already installed Warning: DOXYGEN_PLIST_DIR in path/hpp-dynamic-obstacle is deprecated. Warning: use DYNAMIC_PLIST_DIRS instead. Warning: the LICENSE of path/hpp-dynamic-obstacle is undefined. ERROR: ====================================================================== ERROR: Missing system packages required for hpp-dynamic-obstacle-1.0: ERROR: ERROR: kineoworks>=2.07<3 ERROR: ERROR: Please use the system package management tool to install these ERROR: dependencies. If a robotpkg version of a dependency is available, ERROR: you can configure robotpkg.conf to use this version instead. ERROR: ERROR: See /local/robotpkg/var/tmp/robotpkg/path/hpp-dynamic-obstacle/work/sysdep.log for details. ERROR: ====================================================================== make[2]: *** [sys-depends] Error 2 Warning: DOXYGEN_PLIST_DIR in path/hpp-dynamic-obstacle is deprecated. Warning: use DYNAMIC_PLIST_DIRS instead. Warning: the LICENSE of path/hpp-dynamic-obstacle is undefined. ===> Logging bulk summary for hpp-dynamic-obstacle-1.0 => Checking leftover files => Creating bulk log files => Logging bulk metadata ===> Cleaning temporary files for hpp-dynamic-obstacle-1.0 ===> Done bulk for hpp-dynamic-obstacle-1.0 [77%] Processing motion/pilo-genom:pilo-genom-1.2r1~rmp400 ===> Bulk building for pilo-genom-1.2r1~openprs+rmp400+tcl+tclserv_client Binary package for pilo-genom-1.2r1~openprs+rmp400+tcl+tclserv_client is up-to-date. [77%] Processing motion/pilo-genom:pilo-genom>=1.2~locoDemo ===> Bulk building for pilo-genom-1.2r1~locoDemo+openprs+tcl+tclserv_client Binary package for pilo-genom-1.2r1~locoDemo+openprs+tcl+tclserv_client is up-to-date. [77%] Processing middleware/ros-comm:ros-comm-1.11.20 ===> Bulk building for ros-comm-1.11.20 Binary package for ros-comm-1.11.20 is up-to-date. [78%] Processing path/ndd-genom:ndd-genom-1.0 ===> Bulk building for ndd-genom-1.0~openprs+tcl+tclserv_client Binary package for ndd-genom-1.0~openprs+tcl+tclserv_client is up-to-date. [78%] Processing mapping/zone-genom:zone-genom-1.1 ===> Bulk building for zone-genom-1.1~openprs+tcl+tclserv_client Binary package for zone-genom-1.1~openprs+tcl+tclserv_client is up-to-date. [78%] Processing net/ros-resource-retriever:ros-resource-retriever-1.11.5 ===> Bulk building for ros-resource-retriever-1.11.5 Binary package for ros-resource-retriever-1.11.5 is up-to-date. [78%] Processing graphics/ros-python-qt-binding:ros-python-qt-binding-0.2.14 ===> Bulk building for ros-python-qt-binding-0.2.14 Binary package for ros-python-qt-binding-0.2.14 is up-to-date. [79%] Processing path/hpp-manipulation:hpp-manipulation-1.1.0r1 ===> Bulk building for hpp-manipulation-1.1.0r1 Binary package for hpp-manipulation-1.1.0r1 is up-to-date. [79%] Processing path/hpp-hik:hpp-hik-2.0.1 ===> Bulk building for hpp-hik-2.0.1 Binary package for hpp-hik-2.0.1 is up-to-date. [79%] Processing sysutils/ros-console-bridge:ros-console-bridge-0.4.2 ===> Bulk building for ros-console-bridge-0.4.2 Binary package for ros-console-bridge-0.4.2 is up-to-date. [79%] Processing supervision/genom3-openprs:genom3-openprs-1.0.9r5 ===> Bulk building for genom3-openprs-1.0.9r5 Binary package for genom3-openprs-1.0.9r5 is up-to-date. [80%] Processing scripts/pilo-demo:pilo-demo-0.1 ===> Bulk building for pilo-demo-0.1 Binary package for pilo-demo-0.1 is up-to-date. [80%] Processing path/hpp-walkfootplanner:hpp-walkfootplanner-2.4 ===> Bulk building for hpp-walkfootplanner-2.4 Binary package for hpp-walkfootplanner-2.4 is up-to-date. [80%] Processing supervision/ros-executive-smach:ros-executive-smach>=2.0<=2.0.0 ===> Bulk building for ros-executive-smach-2.0.0 Binary package for ros-executive-smach-2.0.0 is up-to-date. [80%] Processing motion/dynamic-graph-bridge-msgs:dynamic-graph-bridge-msgs-0.2.0 ===> Bulk building for dynamic-graph-bridge-msgs-0.2.0 Binary package for dynamic-graph-bridge-msgs-0.2.0 is up-to-date. [81%] Processing meta-pkgs/minnie:laas-minnie-20131022 ===> Bulk building for laas-minnie-20131022 Binary package for laas-minnie-20131022 is up-to-date. [81%] Processing motion/py-sot-tools:py27-sot-tools-1.0.1 ===> Bulk building for py27-sot-tools-1.0.1 Binary package for py27-sot-tools-1.0.1 is up-to-date. [81%] Processing middleware/ros-dynamic-reconfigure:ros-dynamic-reconfigure-1.5.37 ===> Bulk building for ros-dynamic-reconfigure-1.5.37 Binary package for ros-dynamic-reconfigure-1.5.37 is up-to-date. [81%] Processing meta-pkgs/ros-base:ros-base-1.11 ===> Bulk building for ros-base-1.11 Binary package for ros-base-1.11 is up-to-date. [81%] Processing interfaces/ros-humanoid-msgs:ros-humanoid-msgs-0.3.0 ===> Bulk building for ros-humanoid-msgs-0.3.0 Binary package for ros-humanoid-msgs-0.3.0 is up-to-date. [82%] Processing middleware/ros-actionlib:ros-actionlib-1.11.9 ===> Bulk building for ros-actionlib-1.11.9 Binary package for ros-actionlib-1.11.9 is up-to-date. [82%] Processing devel/ros-bond-core:ros-bond-core-1.7.14 ===> Bulk building for ros-bond-core-1.7.14 Binary package for ros-bond-core-1.7.14 is up-to-date. [82%] Processing path/hpp-wholebody-step:hpp-wholebody-step-3.1.0 ===> Bulk building for hpp-wholebody-step-3.1.0 Binary package for hpp-wholebody-step-3.1.0 is up-to-date. [82%] Processing meta-pkgs/mana:laas-mana-20120223 ===> Bulk building for laas-mana-20120223 Binary package for laas-mana-20120223 is up-to-date. [83%] Processing net/rosix:rosix-1.1 ===> Bulk building for rosix-1.1 Binary package for rosix-1.1 is up-to-date. [83%] Processing hardware/ros-driver-common:ros-driver-common-1.6.8 ===> Bulk building for ros-driver-common-1.6.8 Binary package for ros-driver-common-1.6.8 is up-to-date. [83%] Processing devel/ros-realtime-tools:ros-realtime-tools-1.9.2 ===> Bulk building for ros-realtime-tools-1.9.2 Binary package for ros-realtime-tools-1.9.2 is up-to-date. [83%] Processing math/ros-geometry2:ros-geometry2-0.5.15 ===> Bulk building for ros-geometry2-0.5.15 Binary package for ros-geometry2-0.5.15 is up-to-date. [84%] Processing graphics/ros-geometric-shapes:ros-geometric-shapes-0.4.1 ===> Bulk building for ros-geometric-shapes-0.4.1 Binary package for ros-geometric-shapes-0.4.1 is up-to-date. [84%] Processing motion/sot-dynamic:sot-dynamic-2.9.2 ===> Bulk building for sot-dynamic-2.9.2 Binary package for sot-dynamic-2.9.2 is up-to-date. [84%] Processing devel/ros-pluginlib:ros-pluginlib-1.10.1 ===> Bulk building for ros-pluginlib-1.10.1 Binary package for ros-pluginlib-1.10.1 is up-to-date. [84%] Processing motion/ros-control-toolbox:ros-control-toolbox-1.13.2r1 ===> Bulk building for ros-control-toolbox-1.13.2r1 Binary package for ros-control-toolbox-1.13.2r1 is up-to-date. [85%] Processing path/hpp-localstepper:hpp-localstepper-1.1.1 ===> Bulk building for hpp-localstepper-1.1.1 Binary package for hpp-localstepper-1.1.1 is up-to-date. [85%] Processing path/hpp-walkplanner:hpp-walkplanner-3.7 ===> Bulk building for hpp-walkplanner-3.7 Binary package for hpp-walkplanner-3.7 is up-to-date. [85%] Processing sysutils/ros-diagnostics:ros-diagnostics-1.8.5 ===> Bulk building for ros-diagnostics-1.8.5 Binary package for ros-diagnostics-1.8.5 is up-to-date. [85%] Processing architecture/genom3-ros:genom3-ros-1.17 ===> Bulk building for genom3-ros-1.17 Binary package for genom3-ros-1.17 is up-to-date. [86%] Processing robots/mikrokopter-genom3:mikrokopter-genom3-1.6.1~codels+pocolibs-client-c+openprs+pocolibs-server+!* ===> Bulk building for mikrokopter-genom3-1.6.1~codels+openprs+pocolibs-client-c+pocolibs-server Binary package for mikrokopter-genom3-1.6.1~codels+openprs+pocolibs-client-c+pocolibs-server is up-to-date. [86%] Processing robots/mikrokopter-genom3:mikrokopter-genom3-1.6.1~codels+openprs+ros-client-c+ros-client-ros+ros-server+!* ===> Bulk building for mikrokopter-genom3-1.6.1~codels+openprs+ros-client-c+ros-client-ros+ros-server Binary package for mikrokopter-genom3-1.6.1~codels+openprs+ros-client-c+ros-client-ros+ros-server is up-to-date. [86%] Processing sysutils/arduio-genom3:arduio-genom3-1.1~codels+pocolibs-client-c+openprs+pocolibs-server+!* ===> Bulk building for arduio-genom3-1.1~codels+openprs+pocolibs-client-c+pocolibs-server Binary package for arduio-genom3-1.1~codels+openprs+pocolibs-client-c+pocolibs-server is up-to-date. [86%] Processing sysutils/arduio-genom3:arduio-genom3-1.1~codels+openprs+ros-client-c+ros-client-ros+ros-server+!* ===> Bulk building for arduio-genom3-1.1~codels+openprs+ros-client-c+ros-client-ros+ros-server Binary package for arduio-genom3-1.1~codels+openprs+ros-client-c+ros-client-ros+ros-server is up-to-date. [87%] Processing motion/nhfc-genom3:nhfc-genom3-1.3~codels+pocolibs-client-c+openprs+pocolibs-server+!* ===> Bulk building for nhfc-genom3-1.3~codels+openprs+pocolibs-client-c+pocolibs-server Binary package for nhfc-genom3-1.3~codels+openprs+pocolibs-client-c+pocolibs-server is up-to-date. [87%] Processing motion/nhfc-genom3:nhfc-genom3-1.3~codels+openprs+ros-client-c+ros-client-ros+ros-server+!* ===> Bulk building for nhfc-genom3-1.3~codels+openprs+ros-client-c+ros-client-ros+ros-server Binary package for nhfc-genom3-1.3~codels+openprs+ros-client-c+ros-client-ros+ros-server is up-to-date. [87%] Processing hardware/joystick-genom3:joystick-genom3-1.0~codels+pocolibs-client-c+openprs+pocolibs-server+!* ===> Bulk building for joystick-genom3-1.0~codels+openprs+pocolibs-client-c+pocolibs-server Binary package for joystick-genom3-1.0~codels+openprs+pocolibs-client-c+pocolibs-server is up-to-date. [87%] Processing hardware/joystick-genom3:joystick-genom3-1.0~codels+openprs+ros-client-c+ros-client-ros+ros-server+!* ===> Bulk building for joystick-genom3-1.0~codels+openprs+ros-client-c+ros-client-ros+ros-server Binary package for joystick-genom3-1.0~codels+openprs+ros-client-c+ros-client-ros+ros-server is up-to-date. [88%] Processing math/ros-geometry:ros-geometry-1.11.3r1 ===> Bulk building for ros-geometry-1.11.3r1 Binary package for ros-geometry-1.11.3r1 is up-to-date. [88%] Processing localization/optitrack-genom3:optitrack-genom3-1.6.1~codels+pocolibs-client-c+openprs+pocolibs-server+!* ===> Bulk building for optitrack-genom3-1.6.1~codels+openprs+pocolibs-client-c+pocolibs-server Binary package for optitrack-genom3-1.6.1~codels+openprs+pocolibs-client-c+pocolibs-server is up-to-date. [88%] Processing localization/optitrack-genom3:optitrack-genom3-1.6.1~codels+openprs+ros-client-c+ros-client-ros+ros-server+!* ===> Bulk building for optitrack-genom3-1.6.1~codels+openprs+ros-client-c+ros-client-ros+ros-server Binary package for optitrack-genom3-1.6.1~codels+openprs+ros-client-c+ros-client-ros+ros-server is up-to-date. [88%] Processing robots/sot-openhrp:sot-openhrp-2.5.1 ===> Cleaning temporary files for sot-openhrp-2.5.1~hrp2-laas ===> Bulk building for sot-openhrp-2.5.1~hrp2-laas => Checking for clear installation Warning: DOXYGEN_PLIST_DIR in robots/sot-openhrp is deprecated. Warning: use DYNAMIC_PLIST_DIRS instead. => Installing digest-20080510.tgz => Installing tnftp-20130505~ssl.tgz Warning: DOXYGEN_PLIST_DIR in robots/sot-openhrp is deprecated. Warning: use DYNAMIC_PLIST_DIRS instead. => Required robotpkg package digest>=20080510: digest-20080510 found => Required robotpkg package tnftp>=20091122: tnftp-20130505~ssl found => Required system package gzip: gzip-1.6 found => Required system package pax and tar archivers: pax found => Required system package pkg_install>=20110805.7: pkg_install-20110805.7 found Warning: DOXYGEN_PLIST_DIR in robots/sot-openhrp is deprecated. Warning: use DYNAMIC_PLIST_DIRS instead. Warning: DOXYGEN_PLIST_DIR in robots/sot-openhrp is deprecated. Warning: use DYNAMIC_PLIST_DIRS instead. => Dependency digest-20080510 already installed => Installing dynamic-graph-corba-2.5.1r3.tgz => Installing sot-dynamic-2.9.2.tgz => Dependency tnftp-20130505~ssl already installed Warning: DOXYGEN_PLIST_DIR in robots/sot-openhrp is deprecated. Warning: use DYNAMIC_PLIST_DIRS instead. => Building with the following options: => Use the GNU C++ compiler: c++-compiler provided by g++>=3 => Use the GNU C compiler: c-compiler provided by gcc>=3 => Use python-2.7: python>=2.5<3.6 provided by python27>=2.7<2.8 => Required system package cmake>=2.6: cmake-3.4.3 found => Required system package doxygen>=1.5: doxygen-1.8.11 found => Required system package g++>=3: g++-5.3.1 found => Required system package gcc>=3: gcc-5.3.1 found => Required system package libstdc++: libstdc++ found => Required system package pkg-config>=0.22: pkg-config-0.28 found => Required system package python27>=2.7<2.8: python27-2.7.11 found => Required robotpkg package dynamic-graph-corba>=2.5: dynamic-graph-corba-2.5.1r3 found => Required robotpkg package sot-dynamic>=2.5: sot-dynamic-2.9.2 found Warning: DOXYGEN_PLIST_DIR in robots/sot-openhrp is deprecated. Warning: use DYNAMIC_PLIST_DIRS instead. Warning: DOXYGEN_PLIST_DIR in robots/sot-openhrp is deprecated. Warning: use DYNAMIC_PLIST_DIRS instead. Warning: DOXYGEN_PLIST_DIR in robots/sot-openhrp is deprecated. Warning: use DYNAMIC_PLIST_DIRS instead. => SHA1 checksums OK => RMD160 checksums OK An unexpected error occured. The last 10 log lines are shown below. | -- Boost version: 1.58.0 | -- Found the following Boost libraries: | -- thread | CMake Error at CMakeLists.txt:62 (MESSAGE): | The directory 'GRX_PREFIX-NOTFOUND/HRP2LAAS' does not exist.Please check | the ROBOT configuration variable. | | | -- Configuring incomplete, errors occurred! | See also "/local/robotpkg/var/tmp/robotpkg/robots/sot-openhrp/work/sot-openhrp-2.5.1/CMakeFiles/CMakeOutput.log". For details or bug reports, check the complete log file in: /local/robotpkg/var/tmp/robotpkg/robots/sot-openhrp/work/configure.log make[3]: *** [do-configure-cmake] Error 1 make[2]: *** [pkg-check-installed] Error 2 => Marking sot-openhrp-2.5.1~hrp2-laas as broken ERROR: make: *** [package] Error 2 Warning: DOXYGEN_PLIST_DIR in robots/sot-openhrp is deprecated. Warning: use DYNAMIC_PLIST_DIRS instead. ===> Logging bulk summary for sot-openhrp-2.5.1~hrp2-laas => Checking leftover files => Creating bulk log files => Logging bulk metadata ===> Cleaning temporary files for sot-openhrp-2.5.1~hrp2-laas ===> Done bulk for sot-openhrp-2.5.1~hrp2-laas [89%] Processing devel/ros-filters:ros-filters-1.7.4 ===> Bulk building for ros-filters-1.7.4 Binary package for ros-filters-1.7.4 is up-to-date. [89%] Processing image/ros-image-common:ros-image-common-1.11.3 ===> Bulk building for ros-image-common-1.11.3 Binary package for ros-image-common-1.11.3 is up-to-date. [89%] Processing graphics/ros-interactive-markers:ros-interactive-markers>=1.11<=1.11.0 ===> Bulk building for ros-interactive-markers-1.11.0 Binary package for ros-interactive-markers-1.11.0 is up-to-date. [89%] Processing devel/ros-nodelet-core:ros-nodelet-core>=1.9<=1.9.0 ===> Bulk building for ros-nodelet-core-1.9.0 Binary package for ros-nodelet-core-1.9.0 is up-to-date. [90%] Processing path/maneuver-genom3:maneuver-genom3-1.0~codels+pocolibs-client-c+openprs+pocolibs-server+!* ===> Bulk building for maneuver-genom3-1.0~codels+openprs+pocolibs-client-c+pocolibs-server Binary package for maneuver-genom3-1.0~codels+openprs+pocolibs-client-c+pocolibs-server is up-to-date. [90%] Processing path/maneuver-genom3:maneuver-genom3-1.0~codels+openprs+ros-client-c+ros-client-ros+ros-server+!* ===> Bulk building for maneuver-genom3-1.0~codels+openprs+ros-client-c+ros-client-ros+ros-server Binary package for maneuver-genom3-1.0~codels+openprs+ros-client-c+ros-client-ros+ros-server is up-to-date. [90%] Processing path/hpp-worldmodelplanner:hpp-worldmodelplanner-1.0 ===> Cleaning temporary files for hpp-worldmodelplanner-1.0 ===> Bulk building for hpp-worldmodelplanner-1.0 => Checking for clear installation Warning: DOXYGEN_PLIST_DIR in path/hpp-worldmodelplanner is deprecated. Warning: use DYNAMIC_PLIST_DIRS instead. Warning: the LICENSE of path/hpp-worldmodelplanner is undefined. => Installing digest-20080510.tgz => Installing tnftp-20130505~ssl.tgz Warning: DOXYGEN_PLIST_DIR in path/hpp-worldmodelplanner is deprecated. Warning: use DYNAMIC_PLIST_DIRS instead. Warning: the LICENSE of path/hpp-worldmodelplanner is undefined. => Required robotpkg package digest>=20080510: digest-20080510 found => Required robotpkg package tnftp>=20091122: tnftp-20130505~ssl found => Required system package gzip: gzip-1.6 found => Required system package pax and tar archivers: pax found => Required system package pkg_install>=20110805.7: pkg_install-20110805.7 found Warning: DOXYGEN_PLIST_DIR in path/hpp-worldmodelplanner is deprecated. Warning: use DYNAMIC_PLIST_DIRS instead. Warning: the LICENSE of path/hpp-worldmodelplanner is undefined. Warning: DOXYGEN_PLIST_DIR in path/hpp-worldmodelplanner is deprecated. Warning: use DYNAMIC_PLIST_DIRS instead. Warning: the LICENSE of path/hpp-worldmodelplanner is undefined. => Dependency digest-20080510 already installed => Required robotpkg package hpp-dynamic-obstacle>=1.0: N/A => Required robotpkg package hpp-walkplanner>=3.5: N/A => Required system package kineoworks>=2.07<3: MISSING => Dependency tnftp-20130505~ssl already installed => Installing worldmodelgrid3d-1.0~boost.tgz Warning: DOXYGEN_PLIST_DIR in path/hpp-worldmodelplanner is deprecated. Warning: use DYNAMIC_PLIST_DIRS instead. Warning: the LICENSE of path/hpp-worldmodelplanner is undefined. ERROR: ====================================================================== ERROR: Missing system packages required for hpp-worldmodelplanner-1.0: ERROR: ERROR: kineoworks>=2.07<3 ERROR: ERROR: Please use the system package management tool to install these ERROR: dependencies. If a robotpkg version of a dependency is available, ERROR: you can configure robotpkg.conf to use this version instead. ERROR: ERROR: See /local/robotpkg/var/tmp/robotpkg/path/hpp-worldmodelplanner/work/sysdep.log for details. ERROR: ====================================================================== make[2]: *** [sys-depends] Error 2 Warning: DOXYGEN_PLIST_DIR in path/hpp-worldmodelplanner is deprecated. Warning: use DYNAMIC_PLIST_DIRS instead. Warning: the LICENSE of path/hpp-worldmodelplanner is undefined. ===> Logging bulk summary for hpp-worldmodelplanner-1.0 => Checking leftover files => Creating bulk log files => Logging bulk metadata ===> Cleaning temporary files for hpp-worldmodelplanner-1.0 ===> Done bulk for hpp-worldmodelplanner-1.0 [90%] Processing graphics/ros-qt-gui-core:ros-qt-gui-core-0.2.25 ===> Bulk building for ros-qt-gui-core-0.2.25 Binary package for ros-qt-gui-core-0.2.25 is up-to-date. [90%] Processing doc/demo-genom3:demo-genom3-1.3~codels+pocolibs-client-c+openprs+pocolibs-server+!* ===> Bulk building for demo-genom3-1.3~codels+openprs+pocolibs-client-c+pocolibs-server Binary package for demo-genom3-1.3~codels+openprs+pocolibs-client-c+pocolibs-server is up-to-date. [91%] Processing doc/demo-genom3:demo-genom3-1.3~codels+openprs+ros-client-c+ros-client-ros+ros-server+!* ===> Bulk building for demo-genom3-1.3~codels+openprs+ros-client-c+ros-client-ros+ros-server Binary package for demo-genom3-1.3~codels+openprs+ros-client-c+ros-client-ros+ros-server is up-to-date. [91%] Processing image/ros-vision-opencv:ros-vision-opencv-1.11.12 ===> Bulk building for ros-vision-opencv-1.11.12 Binary package for ros-vision-opencv-1.11.12 is up-to-date. [91%] Processing hardware/dynamixel-genom3:dynamixel-genom3-1.0~codels+pocolibs-client-c+openprs+pocolibs-server+!* ===> Bulk building for dynamixel-genom3-1.0~codels+openprs+pocolibs-client-c+pocolibs-server Binary package for dynamixel-genom3-1.0~codels+openprs+pocolibs-client-c+pocolibs-server is up-to-date. [91%] Processing hardware/dynamixel-genom3:dynamixel-genom3-1.0~codels+openprs+ros-client-c+ros-client-ros+ros-server+!* ===> Bulk building for dynamixel-genom3-1.0~codels+openprs+ros-client-c+ros-client-ros+ros-server Binary package for dynamixel-genom3-1.0~codels+openprs+ros-client-c+ros-client-ros+ros-server is up-to-date. [92%] Processing simulation/mrsim-genom3:mrsim-genom3-1.1~codels+pocolibs-client-c+openprs+pocolibs-server+!* ===> Bulk building for mrsim-genom3-1.1~codels+openprs+pocolibs-client-c+pocolibs-server Binary package for mrsim-genom3-1.1~codels+openprs+pocolibs-client-c+pocolibs-server is up-to-date. [92%] Processing simulation/mrsim-genom3:mrsim-genom3-1.1~codels+openprs+ros-client-c+ros-client-ros+ros-server+!* ===> Bulk building for mrsim-genom3-1.1~codels+openprs+ros-client-c+ros-client-ros+ros-server Binary package for mrsim-genom3-1.1~codels+openprs+ros-client-c+ros-client-ros+ros-server is up-to-date. [92%] Processing localization/pom-genom3:pom-genom3-2.2r1~codels+pocolibs-client-c+openprs+pocolibs-server+!* ===> Cleaning temporary files for pom-genom3-2.2r1~codels+openprs+pocolibs-client-c+pocolibs-server ===> Bulk building for pom-genom3-2.2r1~codels+openprs+pocolibs-client-c+pocolibs-server => Checking for clear installation => Installing digest-20080510.tgz => Installing tnftp-20130505~ssl.tgz => Required robotpkg package digest>=20080510: digest-20080510 found => Required robotpkg package tnftp>=20091122: tnftp-20130505~ssl found => Required system package gzip: gzip-1.6 found => Required system package patch>=2.0: patch-2.7.5 found => Required system package pax and tar archivers: pax found => Required system package pkg_install>=20110805.7: pkg_install-20110805.7 found => Dependency digest-20080510 already installed => Installing genom3-2.99.29.tgz => Installing genom3-openprs-1.0.9r5.tgz => Installing genom3-pocolibs-1.10.tgz => Dependency openprs-1.1b10 already installed => Installing openrobots-idl-1.4.tgz => Dependency pocolibs-2.16 already installed => Dependency tnftp-20130505~ssl already installed => Dependency transgen3-1.0b5 already installed => Building with the following options: => Use the GNU C++ compiler: c++-compiler provided by g++>=3 => Use the GNU C compiler: c-compiler provided by gcc>=3 => Required system package autoconf>=2.59: autoconf-2.69 found => Required system package automake>=1.8: automake-1.15 found => Required system package eigen3>=3.0.0: eigen3-3.2.10 found => Required system package g++>=3: g++-5.3.1 found => Required system package gcc>=3: gcc-5.3.1 found => Required system package libstdc++: libstdc++ found => Required system package libtool>=1.5.22: libtool-2.4.6 found => Required system package pkg-config>=0.22: pkg-config-0.28 found => Required robotpkg package genom3>=2.99.28: genom3-2.99.29 found => Required robotpkg package genom3-openprs>=1.0: genom3-openprs-1.0.9r5 found => Required robotpkg package genom3-pocolibs>=1.8: genom3-pocolibs-1.10 found => Required robotpkg package openprs>=1.1b7: openprs-1.1b10 found => Required robotpkg package openrobots-idl>=1.4: openrobots-idl-1.4 found => Required robotpkg package pocolibs>=2.11: pocolibs-2.16 found => Required robotpkg package transgen3>=1.0b2: transgen3-1.0b5 found => SHA1 checksums OK => RMD160 checksums OK => Applying robotpkg patches for pom-genom3-2.2r1~codels+openprs+pocolibs-client-c+pocolibs-server => Generating openprs/client => Running autoreconf for openprs/client => Generating pocolibs/client/c => Running autoreconf for pocolibs/client/c => Generating pocolibs/server => Running autoreconf for pocolibs/server => Modifying GNU configure scripts to avoid --recheck => Adding run-time search paths to pkg-config files => Registering installation for pom-genom3-2.2r1~codels+openprs+pocolibs-client-c+pocolibs-server => Linking package in /opt/robotpkg/var/lib/robotpkg/packages/bsd/Fedora-23-x86_64/pub ===> Logging bulk summary for pom-genom3-2.2r1~codels+openprs+pocolibs-client-c+pocolibs-server => Checking leftover files => Creating bulk log files => Logging bulk metadata ===> Cleaning temporary files for pom-genom3-2.2r1~codels+openprs+pocolibs-client-c+pocolibs-server ===> Done bulk for pom-genom3-2.2r1~codels+openprs+pocolibs-client-c+pocolibs-server [92%] Processing localization/pom-genom3:pom-genom3-2.2r1~codels+openprs+ros-client-c+ros-client-ros+ros-server+!* ===> Cleaning temporary files for pom-genom3-2.2r1~codels+openprs+ros-client-c+ros-client-ros+ros-server ===> Bulk building for pom-genom3-2.2r1~codels+openprs+ros-client-c+ros-client-ros+ros-server => Checking for clear installation => Installing digest-20080510.tgz => Installing tnftp-20130505~ssl.tgz => Required robotpkg package digest>=20080510: digest-20080510 found => Required robotpkg package tnftp>=20091122: tnftp-20130505~ssl found => Required system package gzip: gzip-1.6 found => Required system package patch>=2.0: patch-2.7.5 found => Required system package pax and tar archivers: pax found => Required system package pkg_install>=20110805.7: pkg_install-20110805.7 found => Dependency digest-20080510 already installed => Installing genom3-2.99.29.tgz => Installing genom3-openprs-1.0.9r5.tgz => Installing genom3-ros-1.17.tgz => Dependency openprs-1.1b10 already installed => Installing openrobots-idl-1.4.tgz => Dependency ros-actionlib-1.11.9 already installed => Dependency ros-comm-1.11.20 already installed => Dependency ros-common-msgs-1.11.4 already installed => Dependency ros-ros-1.11.4 already installed => Dependency ros-rospack-2.2.4 already installed => Dependency tnftp-20130505~ssl already installed => Dependency transgen3-1.0b5 already installed => Building with the following options: => Use the GNU C++ compiler: c++-compiler provided by g++>=3 => Use the GNU C compiler: c-compiler provided by gcc>=3 => Use python-2.7: python>=2.5<3.6 provided by python27>=2.7<2.8 => Use ros indigo: ros>=groovy provided by ros-indigo => Required system package autoconf>=2.59: autoconf-2.69 found => Required system package automake>=1.8: automake-1.15 found => Required system package boost-headers>=1.34.1: boost-headers-1.58 found => Required system package boostlib-thread>=1.34.1: boost-libs-1.58.0 found => Required system package eigen3>=3.0.0: eigen3-3.2.10 found => Required system package g++>=3: g++-5.3.1 found => Required system package gcc>=3: gcc-5.3.1 found => Required system package libstdc++: libstdc++ found => Required system package libtool>=1.5.22: libtool-2.4.6 found => Required system package pkg-config>=0.22: pkg-config-0.28 found => Required system package python27>=2.7<2.8: python27-2.7.11 found => Required robotpkg package genom3>=2.99.28: genom3-2.99.29 found => Required robotpkg package genom3-openprs>=1.0: genom3-openprs-1.0.9r5 found => Required robotpkg package genom3-ros>=1.15.1: genom3-ros-1.17 found => Required robotpkg package openprs>=1.1b7: openprs-1.1b10 found => Required robotpkg package openrobots-idl>=1.4: openrobots-idl-1.4 found => Required robotpkg package ros-actionlib>=1.11<1.12: ros-actionlib-1.11.9 found => Required robotpkg package ros-comm>=1.11<1.12: ros-comm-1.11.20 found => Required robotpkg package ros-common-msgs>=1.11<1.12: ros-common-msgs-1.11.4 found => Required robotpkg package ros-ros>=1.11<1.12: ros-ros-1.11.4 found => Required robotpkg package ros-rospack>=2.1: ros-rospack-2.2.4 found => Required robotpkg package transgen3>=1.0b2: transgen3-1.0b5 found => SHA1 checksums OK => RMD160 checksums OK => Applying robotpkg patches for pom-genom3-2.2r1~codels+openprs+ros-client-c+ros-client-ros+ros-server => Generating openprs/client => Running autoreconf for openprs/client => Generating ros/client/c => Running autoreconf for ros/client/c => Generating ros/client/ros => Running autoreconf for ros/client/ros => Generating ros/server => Running autoreconf for ros/server => Modifying GNU configure scripts to avoid --recheck => Adding run-time search paths to pkg-config files => Compiling python files => Registering installation for pom-genom3-2.2r1~codels+openprs+ros-client-c+ros-client-ros+ros-server => Linking package in /opt/robotpkg/var/lib/robotpkg/packages/bsd/Fedora-23-x86_64/pub ===> Logging bulk summary for pom-genom3-2.2r1~codels+openprs+ros-client-c+ros-client-ros+ros-server => Checking leftover files => Creating bulk log files => Logging bulk metadata ===> Cleaning temporary files for pom-genom3-2.2r1~codels+openprs+ros-client-c+ros-client-ros+ros-server ===> Done bulk for pom-genom3-2.2r1~codels+openprs+ros-client-c+ros-client-ros+ros-server [93%] Processing graphics/ros-robot-model:ros-robot-model-1.11.5 ===> Bulk building for ros-robot-model-1.11.5 Binary package for ros-robot-model-1.11.5 is up-to-date. [93%] Processing graphics/ros-rqt:ros-rqt-0.2.14 ===> Bulk building for ros-rqt-0.2.14 Binary package for ros-rqt-0.2.14 is up-to-date. [93%] Processing path/hpp-model-urdf:hpp-model-urdf-3.1.0r1 ===> Bulk building for hpp-model-urdf-3.1.0r1 Binary package for hpp-model-urdf-3.1.0r1 is up-to-date. [93%] Processing mapping/ros-laser-geometry:ros-laser-geometry-1.6.2 ===> Bulk building for ros-laser-geometry-1.6.2 Binary package for ros-laser-geometry-1.6.2 is up-to-date. [94%] Processing motion/ros-control:ros-control-0.9.4r2 ===> Bulk building for ros-control-0.9.4r2 Binary package for ros-control-0.9.4r2 is up-to-date. [94%] Processing sysutils/ros-rviz:ros-rviz-1.11.10 ===> Bulk building for ros-rviz-1.11.10 Binary package for ros-rviz-1.11.10 is up-to-date. [94%] Processing math/jrl-dynamics-urdf:jrl-dynamics-urdf-2.2.0r1 ===> Bulk building for jrl-dynamics-urdf-2.2.0r1 Binary package for jrl-dynamics-urdf-2.2.0r1 is up-to-date. [94%] Processing graphics/ros-rqt-common-plugins:ros-rqt-common-plugins-0.3.8 ===> Bulk building for ros-rqt-common-plugins-0.3.8 Binary package for ros-rqt-common-plugins-0.3.8 is up-to-date. [95%] Processing graphics/rcpdf-interface:rcpdf-interface>=0.2 ===> Bulk building for rcpdf-interface-0.2r2 Binary package for rcpdf-interface-0.2r2 is up-to-date. [95%] Processing path/hpp-corbaserver:hpp-corbaserver-3.1.0 ===> Bulk building for hpp-corbaserver-3.1.0 Binary package for hpp-corbaserver-3.1.0 is up-to-date. [95%] Processing localization/ros-robot-state-publisher:ros-robot-state-publisher-1.10.3 ===> Bulk building for ros-robot-state-publisher-1.10.3 Binary package for ros-robot-state-publisher-1.10.3 is up-to-date. [95%] Processing graphics/kpp-interface:kpp-interface-2.1.2 ===> Cleaning temporary files for kpp-interface-2.1.2 ===> Bulk building for kpp-interface-2.1.2 => Checking for clear installation => Installing digest-20080510.tgz => Installing tnftp-20130505~ssl.tgz => Required robotpkg package digest>=20080510: digest-20080510 found => Required robotpkg package tnftp>=20091122: tnftp-20130505~ssl found => Required system package gzip: gzip-1.6 found => Required system package pax and tar archivers: pax found => Required system package pkg_install>=20110805.7: pkg_install-20110805.7 found => Dependency digest-20080510 already installed => Installing hpp-corbaserver-3.1.0.tgz => Dependency hpp-model-urdf-3.1.0r1 already installed => Dependency hpp-util-3.1.0 already installed => Required system package kineoworks>=2.07<3: MISSING => Dependency ros-resource-retriever-1.11.5 already installed => Dependency ros-robot-model-1.11.5 already installed => Dependency tnftp-20130505~ssl already installed ERROR: ====================================================================== ERROR: Missing system packages required for kpp-interface-2.1.2: ERROR: ERROR: kineoworks>=2.07<3 ERROR: ERROR: Please use the system package management tool to install these ERROR: dependencies. If a robotpkg version of a dependency is available, ERROR: you can configure robotpkg.conf to use this version instead. ERROR: ERROR: See /local/robotpkg/var/tmp/robotpkg/graphics/kpp-interface/work/sysdep.log for details. ERROR: ====================================================================== make[2]: *** [sys-depends] Error 2 ===> Logging bulk summary for kpp-interface-2.1.2 => Checking leftover files => Creating bulk log files => Logging bulk metadata ===> Cleaning temporary files for kpp-interface-2.1.2 ===> Done bulk for kpp-interface-2.1.2 [96%] Processing simulation/gazebo-ros-pkgs:ros-gazebo-ros-pkgs-2.4.13 ===> Cleaning temporary files for ros-gazebo-ros-pkgs-2.4.13 ===> Bulk building for ros-gazebo-ros-pkgs-2.4.13 => Checking for clear installation => Installing digest-20080510.tgz => Installing tnftp-20130505~ssl.tgz => Required robotpkg package digest>=20080510: digest-20080510 found => Required robotpkg package tnftp>=20130505~ssl: tnftp-20130505~ssl found => Required system package gzip: gzip-1.6 found => Required system package pax and tar archivers: pax found => Required system package pkg_install>=20110805.7: pkg_install-20110805.7 found => Dependency digest-20080510 already installed => Installing ros-angles-1.9.9.tgz => Dependency ros-catkin-0.6.9r2 already installed => Installing ros-cmake-modules-0.3.1.tgz => Installing ros-comm-1.11.20.tgz => Installing ros-common-msgs-1.11.4.tgz => Installing ros-control-0.9.4r2.tgz => Dependency ros-control-toolbox-1.13.2r1 already installed => Installing ros-diagnostics-1.8.5.tgz => Installing ros-driver-common-1.6.8.tgz => Dependency ros-dynamic-reconfigure-1.5.37 already installed => Dependency ros-genmsg-0.5.3 already installed => Installing ros-geometry-1.11.3r1.tgz => Dependency ros-geometry2-0.5.15 already installed => Installing ros-image-common-1.11.3.tgz => Dependency ros-message-generation-0.2.10 already installed => Dependency ros-nodelet-core-1.9.0 already installed => Dependency ros-pluginlib-1.10.1 already installed => Installing ros-robot-model-1.11.5.tgz => Dependency ros-ros-1.11.4 already installed => Dependency ros-std-msgs-0.5.9 already installed => Installing ros-vision-opencv-1.11.12.tgz => Dependency tnftp-20130505~ssl already installed => Building with no option. => Use the GNU C++ compiler: c++-compiler provided by g++>=3 => Use the GNU C compiler: c-compiler provided by gcc>=3 => Use python-2.7: python>=2.5<3.6 provided by python27>=2.7<2.8 => Use ros indigo: ros==indigo ros>=groovy ros>=hydro ros>=hydro ros>=hydro provided by ros-indigo => Required system package boost-headers>=1.34.1: boost-headers-1.58 found => Required system package boostlib-filesystem>=1.34.1: boost-libs-1.58.0 found => Required system package boostlib-iostreams>=1.34.1: boost-libs-1.58.0 found => Required system package boostlib-math>=1.34.1: boost-libs-1.58.0 found => Required system package boostlib-thread>=1.34.1: boost-libs-1.58.0 found => Required system package cmake>=2.8.3: cmake-3.4.3 found => Required system package eigen3>=3.0.0: eigen3-3.2.10 found => Required system package g++>=3: g++-5.3.1 found => Required system package gcc>=3: gcc-5.3.1 found => Required system package googletest: googletest found => Required system package libstdc++: libstdc++ found => Required system package libxml2>=2: libxml2-2.9.3 found => Required system package pkg-config>=0.22: pkg-config-0.28 found => Required system package py27-nose>=0.10: py27-nose-1.3.7 found => Required system package python27>=2.7<2.8: python27-2.7.11 found => Required system package tinyxml>=2: tinyxml-2.6.2 found => Required robotpkg package ros-angles>=1.9: ros-angles-1.9.9 found => Required robotpkg package ros-catkin>=0.6<0.7: ros-catkin-0.6.9r2 found => Required robotpkg package ros-cmake-modules>=0.3: ros-cmake-modules-0.3.1 found => Required robotpkg package ros-comm>=1.11<1.12: ros-comm-1.11.20 found => Required robotpkg package ros-common-msgs>=1.11<1.12: ros-common-msgs-1.11.4 found => Required robotpkg package ros-control>=0.9<0.10: ros-control-0.9.4r2 found => Required robotpkg package ros-control-toolbox>=1.13<1.15: ros-control-toolbox-1.13.2r1 found => Required robotpkg package ros-diagnostics>=1.8<1.9: ros-diagnostics-1.8.5 found => Required robotpkg package ros-driver-common>=1.6: ros-driver-common-1.6.8 found => Required robotpkg package ros-dynamic-reconfigure>=1.5.32: ros-dynamic-reconfigure-1.5.37 found => Required robotpkg package ros-genmsg>=0.5<0.6: ros-genmsg-0.5.3 found => Required robotpkg package ros-geometry>=1.11<1.12: ros-geometry-1.11.3r1 found => Required robotpkg package ros-geometry2>=0.5<0.6: ros-geometry2-0.5.15 found => Required robotpkg package ros-image-common>=1.11<1.12: ros-image-common-1.11.3 found => Required robotpkg package ros-message-generation>=0.2<0.3: ros-message-generation-0.2.10 found => Required robotpkg package ros-nodelet-core>=1.9<1.10: ros-nodelet-core-1.9.0 found => Required robotpkg package ros-pluginlib>=1.10<1.11: ros-pluginlib-1.10.1 found => Required robotpkg package ros-robot-model>=1.11<1.12: ros-robot-model-1.11.5 found => Required robotpkg package ros-ros>=1.11<1.12: ros-ros-1.11.4 found => Required robotpkg package ros-std-msgs>=0.5: ros-std-msgs-0.5.9 found => Required robotpkg package ros-vision-opencv>=1.11<1.12: ros-vision-opencv-1.11.12 found => SHA1 checksums OK => RMD160 checksums OK => Replacing python interpreter path => Running PRE-INSTALL script actions => Running POST-INSTALL script actions => Compiling python files => Adding run-time search paths to pkg-config files robotpkg_create: can't stat `/opt/openrobots/lib/libgazebo_ros_elevator.so' => Please note the following: => Registering installation for ros-gazebo-ros-pkgs-2.4.13 robotpkg_admin: ros-gazebo-ros-pkgs-2.4.13: File `/opt/openrobots/lib/libgazebo_ros_elevator.so' is in +CONTENTS but not on filesystem! robotpkg_create: can't stat `/opt/openrobots/lib/libgazebo_ros_elevator.so' robotpkg_create: lstat failed for file lib/libgazebo_ros_elevator.so: No such file or directory make[2]: *** [pkg-tarup] Error 2 => Marking ros-gazebo-ros-pkgs-2.4.13 as broken ERROR: make: *** [package] Error 2 robotpkg_delete: Couldn't remove /opt/openrobots/lib/libgazebo_ros_elevator.so ===> Logging bulk summary for ros-gazebo-ros-pkgs-2.4.13 => Checking leftover files => Creating bulk log files => Logging bulk metadata ===> Cleaning temporary files for ros-gazebo-ros-pkgs-2.4.13 ===> Done bulk for ros-gazebo-ros-pkgs-2.4.13 [96%] Processing meta-pkgs/ros-robot:ros-robot-1.11 ===> Bulk building for ros-robot-1.11 Binary package for ros-robot-1.11 is up-to-date. [96%] Processing path/hpp-manipulation-urdf:hpp-manipulation-urdf-1.1.0 ===> Bulk building for hpp-manipulation-urdf-1.1.0 Binary package for hpp-manipulation-urdf-1.1.0 is up-to-date. [96%] Processing motion/dynamic-graph-bridge:dynamic-graph-bridge-2.0.9 ===> Bulk building for dynamic-graph-bridge-2.0.9 Binary package for dynamic-graph-bridge-2.0.9 is up-to-date. [97%] Processing graphics/rcpdf:rcpdf-0.2r2 ===> Bulk building for rcpdf-0.2r2 Binary package for rcpdf-0.2r2 is up-to-date. [97%] Processing motion/sot-pattern-generator:sot-pattern-generator-2.9.1 ===> Bulk building for sot-pattern-generator-2.9.1 Binary package for sot-pattern-generator-2.9.1 is up-to-date. [97%] Processing meta-pkgs/ros-desktop:ros-desktop-1.11 ===> Bulk building for ros-desktop-1.11 Binary package for ros-desktop-1.11 is up-to-date. [97%] Processing meta-pkgs/hpp:hpp-20120103 ===> Bulk building for hpp-20120103 Binary package for hpp-20120103 is up-to-date. [98%] Processing path/hpp-wholebody-step-corba:hpp-wholebody-step-corba-3.1.0r1 ===> Bulk building for hpp-wholebody-step-corba-3.1.0r1 Binary package for hpp-wholebody-step-corba-3.1.0r1 is up-to-date. [98%] Processing robots/nao-robot:nao-robot-0.2.2r1 ===> Bulk building for nao-robot-0.2.2r1 Binary package for nao-robot-0.2.2r1 is up-to-date. [98%] Processing graphics/kpp-interfacewalk:kpp-interfacewalk-1.13 ===> Cleaning temporary files for kpp-interfacewalk-1.13 ===> Bulk building for kpp-interfacewalk-1.13 => Checking for clear installation Warning: DOXYGEN_PLIST_DIR in is deprecated. Warning: use DYNAMIC_PLIST_DIRS instead. => Installing digest-20080510.tgz => Installing tnftp-20130505~ssl.tgz Warning: DOXYGEN_PLIST_DIR in is deprecated. Warning: use DYNAMIC_PLIST_DIRS instead. => Required robotpkg package digest>=20080510: digest-20080510 found => Required robotpkg package tnftp>=20091122: tnftp-20130505~ssl found => Required system package gzip: gzip-1.6 found => Required system package pax and tar archivers: pax found => Required system package pkg_install>=20110805.7: pkg_install-20110805.7 found Warning: DOXYGEN_PLIST_DIR in is deprecated. Warning: use DYNAMIC_PLIST_DIRS instead. Warning: DOXYGEN_PLIST_DIR in is deprecated. Warning: use DYNAMIC_PLIST_DIRS instead. => Dependency digest-20080510 already installed => Required robotpkg package hpp-walkplanner>=3.5: N/A => Required robotpkg package kpp-interface>=2.1: N/A => Dependency tnftp-20130505~ssl already installed Warning: DOXYGEN_PLIST_DIR in is deprecated. Warning: use DYNAMIC_PLIST_DIRS instead. Warning: DOXYGEN_PLIST_DIR in is deprecated. Warning: use DYNAMIC_PLIST_DIRS instead. ===> Logging bulk summary for kpp-interfacewalk-1.13 => Checking leftover files => Creating bulk log files => Logging bulk metadata ===> Cleaning temporary files for kpp-interfacewalk-1.13 ===> Done bulk for kpp-interfacewalk-1.13 [98%] Processing motion/sot-romeo:sot-romeo-1.1.0 ===> Bulk building for sot-romeo-1.1.0 Binary package for sot-romeo-1.1.0 is up-to-date. [99%] Processing graphics/hpp-gepetto-viewer:hpp-gepetto-viewer-1.0.0r1 ===> Bulk building for hpp-gepetto-viewer-1.0.0r1 Binary package for hpp-gepetto-viewer-1.0.0r1 is up-to-date. [99%] Processing doc/hpp-tutorial:hpp_tutorial-1.0.0 ===> Bulk building for hpp_tutorial-1.0.0 Binary package for hpp_tutorial-1.0.0 is up-to-date. [99%] Processing graphics/kpp-interfacedisplay:kpp-interfacedisplay-1.0.2 ===> Cleaning temporary files for kpp-interfacedisplay-1.0.2 ===> Bulk building for kpp-interfacedisplay-1.0.2 => Checking for clear installation Warning: DOXYGEN_PLIST_DIR in is deprecated. Warning: use DYNAMIC_PLIST_DIRS instead. => Installing digest-20080510.tgz => Installing tnftp-20130505~ssl.tgz Warning: DOXYGEN_PLIST_DIR in is deprecated. Warning: use DYNAMIC_PLIST_DIRS instead. => Required robotpkg package digest>=20080510: digest-20080510 found => Required robotpkg package tnftp>=20091122: tnftp-20130505~ssl found => Required system package gzip: gzip-1.6 found => Required system package pax and tar archivers: pax found => Required system package pkg_install>=20110805.7: pkg_install-20110805.7 found Warning: DOXYGEN_PLIST_DIR in is deprecated. Warning: use DYNAMIC_PLIST_DIRS instead. Warning: DOXYGEN_PLIST_DIR in is deprecated. Warning: use DYNAMIC_PLIST_DIRS instead. => Dependency digest-20080510 already installed => Installing genom-2.12~doc.tgz => Required robotpkg package kpp-interfacewalk>=1.9: N/A => Installing mkdep-2.7r1.tgz => Dependency pocolibs-2.16 already installed => Dependency tnftp-20130505~ssl already installed Warning: DOXYGEN_PLIST_DIR in is deprecated. Warning: use DYNAMIC_PLIST_DIRS instead. Warning: DOXYGEN_PLIST_DIR in is deprecated. Warning: use DYNAMIC_PLIST_DIRS instead. ===> Logging bulk summary for kpp-interfacedisplay-1.0.2 => Checking leftover files => Creating bulk log files => Logging bulk metadata ===> Cleaning temporary files for kpp-interfacedisplay-1.0.2 ===> Done bulk for kpp-interfacedisplay-1.0.2 [99%] Processing path/hpp-manipulation-corba:hpp-manipulation-corba-1.1.0r1 ===> Bulk building for hpp-manipulation-corba-1.1.0r1 Binary package for hpp-manipulation-corba-1.1.0r1 is up-to-date. ===> Done bulk for rbulk base set --- Bulk started Tue Jul 18 18:21:25 CEST 2017 --- Bulk stopped Tue Jul 18 18:46:32 CEST 2017