robotpkg/wip/talos-gazebo-ros-control bulk build results

Log for talos-gazebo-ros-control-2.6.6 on Ubuntu-17.10-x86_64: build.log (Back)

--- Environment --- _overrides_lang_ros_message_generation_PKGREQD=ros-message-generation>=0.2<0.3 ros-message-generation>=0.2<0.3 ros-message-generation>=0.2<0.3 _override_vars_interfaces_ros_common_msgs=PKGREQD PKGREQD PKGREQD ROS_LANG_DISABLE=geneus:gennodejs LOWER_ARCH=x86_64 OPSYS=Ubuntu _overrides_interfaces_ros_common_msgs_PKGREQD=ros-common-msgs>=1.11<1.12 ros-common-msgs>=1.11<1.12 ros-common-msgs>=1.11<1.12 GZIP_CMD=/bin/gzip OS_KERNEL_VERSION=4.13.0-25-generic _override_vars_pkgtools_pkg_install=PKGREQD PKGREQD PKGREQD LC_TIME=C PKGREPO2DEB=/local/robotpkg/sbin/pkgrepo2deb BULKBASE=/opt/openrobots ROS_PACKAGE_PATH=/opt/openrobots ECHO_N=echo -n _overrides_pkgtools_pkg_install_PKGREQD=pkg_install>=20110805.7 pkg_install>=20110805.7 pkg_install>=20110805.7 OS_VERSION=17.10 _override_vars_devel_boost_headers=PKGREQD PKGREQD PKGREQD ROBOTPKG_BASE=/local/robotpkg PYTHON_LIB=/usr/lib/x86_64-linux-gnu/libpython2.7.so OLDPWD=/local/robotpkg/var/lib/robotpkg/wip/hatponboard-lib _override_vars_pkgtools_tnftp=PKGREQD PKGREQD PYTHON=/usr/bin/python2.7 _overrides_devel_boost_headers_PKGREQD=boost-headers>=1.34.1 boost-headers>=1.34.1 boost-headers>=1.34.1 PKG_DBDIR=/opt/openrobots/var/db/robotpkg hline="$bf======================================================================$rm" _override_vars_devel_ros_catkin=PKGREQD PKGREQD PKGREQD MACHINE_ARCH=x86_64 _overrides_pkgtools_tnftp_PKGREQD=tnftp>=20091122 tnftp>=20091122 _override_vars_wip_talos_ros_control=PKGREQD PKGREQD PKGREQD FC=false _overrides_wip_talos_ros_control_PKGREQD=talos-ros-control>=0.2 talos-ros-control>=0.2 talos-ros-control>=0.2 LC_CTYPE=C NOSETESTS=/usr/bin/nosetests-2.7 _overrides_devel_ros_catkin_PKGREQD=ros-catkin>=0.6<0.7 ros-catkin>=0.6<0.7 ros-catkin>=0.6<0.7 EXPECT_TARGETS=fetch install package LC_MONETARY=C PKG_CONFIG=/usr/bin/pkg-config _override_vars_graphics_ros_robot_model=PKGREQD PKGREQD PKGREQD _override_vars_devel_boost_libs=PKGREQD PKGREQD PKGREQD PKGREQD PKGREQD PKGREQD PKGREQD PKGREQD PKGREQD PKGREQD PKGREQD PKGREQD MAKEFLAGS= --no-print-directory -- PKGREQD.cmdline=talos-gazebo-ros-control-2.6.6 RECURSIVE_PKGPATH=wip/talos-gazebo-ros-control\ tag=Ubuntu-17.10-x86_64 BULK_LOGDIR=/local/robotpkg/var/log/bulk BULKBASE=/opt/openrobots LOCALBASE=/opt/openrobots PKG_DBDIR=/opt/openrobots/var/db/robotpkg EXPECT_TARGETS=fetch\ install\ package _override_vars_pkgtools_digest=PKGREQD PKGREQD PKGREQD CPP=/usr/bin/gcc -E LOWER_OPSYS=ubuntu _overrides_devel_boost_libs_PKGREQD=boost-libs>=1.34.1 boost-libs>=1.34.1 boost-libs>=1.34.1 boost-libs>=1.34.1 boost-libs>=1.34.1 boost-libs>=1.34.1 boost-libs>=1.34.1 boost-libs>=1.34.1 boost-libs>=1.34.1 boost-libs>=1.34.1 boost-libs>=1.34.1 boost-libs>=1.34.1 bf= _overrides_graphics_ros_robot_model_PKGREQD=ros-robot-model>=1.11<1.12 ros-robot-model>=1.11<1.12 ros-robot-model>=1.11<1.12 _override_vars_pkgtools_pkgrepo2deb=PKGREQD PKGREQD _overrides_pkgtools_digest_PKGREQD=digest>=20080510 digest>=20080510 digest>=20080510 _override_vars_lang_ros_message_runtime=PKGREQD PKGREQD PKGREQD GCC=/usr/bin/gcc DIGEST=/opt/openrobots/sbin/robotpkg_digest TAR=/bin/tar LOWER_OS_VERSION=17.10 MACHINE_KERNEL=Linux-4.13.0-25-generic-x86_64 _overrides_pkgtools_pkgrepo2deb_PKGREQD=pkgrepo2deb>=1.2.1 pkgrepo2deb>=1.2.1 OWNER_GID=robots _override_vars_motion_ros_control_toolbox=PKGREQD PKGREQD PKGREQD _override_vars_middleware_ros_comm=PKGREQD PKGREQD PKGREQD _overrides_lang_ros_message_runtime_PKGREQD=ros-message-runtime>=0.4<0.5 ros-message-runtime>=0.4<0.5 ros-message-runtime>=0.4<0.5 PKGTOOLS_VERSION=20110805.7 RECURSIVE_PKGPATH=wip/talos-gazebo-ros-control PKG_CONFIG_PATH=/opt/openrobots/lib/pkgconfig _overrides_motion_ros_control_toolbox_PKGREQD=ros-control-toolbox>=1.13<1.15 ros-control-toolbox>=1.13<1.15 ros-control-toolbox>=1.13<1.15 _overrides_middleware_ros_comm_PKGREQD=ros-comm>=1.11<1.12 ros-comm>=1.11<1.12 ros-comm>=1.11<1.12 GXX=/usr/bin/g++ MAKECONF=/opt/robotpkg/etc/robotpkg.conf _override_vars_archivers_pax=PKGREQD PKGREQD rm= PYTHON_INCLUDE_CONFIG=/usr/include/x86_64-linux-gnu/python2.7/ LC_COLLATE=C OS_KERNEL=Linux ROBOTPKG_TRUSTED_ENV=robotpkg PATH=/usr/local/sbin:/usr/local/bin:/usr/sbin:/usr/bin:/sbin:/bin _overrides_archivers_pax_PKGREQD=pax pax PYTHON27_INCLUDE=/usr/include/python2.7/ CXXCPP=/usr/bin/g++ -E CMAKE=/usr/bin/cmake MAKELEVEL=4 DEB_HOST_MULTIARCH=x86_64-linux-gnu MACHINE_PLATFORM=Ubuntu-17.10-x86_64 ROBOTPKG_DIR=/local/robotpkg/var/lib/robotpkg TNFTP=/opt/openrobots/sbin/tnftp LANG=C MAKEOVERRIDES=PKGREQD.cmdline=talos-gazebo-ros-control-2.6.6 RECURSIVE_PKGPATH=wip/talos-gazebo-ros-control\ tag=Ubuntu-17.10-x86_64 BULK_LOGDIR=/local/robotpkg/var/log/bulk BULKBASE=/opt/openrobots LOCALBASE=/opt/openrobots PKG_DBDIR=/opt/openrobots/var/db/robotpkg EXPECT_TARGETS=fetch\ install\ package LC_MESSAGES=C _override_vars_devel_ros_ros=PKGREQD PKGREQD PKGREQD tag=Ubuntu-17.10-x86_64 CXX=/usr/bin/g++ _overrides_devel_ros_ros_PKGREQD=ros-ros>=1.11<1.12 ros-ros>=1.11<1.12 ros-ros>=1.11<1.12 _override_vars_devel_ros_pluginlib=PKGREQD PKGREQD PKGREQD LOCALBASE=/opt/openrobots _override_vars_pkgtools_pkg_config=PKGREQD PKGREQD PKGREQD OWNER_UID=rbulk BULK_LOGDIR=/local/robotpkg/var/log/bulk _overrides_devel_ros_pluginlib_PKGREQD=ros-pluginlib>=1.10<1.11 ros-pluginlib>=1.10<1.11 ros-pluginlib>=1.10<1.11 _override_vars_middleware_ros_actionlib=PKGREQD PKGREQD PKGREQD ZCAT=/bin/zcat _override_vars_math_ros_geometry=PKGREQD PKGREQD PKGREQD PAX=/bin/pax LOWER_OS_KERNEL=linux _overrides_pkgtools_pkg_config_PKGREQD=pkg-config>=0.22 pkg-config>=0.22 pkg-config>=0.22 _override_vars_math_eigen3=PKGREQD PKGREQD PKGREQD GPG=/usr/bin/gpg --homedir=/opt/robotpkg/etc/gnupg PYTHON27_LIB=/usr/lib/x86_64-linux-gnu/libpython2.7.so _overrides_middleware_ros_actionlib_PKGREQD=ros-actionlib>=1.11<1.12 ros-actionlib>=1.11<1.12 ros-actionlib>=1.11<1.12 _override_vars_wip_talos_gazebo_ros_control=PKGREQD _overrides_math_ros_geometry_PKGREQD=ros-geometry>=1.11<1.12 ros-geometry>=1.11<1.12 ros-geometry>=1.11<1.12 PYTHON_INCLUDE=/usr/include/python2.7/ PWD=/local/robotpkg/var/lib/robotpkg/wip/talos-gazebo-ros-control _override_vars_interfaces_ros_std_msgs=PKGREQD PKGREQD PKGREQD _overrides_math_eigen3_PKGREQD=eigen3>=3.0.0 eigen3>=3.0.0 eigen3>=3.0.0 _override_vars_middleware_ros_genmsg=PKGREQD PKGREQD PKGREQD PYTHON27=/usr/bin/python2.7 _overrides_wip_talos_gazebo_ros_control_PKGREQD=talos-gazebo-ros-control-2.6.6 _ROBOTPKG_NOW=0119174800 _overrides_interfaces_ros_std_msgs_PKGREQD=ros-std-msgs>=0.5 ros-std-msgs>=0.5 ros-std-msgs>=0.5 PYTHONPATH=/usr/lib/python2.7/dist-packages:/opt/openrobots/lib/python2.7/site-packages LC_NUMERIC=C _overrides_middleware_ros_genmsg_PKGREQD=ros-genmsg>=0.5<0.6 ros-genmsg>=0.5<0.6 ros-genmsg>=0.5<0.6 CC=/usr/bin/gcc MFLAGS=--no-print-directory _override_vars_lang_ros_message_generation=PKGREQD PKGREQD PKGREQD PKG_CONFIG_LIBDIR=/usr/lib/x86_64-linux-gnu/pkgconfig:/usr/lib/pkgconfig:/usr/share/pkgconfig NODENAME=fluffy64-ubuntu1710 --- Running set -e; \ cd /local/robotpkg/var/tmp/robotpkg/wip/talos-gazebo-ros-control/work/talos_gazebo_ros_control-2.6.6 && cd /local/robotpkg/var/tmp/robotpkg/wip/talos-gazebo-ros-control/work/talos_gazebo_ros_control-2.6.6 && /usr/bin/env MAKELEVEL= MAKEOVERRIDES= MAKEFLAGS= MFLAGS= 'CPPFLAGS=' 'CFLAGS=-pipe -O3 -DNDEBUG' 'LDFLAGS=-Wl,-rpath,/opt/openrobots/lib' 'CXXFLAGS=-pipe -O3 -DNDEBUG' PREFIX='/opt/openrobots' HOME=/local/robotpkg/var/tmp/robotpkg/wip/talos-gazebo-ros-control/work PATH='/opt/openrobots/bin:/opt/openrobots/sbin:/usr/local/sbin:/usr/local/bin:/usr/sbin:/usr/bin:/sbin:/bin' LD_LIBRARY_PATH='' LOCALBASE=/opt/openrobots PKGMANDIR=man make -j4 -f Makefile all; /usr/bin/cmake -H/local/robotpkg/var/tmp/robotpkg/wip/talos-gazebo-ros-control/work/talos_gazebo_ros_control-2.6.6 -B/local/robotpkg/var/tmp/robotpkg/wip/talos-gazebo-ros-control/work/talos_gazebo_ros_control-2.6.6 --check-build-system CMakeFiles/Makefile.cmake 0 /usr/bin/cmake -E cmake_progress_start /local/robotpkg/var/tmp/robotpkg/wip/talos-gazebo-ros-control/work/talos_gazebo_ros_control-2.6.6/CMakeFiles /local/robotpkg/var/tmp/robotpkg/wip/talos-gazebo-ros-control/work/talos_gazebo_ros_control-2.6.6/CMakeFiles/progress.marks make -f CMakeFiles/Makefile2 all make[1]: Entering directory '/local/robotpkg/var/tmp/robotpkg/wip/talos-gazebo-ros-control/work/talos_gazebo_ros_control-2.6.6' make -f CMakeFiles/talos_gazebo_ros_control.dir/build.make CMakeFiles/talos_gazebo_ros_control.dir/depend make -f CMakeFiles/talos_default_robot_hw_sim.dir/build.make CMakeFiles/talos_default_robot_hw_sim.dir/depend make[2]: Entering directory '/local/robotpkg/var/tmp/robotpkg/wip/talos-gazebo-ros-control/work/talos_gazebo_ros_control-2.6.6' cd /local/robotpkg/var/tmp/robotpkg/wip/talos-gazebo-ros-control/work/talos_gazebo_ros_control-2.6.6 && /usr/bin/cmake -E cmake_depends "Unix Makefiles" /local/robotpkg/var/tmp/robotpkg/wip/talos-gazebo-ros-control/work/talos_gazebo_ros_control-2.6.6 /local/robotpkg/var/tmp/robotpkg/wip/talos-gazebo-ros-control/work/talos_gazebo_ros_control-2.6.6 /local/robotpkg/var/tmp/robotpkg/wip/talos-gazebo-ros-control/work/talos_gazebo_ros_control-2.6.6 /local/robotpkg/var/tmp/robotpkg/wip/talos-gazebo-ros-control/work/talos_gazebo_ros_control-2.6.6 /local/robotpkg/var/tmp/robotpkg/wip/talos-gazebo-ros-control/work/talos_gazebo_ros_control-2.6.6/CMakeFiles/talos_gazebo_ros_control.dir/DependInfo.cmake --color= make[2]: Entering directory '/local/robotpkg/var/tmp/robotpkg/wip/talos-gazebo-ros-control/work/talos_gazebo_ros_control-2.6.6' cd /local/robotpkg/var/tmp/robotpkg/wip/talos-gazebo-ros-control/work/talos_gazebo_ros_control-2.6.6 && /usr/bin/cmake -E cmake_depends "Unix Makefiles" /local/robotpkg/var/tmp/robotpkg/wip/talos-gazebo-ros-control/work/talos_gazebo_ros_control-2.6.6 /local/robotpkg/var/tmp/robotpkg/wip/talos-gazebo-ros-control/work/talos_gazebo_ros_control-2.6.6 /local/robotpkg/var/tmp/robotpkg/wip/talos-gazebo-ros-control/work/talos_gazebo_ros_control-2.6.6 /local/robotpkg/var/tmp/robotpkg/wip/talos-gazebo-ros-control/work/talos_gazebo_ros_control-2.6.6 /local/robotpkg/var/tmp/robotpkg/wip/talos-gazebo-ros-control/work/talos_gazebo_ros_control-2.6.6/CMakeFiles/talos_default_robot_hw_sim.dir/DependInfo.cmake --color= Scanning dependencies of target talos_gazebo_ros_control make[2]: Leaving directory '/local/robotpkg/var/tmp/robotpkg/wip/talos-gazebo-ros-control/work/talos_gazebo_ros_control-2.6.6' make -f CMakeFiles/talos_gazebo_ros_control.dir/build.make CMakeFiles/talos_gazebo_ros_control.dir/build Scanning dependencies of target talos_default_robot_hw_sim make[2]: Leaving directory '/local/robotpkg/var/tmp/robotpkg/wip/talos-gazebo-ros-control/work/talos_gazebo_ros_control-2.6.6' make -f CMakeFiles/talos_default_robot_hw_sim.dir/build.make CMakeFiles/talos_default_robot_hw_sim.dir/build make[2]: Entering directory '/local/robotpkg/var/tmp/robotpkg/wip/talos-gazebo-ros-control/work/talos_gazebo_ros_control-2.6.6' make[2]: Entering directory '/local/robotpkg/var/tmp/robotpkg/wip/talos-gazebo-ros-control/work/talos_gazebo_ros_control-2.6.6' [ 12%] Building CXX object CMakeFiles/talos_default_robot_hw_sim.dir/src/internal/joint_state.cpp.o /usr/bin/g++ -DROSCONSOLE_BACKEND_LOG4CXX -DROS_PACKAGE_NAME="talos_gazebo_ros_control" -Dtalos_default_robot_hw_sim_EXPORTS -I/local/robotpkg/var/tmp/robotpkg/wip/talos-gazebo-ros-control/work/talos_gazebo_ros_control-2.6.6/include -I/opt/openrobots/include -I/usr/include/gazebo-7 -I/usr/include/sdformat-4.2 -I/usr/include/ignition/math2 -I/usr/include/OGRE -I/usr/include/OGRE/Terrain -I/usr/include/OGRE/Paging -pipe -O3 -DNDEBUG -std=c++11 -fPIC -o CMakeFiles/talos_default_robot_hw_sim.dir/src/internal/joint_state.cpp.o -c /local/robotpkg/var/tmp/robotpkg/wip/talos-gazebo-ros-control/work/talos_gazebo_ros_control-2.6.6/src/internal/joint_state.cpp [ 25%] Building CXX object CMakeFiles/talos_default_robot_hw_sim.dir/src/default_robot_hw_sim.cpp.o /usr/bin/g++ -DROSCONSOLE_BACKEND_LOG4CXX -DROS_PACKAGE_NAME="talos_gazebo_ros_control" -Dtalos_default_robot_hw_sim_EXPORTS -I/local/robotpkg/var/tmp/robotpkg/wip/talos-gazebo-ros-control/work/talos_gazebo_ros_control-2.6.6/include -I/opt/openrobots/include -I/usr/include/gazebo-7 -I/usr/include/sdformat-4.2 -I/usr/include/ignition/math2 -I/usr/include/OGRE -I/usr/include/OGRE/Terrain -I/usr/include/OGRE/Paging -pipe -O3 -DNDEBUG -std=c++11 -fPIC -o CMakeFiles/talos_default_robot_hw_sim.dir/src/default_robot_hw_sim.cpp.o -c /local/robotpkg/var/tmp/robotpkg/wip/talos-gazebo-ros-control/work/talos_gazebo_ros_control-2.6.6/src/default_robot_hw_sim.cpp [ 37%] Building CXX object CMakeFiles/talos_gazebo_ros_control.dir/src/gazebo_ros_control_plugin.cpp.o /usr/bin/g++ -DROSCONSOLE_BACKEND_LOG4CXX -DROS_PACKAGE_NAME="talos_gazebo_ros_control" -Dtalos_gazebo_ros_control_EXPORTS -I/local/robotpkg/var/tmp/robotpkg/wip/talos-gazebo-ros-control/work/talos_gazebo_ros_control-2.6.6/include -I/opt/openrobots/include -I/usr/include/gazebo-7 -I/usr/include/sdformat-4.2 -I/usr/include/ignition/math2 -I/usr/include/OGRE -I/usr/include/OGRE/Terrain -I/usr/include/OGRE/Paging -pipe -O3 -DNDEBUG -std=c++11 -fPIC -o CMakeFiles/talos_gazebo_ros_control.dir/src/gazebo_ros_control_plugin.cpp.o -c /local/robotpkg/var/tmp/robotpkg/wip/talos-gazebo-ros-control/work/talos_gazebo_ros_control-2.6.6/src/gazebo_ros_control_plugin.cpp [ 50%] Building CXX object CMakeFiles/talos_default_robot_hw_sim.dir/src/internal/position_joint.cpp.o /usr/bin/g++ -DROSCONSOLE_BACKEND_LOG4CXX -DROS_PACKAGE_NAME="talos_gazebo_ros_control" -Dtalos_default_robot_hw_sim_EXPORTS -I/local/robotpkg/var/tmp/robotpkg/wip/talos-gazebo-ros-control/work/talos_gazebo_ros_control-2.6.6/include -I/opt/openrobots/include -I/usr/include/gazebo-7 -I/usr/include/sdformat-4.2 -I/usr/include/ignition/math2 -I/usr/include/OGRE -I/usr/include/OGRE/Terrain -I/usr/include/OGRE/Paging -pipe -O3 -DNDEBUG -std=c++11 -fPIC -o CMakeFiles/talos_default_robot_hw_sim.dir/src/internal/position_joint.cpp.o -c /local/robotpkg/var/tmp/robotpkg/wip/talos-gazebo-ros-control/work/talos_gazebo_ros_control-2.6.6/src/internal/position_joint.cpp [ 62%] Building CXX object CMakeFiles/talos_default_robot_hw_sim.dir/src/internal/velocity_joint.cpp.o /usr/bin/g++ -DROSCONSOLE_BACKEND_LOG4CXX -DROS_PACKAGE_NAME="talos_gazebo_ros_control" -Dtalos_default_robot_hw_sim_EXPORTS -I/local/robotpkg/var/tmp/robotpkg/wip/talos-gazebo-ros-control/work/talos_gazebo_ros_control-2.6.6/include -I/opt/openrobots/include -I/usr/include/gazebo-7 -I/usr/include/sdformat-4.2 -I/usr/include/ignition/math2 -I/usr/include/OGRE -I/usr/include/OGRE/Terrain -I/usr/include/OGRE/Paging -pipe -O3 -DNDEBUG -std=c++11 -fPIC -o CMakeFiles/talos_default_robot_hw_sim.dir/src/internal/velocity_joint.cpp.o -c /local/robotpkg/var/tmp/robotpkg/wip/talos-gazebo-ros-control/work/talos_gazebo_ros_control-2.6.6/src/internal/velocity_joint.cpp [ 75%] Building CXX object CMakeFiles/talos_default_robot_hw_sim.dir/src/internal/effort_joint.cpp.o /usr/bin/g++ -DROSCONSOLE_BACKEND_LOG4CXX -DROS_PACKAGE_NAME="talos_gazebo_ros_control" -Dtalos_default_robot_hw_sim_EXPORTS -I/local/robotpkg/var/tmp/robotpkg/wip/talos-gazebo-ros-control/work/talos_gazebo_ros_control-2.6.6/include -I/opt/openrobots/include -I/usr/include/gazebo-7 -I/usr/include/sdformat-4.2 -I/usr/include/ignition/math2 -I/usr/include/OGRE -I/usr/include/OGRE/Terrain -I/usr/include/OGRE/Paging -pipe -O3 -DNDEBUG -std=c++11 -fPIC -o CMakeFiles/talos_default_robot_hw_sim.dir/src/internal/effort_joint.cpp.o -c /local/robotpkg/var/tmp/robotpkg/wip/talos-gazebo-ros-control/work/talos_gazebo_ros_control-2.6.6/src/internal/effort_joint.cpp /local/robotpkg/var/tmp/robotpkg/wip/talos-gazebo-ros-control/work/talos_gazebo_ros_control-2.6.6/src/internal/velocity_joint.cpp: In member function 'virtual void talos_gazebo_ros_control::internal::VelocityJoint::init(const string&, const ros::NodeHandle&, gazebo::physics::ModelPtr, const urdf::Model*, talos_hardware_interface::RobotHW*)': /local/robotpkg/var/tmp/robotpkg/wip/talos-gazebo-ros-control/work/talos_gazebo_ros_control-2.6.6/src/internal/velocity_joint.cpp:170:17: error: 'class gazebo::physics::Joint' has no member named 'SetMaxForce'; did you mean 'SetForce'? sim_joint_->SetMaxForce(0, eff_max_); // TODO: Move to start hook ^~~~~~~~~~~ SetForce CMakeFiles/talos_default_robot_hw_sim.dir/build.make:137: recipe for target 'CMakeFiles/talos_default_robot_hw_sim.dir/src/internal/velocity_joint.cpp.o' failed make[2]: *** [CMakeFiles/talos_default_robot_hw_sim.dir/src/internal/velocity_joint.cpp.o] Error 1 make[2]: *** Waiting for unfinished jobs.... [ 87%] Linking CXX shared library /local/robotpkg/var/tmp/robotpkg/wip/talos-gazebo-ros-control/work/stage/lib/libtalos_gazebo_ros_control.so /usr/bin/cmake -E cmake_link_script CMakeFiles/talos_gazebo_ros_control.dir/link.txt --verbose=1 /usr/bin/g++ -fPIC -pipe -O3 -DNDEBUG -std=c++11 -Wl,-rpath,/opt/openrobots/lib -shared -Wl,-soname,libtalos_gazebo_ros_control.so -o /local/robotpkg/var/tmp/robotpkg/wip/talos-gazebo-ros-control/work/stage/lib/libtalos_gazebo_ros_control.so CMakeFiles/talos_gazebo_ros_control.dir/src/gazebo_ros_control_plugin.cpp.o -L/usr/lib/x86_64-linux-gnu/gazebo-7/plugins -Wl,-rpath,/usr/lib/x86_64-linux-gnu/gazebo-7/plugins:/opt/openrobots/lib: /opt/openrobots/lib/libcontrol_toolbox.so /opt/openrobots/lib/libdynamic_reconfigure_config_init_mutex.so /opt/openrobots/lib/libtalos_controller_manager.so /opt/openrobots/lib/librealtime_tools.so /opt/openrobots/lib/libtalos_transmission_interface_parser.so /opt/openrobots/lib/libtalos_transmission_interface_loader.so /opt/openrobots/lib/libtalos_transmission_interface_loader_plugins.so /opt/openrobots/lib/libresource_retriever.so -ltinyxml /opt/openrobots/lib/libclass_loader.so -lPocoFoundation -ldl /opt/openrobots/lib/libroslib.so /opt/openrobots/lib/liburdf.so /opt/openrobots/lib/liburdfdom_sensor.so /opt/openrobots/lib/liburdfdom_model_state.so /opt/openrobots/lib/liburdfdom_model.so /opt/openrobots/lib/liburdfdom_world.so /opt/openrobots/lib/librosconsole_bridge.so /opt/openrobots/lib/libroscpp.so -lboost_signals -lboost_filesystem /opt/openrobots/lib/librosconsole.so /opt/openrobots/lib/librosconsole_log4cxx.so /opt/openrobots/lib/librosconsole_backend_interface.so -llog4cxx -lboost_regex /opt/openrobots/lib/libroscpp_serialization.so /opt/openrobots/lib/librostime.so /opt/openrobots/lib/libxmlrpcpp.so /opt/openrobots/lib/libcpp_common.so -lboost_system -lboost_thread -lboost_chrono -lboost_date_time -lboost_atomic -lpthread -lconsole_bridge -lgazebo -lgazebo_client -lgazebo_gui -lgazebo_sensors -lgazebo_rendering -lgazebo_physics -lgazebo_ode -lgazebo_transport -lgazebo_msgs -lgazebo_util -lgazebo_common -lgazebo_gimpact -lgazebo_opcode -lgazebo_opende_ou -lgazebo_math -lboost_thread -lboost_signals -lboost_system -lboost_filesystem -lboost_program_options -lboost_regex -lboost_iostreams -lboost_date_time -lboost_chrono -lboost_atomic -lpthread -lprotobuf -lpthread -lsdformat -lignition-math2 -lOgreMain -lboost_thread -lboost_date_time -lboost_system -lboost_atomic -lboost_chrono -lboost_chrono -lpthread -lOgreTerrain -lOgrePaging -lignition-math2 -lboost_signals -lboost_filesystem /opt/openrobots/lib/librosconsole.so /opt/openrobots/lib/librosconsole_log4cxx.so /opt/openrobots/lib/librosconsole_backend_interface.so -llog4cxx -lboost_regex /opt/openrobots/lib/libroscpp_serialization.so /opt/openrobots/lib/librostime.so /opt/openrobots/lib/libxmlrpcpp.so /opt/openrobots/lib/libcpp_common.so -lboost_system -lboost_thread -lboost_chrono -lboost_date_time -lboost_atomic -lpthread -lconsole_bridge -lgazebo -lgazebo_client -lgazebo_gui -lgazebo_sensors -lgazebo_rendering -lgazebo_physics -lgazebo_ode -lgazebo_transport -lgazebo_msgs -lgazebo_util -lgazebo_common -lgazebo_gimpact -lgazebo_opcode -lgazebo_opende_ou -lgazebo_math -lboost_program_options -lboost_iostreams -lprotobuf -lpthread -lsdformat -lOgreMain -lOgreTerrain -lOgrePaging make[2]: Leaving directory '/local/robotpkg/var/tmp/robotpkg/wip/talos-gazebo-ros-control/work/talos_gazebo_ros_control-2.6.6' [ 87%] Built target talos_gazebo_ros_control make[2]: Leaving directory '/local/robotpkg/var/tmp/robotpkg/wip/talos-gazebo-ros-control/work/talos_gazebo_ros_control-2.6.6' make[1]: *** [CMakeFiles/talos_default_robot_hw_sim.dir/all] Error 2 CMakeFiles/Makefile2:299: recipe for target 'CMakeFiles/talos_default_robot_hw_sim.dir/all' failed make[1]: Leaving directory '/local/robotpkg/var/tmp/robotpkg/wip/talos-gazebo-ros-control/work/talos_gazebo_ros_control-2.6.6' Makefile:132: recipe for target 'all' failed make: *** [all] Error 2