robotpkg/wip/soth bulk build results

Log for soth-2.0.4 on NetBSD-8.0-x86_64: bulk.log (Back)

=> Checking for clear installation ===> Installing bootstrap dependencies for soth-2.0.4 => Installing /opt/robotpkg/var/lib/robotpkg/packages/bsd/NetBSD-8.0-x86_64/All/digest-20080510.tgz => Installing /opt/robotpkg/var/lib/robotpkg/packages/bsd/NetBSD-8.0-x86_64/All/tnftp-20130505~ssl.tgz ===> Checking bootstrap dependencies for soth-2.0.4 => Required robotpkg package digest>=20080510: digest-20080510 found => Required robotpkg package tnftp>=20091122: tnftp-20130505~ssl found => Required system package gzip: gzip-20150113 found => Required system package pax and tar archivers: pax found => Required system package pkg_install>=20110805.9: pkg_install-20110805.9 found ===> Done bootstrap-depends for soth-2.0.4 ===> Installing full dependencies for soth-2.0.4 => Dependency digest-20080510 already installed => Dependency tnftp-20130505~ssl already installed ===> Checking build options for soth-2.0.4 => Building with no option. ===> Checking alternatives for soth-2.0.4 => Use the GNU C++ compiler: c++-compiler provided by g++>=3 => Use the GNU C compiler: c-compiler provided by gcc>=3 ===> Checking dependencies for soth-2.0.4 => Required system package boost-headers>=1.34.1: boost-headers-1.71 found => Required system package boostlib-filesystem>=1.34.1: boost-libs-1.71 found => Required system package boostlib-iostreams>=1.34.1: boost-libs-1.71 found => Required system package boostlib-math>=1.34.1: boost-libs-1.71 found => Required system package boostlib-thread>=1.34.1: boost-libs-1.71 found => Required system package cmake>=3.1.0: cmake-3.15.3 found => Required system package doxygen>=1.5: doxygen-1.8.15 found => Required system package eigen3>=3.0.0: eigen3-3.3.7 found => Required system package g++>=3: g++-5.5.0 found => Required system package gcc>=3: gcc-5.5.0 found => Required system package libstdc++: libstdc++ found => Required system package pkg-config>=0.22: pkg-config-1.6.0 found ===> Done depends for soth-2.0.4 ===> Extracting for soth-2.0.4 => SHA1 checksums OK => RMD160 checksums OK tar: ustar vol 1, 468 files, 10240000 bytes read, 0 bytes written in 1 secs (10240000 bytes/sec) ===> Configuring for soth-2.0.4 CMake Warning (dev) in CMakeLists.txt: No project() command is present. The top-level CMakeLists.txt file must contain a literal, direct call to the project() command. Add a line of code such as project(ProjectName) near the top of the file, but after cmake_minimum_required(). CMake is pretending there is a "project(Project)" command on the first line. This warning is for project developers. Use -Wno-dev to suppress it. CMake Error at /usr/pkg/share/cmake-3.15/Modules/FindPackageHandleStandardArgs.cmake:137 (message): Could NOT find Boost (missing: signals) (found version "1.71.0") Call Stack (most recent call first): /usr/pkg/share/cmake-3.15/Modules/FindPackageHandleStandardArgs.cmake:378 (_FPHSA_FAILURE_MESSAGE) /usr/pkg/share/cmake-3.15/Modules/FindBoost.cmake:2161 (find_package_handle_standard_args) cmake/boost.cmake:128 (FIND_PACKAGE) CMakeLists.txt:53 (SEARCH_FOR_BOOST) CMake Warning (dev) in /usr/pkg/share/cmake-3.15/Modules/FindBoost.cmake: Policy CMP0011 is not set: Included scripts do automatic cmake_policy PUSH and POP. Run "cmake --help-policy CMP0011" for policy details. Use the cmake_policy command to set the policy and suppress this warning. The included script /usr/pkg/share/cmake-3.15/Modules/FindBoost.cmake affects policy settings. CMake is implying the NO_POLICY_SCOPE option for compatibility, so the effects are applied to the including context. Call Stack (most recent call first): cmake/boost.cmake:128 (FIND_PACKAGE) CMakeLists.txt:53 (SEARCH_FOR_BOOST) This warning is for project developers. Use -Wno-dev to suppress it. An unexpected error occured. The last 10 log lines are shown below. | | affects policy settings. CMake is implying the NO_POLICY_SCOPE option for | compatibility, so the effects are applied to the including context. | Call Stack (most recent call first): | cmake/boost.cmake:128 (FIND_PACKAGE) | CMakeLists.txt:53 (SEARCH_FOR_BOOST) | This warning is for project developers. Use -Wno-dev to suppress it. | | -- Configuring incomplete, errors occurred! | See also "/local/robotpkg/var/tmp/robotpkg/wip/soth/work/soth-2.0.4/CMakeFiles/CMakeOutput.log". For details or bug reports, check the complete log file in: /local/robotpkg/var/tmp/robotpkg/wip/soth/work/configure.log gmake[3]: *** [/local/robotpkg/var/lib/robotpkg/mk/configure/cmake-configure.mk:100: do-configure-cmake] Error 1 gmake[2]: *** [/local/robotpkg/var/lib/robotpkg/mk/pkg/package.mk:42: pkg-check-installed] Error 2 => Marking soth-2.0.4 as broken ERROR: /usr/pkg/bin/gmake: *** [package] Error 2 ===> Deinstalling for soth Removed digest-20080510 Removed tnftp-20130505~ssl