robotpkg/wip/soth bulk build results

Log for soth-2.0.3 on CentOS-7-x86_64: bulk.log (Back)

=> Checking for clear installation ===> Installing bootstrap dependencies for soth-2.0.3 => Installing /opt/robotpkg/var/lib/robotpkg/packages/bsd/CentOS-7-x86_64/All/digest-20080510.tgz => Installing /opt/robotpkg/var/lib/robotpkg/packages/bsd/CentOS-7-x86_64/All/tnftp-20130505~ssl.tgz ===> Checking bootstrap dependencies for soth-2.0.3 => Required robotpkg package digest>=20080510: digest-20080510 found => Required robotpkg package tnftp>=20091122: tnftp-20130505~ssl found => Required system package gzip: gzip-1.5 found => Required system package pax and tar archivers: pax found => Required system package pkg_install>=20110805.9: pkg_install-20110805.9 found ===> Done bootstrap-depends for soth-2.0.3 ===> Installing full dependencies for soth-2.0.3 => Dependency digest-20080510 already installed => Dependency tnftp-20130505~ssl already installed ===> Checking build options for soth-2.0.3 => Building with no option. ===> Checking alternatives for soth-2.0.3 => Use the GNU C++ compiler: c++-compiler provided by g++>=3 => Use the GNU C compiler: c-compiler provided by gcc>=3 ===> Checking dependencies for soth-2.0.3 => Required system package boost-headers>=1.34.1: boost-headers-1.53 found => Required system package boostlib-filesystem>=1.34.1: boost-libs-1.53.0 found => Required system package boostlib-iostreams>=1.34.1: boost-libs-1.53.0 found => Required system package boostlib-math>=1.34.1: boost-libs-1.53.0 found => Required system package boostlib-thread>=1.34.1: boost-libs-1.53.0 found => Required system package cmake>=2.6: cmake-2.8.12.2 found => Required system package doxygen>=1.5: doxygen-1.8.5 found => Required system package eigen3>=3.0.0: eigen3-3.2.5 found => Required system package g++>=3: g++-4.8.5 found => Required system package gcc>=3: gcc-4.8.5 found => Required system package libstdc++: libstdc++ found => Required system package pkg-config>=0.22: pkg-config-0.27.1 found ===> Done depends for soth-2.0.3 ===> Extracting for soth-2.0.3 => SHA1 checksums OK => RMD160 checksums OK ===> Configuring for soth-2.0.3 -- Doxygen rendering: using MathJax backend ===> Building for soth-2.0.3 /local/robotpkg/var/tmp/robotpkg/wip/soth/work/soth-2.0.3/unitTesting/ttrack.cpp: In function 'double soth::operator-(const soth::Now&, const soth::Now&)': /local/robotpkg/var/tmp/robotpkg/wip/soth/work/soth-2.0.3/unitTesting/ttrack.cpp:43:23: warning: conversion to 'double' from 'long int' may alter its value [-Wconversion] (double)(t1.usec-t0.usec+0.0)/1000.0; ^ /local/robotpkg/var/tmp/robotpkg/wip/soth/work/soth-2.0.3/exe/conic_simplification.cpp: In function 'bool checkIn(const MatrixXd&, const Eigen::SubMatrix, 1>&, const Eigen::SubMatrix, 1>&)': /local/robotpkg/var/tmp/robotpkg/wip/soth/work/soth-2.0.3/exe/conic_simplification.cpp:167:23: warning: choosing 'Eigen::ProductBase::operator const PlainObject&() const [with Derived = Eigen::GeneralProduct, Eigen::Matrix, 4>; Lhs = Eigen::Matrix; Rhs = Eigen::Matrix; Eigen::ProductBase::PlainObject = Eigen::Matrix]' over 'Eigen::Matrix<_Scalar, _Rows, _Cols, _Options, _MaxRows, _MaxCols>::Matrix(const Eigen::MatrixBase&) [with OtherDerived = Eigen::GeneralProduct, Eigen::Matrix, 4>; _Scalar = double; int _Rows = -1; int _Cols = 1; int _Options = 0; int _MaxRows = -1; int _MaxCols = 1]' [-Wconversion] VectorXd target = X*x; ^ /local/robotpkg/var/tmp/robotpkg/wip/soth/work/soth-2.0.3/exe/conic_simplification.cpp:167:23: warning: for conversion from 'const Type {aka const Eigen::GeneralProduct, Eigen::Matrix, 4>}' to 'Eigen::VectorXd {aka Eigen::Matrix}' [-Wconversion] /local/robotpkg/var/tmp/robotpkg/wip/soth/work/soth-2.0.3/exe/conic_simplification.cpp:167:23: note: because conversion sequence for the argument is better /local/robotpkg/var/tmp/robotpkg/wip/soth/work/soth-2.0.3/exe/conic_simplification.cpp:167:23: warning: choosing 'Eigen::ProductBase::operator const PlainObject&() const [with Derived = Eigen::GeneralProduct, Eigen::Matrix, 4>; Lhs = Eigen::Matrix; Rhs = Eigen::Matrix; Eigen::ProductBase::PlainObject = Eigen::Matrix]' over 'Eigen::Matrix<_Scalar, _Rows, _Cols, _Options, _MaxRows, _MaxCols>::Matrix(const Eigen::EigenBase&) [with OtherDerived = Eigen::GeneralProduct, Eigen::Matrix, 4>; _Scalar = double; int _Rows = -1; int _Cols = 1; int _Options = 0; int _MaxRows = -1; int _MaxCols = 1]' [-Wconversion] /local/robotpkg/var/tmp/robotpkg/wip/soth/work/soth-2.0.3/exe/conic_simplification.cpp:167:23: warning: for conversion from 'const Type {aka const Eigen::GeneralProduct, Eigen::Matrix, 4>}' to 'Eigen::VectorXd {aka Eigen::Matrix}' [-Wconversion] /local/robotpkg/var/tmp/robotpkg/wip/soth/work/soth-2.0.3/exe/conic_simplification.cpp:167:23: note: because conversion sequence for the argument is better ===> Installing for soth-2.0.3 => Adding run-time search paths to pkg-config files robotpkg_create: can't stat `/opt/openrobots/lib/libsoth.so' robotpkg_create: can't stat `/opt/openrobots/lib/libsoth.so.2.0.3' robotpkg_create: can't stat `/opt/openrobots/lib/pkgconfig/soth.pc' => Registering installation for soth-2.0.3 robotpkg_admin: soth-2.0.3: File `/opt/openrobots/lib/libsoth.so' is in +CONTENTS but not on filesystem! robotpkg_admin: soth-2.0.3: File `/opt/openrobots/lib/libsoth.so.2.0.3' is in +CONTENTS but not on filesystem! robotpkg_admin: soth-2.0.3: File `/opt/openrobots/lib/pkgconfig/soth.pc' is in +CONTENTS but not on filesystem! ===> Done install for soth-2.0.3 ===> Building binary package for soth-2.0.3 robotpkg_create: can't stat `/opt/openrobots/lib/libsoth.so' robotpkg_create: can't stat `/opt/openrobots/lib/libsoth.so.2.0.3' robotpkg_create: can't stat `/opt/openrobots/lib/pkgconfig/soth.pc' Creating package /opt/robotpkg/var/lib/robotpkg/wip/packages/bsd/CentOS-7-x86_64/All/soth-2.0.3 robotpkg_create: lstat failed for file lib/libsoth.so: No such file or directory make[3]: *** [pkg-tarup] Error 2 ERROR: This package cannot be extracted for the following reason: ERROR: ====================================================================== ERROR: A lib64 directory may not exist in LOCALBASE. ERROR: Having a lib64 directory within the robotpkg installation ERROR: tree is not supported. Please remove ERROR: /opt/openrobots/lib64 ERROR: ERROR: ====================================================================== make[3]: *** [cbeh] Error 2 make[2]: *** [package-failed] Error 2 => Marking soth-2.0.3 as broken ERROR: make: *** [package] Error 2 ===> Deinstalling for soth robotpkg_delete: Couldn't remove /opt/openrobots/lib/libsoth.so robotpkg_delete: Couldn't remove /opt/openrobots/lib/libsoth.so.2.0.3 robotpkg_delete: Couldn't remove /opt/openrobots/lib/pkgconfig/soth.pc Removed soth-2.0.3 Removed digest-20080510 Removed tnftp-20130505~ssl