robotpkg/wip/sot-dyninv bulk build results

Log for sot-dyninv-2.0.0r1 on NetBSD-8.0-x86_64: bulk.log (Back)

=> Checking for clear installation ===> Installing bootstrap dependencies for sot-dyninv-2.0.0r1 => Installing /opt/robotpkg/var/lib/robotpkg/packages/bsd/NetBSD-8.0-x86_64/All/digest-20080510.tgz => Installing /opt/robotpkg/var/lib/robotpkg/packages/bsd/NetBSD-8.0-x86_64/All/tnftp-20130505~ssl.tgz ===> Checking bootstrap dependencies for sot-dyninv-2.0.0r1 => Required robotpkg package digest>=20080510: digest-20080510 found => Required robotpkg package tnftp>=20091122: tnftp-20130505~ssl found => Required system package gzip: gzip-20150113 found => Required system package pax and tar archivers: pax found => Required system package pkg_install>=20110805.9: pkg_install-20110805.9 found ===> Done bootstrap-depends for sot-dyninv-2.0.0r1 ===> Installing full dependencies for sot-dyninv-2.0.0r1 => Dependency digest-20080510 already installed => Installing /opt/robotpkg/var/lib/robotpkg/packages/bsd/NetBSD-8.0-x86_64/All/jrl-mal-1.19.6r1~jrl-mathtools.tgz => Installing /opt/robotpkg/var/lib/robotpkg/packages/bsd/NetBSD-8.0-x86_64/All/py27-dynamic-graph-2.5.6r2.tgz => Installing /opt/robotpkg/var/lib/robotpkg/packages/bsd/NetBSD-8.0-x86_64/All/sot-core-2.9.10.tgz => Installing /opt/robotpkg/var/lib/robotpkg/wip/packages/bsd/NetBSD-8.0-x86_64/All/soth-2.0.4.tgz => Dependency tnftp-20130505~ssl already installed ===> Checking build options for sot-dyninv-2.0.0r1 => Building with no option. ===> Checking alternatives for sot-dyninv-2.0.0r1 => Use the GNU C++ compiler: c++-compiler provided by g++>=3 => Use the GNU C compiler: c-compiler provided by gcc>=3 => Use python-2.7: python>=2.5<3.9 provided by python27>=2.7<2.8 ===> Checking dependencies for sot-dyninv-2.0.0r1 => Required system package cmake>=2.6: cmake-3.11.4 found => Required system package doxygen>=1.5: doxygen-1.8.13 found => Required system package g++>=3: g++-5.5.0 found => Required system package gcc>=3: gcc-5.5.0 found => Required system package libstdc++: libstdc++ found => Required system package pkg-config>=0.22: pkg-config-1.4.1 found => Required system package python27>=2.7<2.8: python27-2.7.15 found => Required robotpkg package jrl-mal>=1.8.3: jrl-mal-1.19.6r1~jrl-mathtools found => Required robotpkg package py27-dynamic-graph>=2.5: py27-dynamic-graph-2.5.6r2 found => Required robotpkg package sot-core>=2.5: sot-core-2.9.10 found => Required robotpkg package soth>=2.0.0: soth-2.0.4 found ===> Done depends for sot-dyninv-2.0.0r1 ===> Extracting for sot-dyninv-2.0.0r1 => SHA1 checksums OK => RMD160 checksums OK tar: ustar vol 1, 207 files, 1249280 bytes read, 0 bytes written in 1 secs (1249280 bytes/sec) ===> Configuring for sot-dyninv-2.0.0r1 CMake Error at /usr/pkg/share/cmake-3.11/Modules/FindPkgConfig.cmake:418 (message): A required package was not found Call Stack (most recent call first): /usr/pkg/share/cmake-3.11/Modules/FindPkgConfig.cmake:585 (_pkg_check_modules_internal) cmake/pkg-config.cmake:145 (PKG_CHECK_MODULES) cmake/pkg-config.cmake:227 (ADD_DEPENDENCY) CMakeLists.txt:44 (ADD_REQUIRED_DEPENDENCY) An unexpected error occured. The last 10 log lines are shown below. | A required package was not found | Call Stack (most recent call first): | /usr/pkg/share/cmake-3.11/Modules/FindPkgConfig.cmake:585 (_pkg_check_modules_internal) | cmake/pkg-config.cmake:145 (PKG_CHECK_MODULES) | cmake/pkg-config.cmake:227 (ADD_DEPENDENCY) | CMakeLists.txt:44 (ADD_REQUIRED_DEPENDENCY) | | | -- Configuring incomplete, errors occurred! | See also "/local/robotpkg/var/tmp/robotpkg/wip/sot-dyninv/work/sot-dyninv-2.0.0/CMakeFiles/CMakeOutput.log". For details or bug reports, check the complete log file in: /local/robotpkg/var/tmp/robotpkg/wip/sot-dyninv/work/configure.log gmake[3]: *** [do-configure-cmake] Error 1 gmake[2]: *** [pkg-check-installed] Error 2 ERROR: /usr/pkg/bin/gmake: *** [package] Error 2 /local/robotpkg/var/lib/robotpkg/mk/configure/cmake-configure.mk:100: recipe for target 'do-configure-cmake' failed /local/robotpkg/var/lib/robotpkg/mk/pkg/package.mk:42: recipe for target 'pkg-check-installed' failed => Marking sot-dyninv-2.0.0r1 as broken ===> Deinstalling for sot-dyninv Removed digest-20080510 Removing dependency jrl-mathtools-1.5.2r3 Removing dependency Removing dependency dynamic-graph-2.5.7 Removing dependency py27-dynamic-graph-2.5.6r2 Removing dependency sot-core-2.9.10 Removed jrl-mal-1.19.6r1~jrl-mathtools Removed soth-2.0.4 Removed tnftp-20130505~ssl