robotpkg/wip/ros-swri-string-util bulk build results

Log for ros-swri-string-util-2.3.0 on Debian-9-x86_64: bulk.log (Back)

=> Checking for clear installation ===> Installing bootstrap dependencies for ros-swri-string-util-2.3.0 => Installing /opt/robotpkg/var/lib/robotpkg/packages/bsd/Debian-9-x86_64/All/digest-20080510.tgz => Installing /opt/robotpkg/var/lib/robotpkg/packages/bsd/Debian-9-x86_64/All/tnftp-20130505~ssl.tgz ===> Checking bootstrap dependencies for ros-swri-string-util-2.3.0 => Required robotpkg package digest>=20080510: digest-20080510 found => Required robotpkg package tnftp>=20130505~ssl: tnftp-20130505~ssl found => Required system package gnupg>=1: gnupg-2.1.18 found => Required system package gzip: gzip-1.6 found => Required system package pax and tar archivers: pax found => Required system package pkg_install>=20110805.9: pkg_install-20110805.9 found => Required system package pkgrepo2deb>=1.8: pkgrepo2deb-1.8 found ===> Done bootstrap-depends for ros-swri-string-util-2.3.0 ===> Installing full dependencies for ros-swri-string-util-2.3.0 => Dependency digest-20080510 already installed => Installing /opt/robotpkg/var/lib/robotpkg/packages/bsd/Debian-9-x86_64/All/py27-catkin-pkg-0.4.8.tgz => Installing /opt/robotpkg/var/lib/robotpkg/packages/bsd/Debian-9-x86_64/All/py27-ros-catkin-0.7.16r1.tgz To use ros, the following environment variables must contain those values: ROS_MASTER_URI http://localhost:11311 ROS_PACKAGE_PATH /opt/openrobots/share PYTHONPATH /opt/openrobots/lib/python2.7/site-packages PATH /opt/openrobots/bin As an alternative to the above configuration, commands can be executed by using the `env.sh' wrapper. For instance, roscore can be started like so: /opt/openrobots/etc/ros/env.sh roscore In Bourne shell scripts, the following file can be sourced instead: /opt/openrobots/etc/ros/setup.sh => Dependency tnftp-20130505~ssl already installed ===> Checking build options for ros-swri-string-util-2.3.0 => Building with no option. ===> Checking alternatives for ros-swri-string-util-2.3.0 => Use the GNU C++ compiler: c++-compiler provided by g++>=3 => Use the GNU C compiler: c-compiler provided by gcc>=3 => Use python-2.7: python>=2.5<3.9 provided by python27>=2.7<2.8 => Use ros melodic: ros==melodic provided by ros-melodic ===> Checking dependencies for ros-swri-string-util-2.3.0 => Required system package cmake>=2.8.3: cmake-3.7.2 found => Required system package g++>=3: g++-6.3.0 found => Required system package gcc>=3: gcc-6.3.0 found => Required system package googletest: googletest found => Required system package libstdc++: libstdc++ found => Required system package pkg-config>=0.22: pkg-config-0.29 found => Required system package py27-empy>=3: py27-empy-3.3.2 found => Required system package py27-nose>=0.10: py27-nose-1.3.7 found => Required system package py27-pyparsing>=1: py27-pyparsing-2.1.10 found => Required system package python27>=2.7<2.8: python27-2.7.13 found => Required robotpkg package py27-catkin-pkg>=0.2: py27-catkin-pkg-0.4.8 found => Required robotpkg package py27-ros-catkin>=0.7<0.8: py27-ros-catkin-0.7.16r1 found WARNING: Using py27-catkin-pkg-0.4.8 in /opt/openrobots WARNING: The following packages may interfere with the build because they WARNING: are located in paths used by other dependencies: WARNING: py-catkin-pkg-0.4.20 in /usr ===> Done depends for ros-swri-string-util-2.3.0 ===> Extracting for ros-swri-string-util-2.3.0 => SHA1 checksums OK => RMD160 checksums OK ===> Configuring for ros-swri-string-util-2.3.0 CMake Error at CMakeLists.txt:19 (find_package): By not providing "Findrostest.cmake" in CMAKE_MODULE_PATH this project has asked CMake to find a package configuration file provided by "rostest", but CMake did not find one. Could not find a package configuration file provided by "rostest" with any of the following names: rostestConfig.cmake rostest-config.cmake Add the installation prefix of "rostest" to CMAKE_PREFIX_PATH or set "rostest_DIR" to a directory containing one of the above files. If "rostest" provides a separate development package or SDK, be sure it has been installed. An unexpected error occured. The last 10 log lines are shown below. | | Add the installation prefix of "rostest" to CMAKE_PREFIX_PATH or set | "rostest_DIR" to a directory containing one of the above files. If | "rostest" provides a separate development package or SDK, be sure it has | been installed. | | | -- Configuring incomplete, errors occurred! | See also "/local/robotpkg/var/tmp/robotpkg/wip/ros-swri-string-util/work/marti_common-2.3.0/swri_string_util/CMakeFiles/CMakeOutput.log". | See also "/local/robotpkg/var/tmp/robotpkg/wip/ros-swri-string-util/work/marti_common-2.3.0/swri_string_util/CMakeFiles/CMakeError.log". For details or bug reports, check the complete log file in: /local/robotpkg/var/tmp/robotpkg/wip/ros-swri-string-util/work/configure.log /local/robotpkg/var/lib/robotpkg/mk/configure/cmake-configure.mk:100: recipe for target 'do-configure-cmake' failed /local/robotpkg/var/lib/robotpkg/mk/pkg/package.mk:42: recipe for target 'pkg-check-installed' failed => Marking ros-swri-string-util-2.3.0 as broken make[3]: *** [do-configure-cmake] Error 1 make[2]: *** [pkg-check-installed] Error 2 ERROR: make: *** [package] Error 2 ===> Deinstalling for ros-swri-string-util Removed digest-20080510 Removing dependency py27-ros-catkin-0.7.16r1 Removed py27-catkin-pkg-0.4.8 Removed tnftp-20130505~ssl