robotpkg/wip/roralink bulk build results

Log for roralink-0.3.0-Source on Debian-8-x86_64: bulk.log (Back)

=> Checking for clear installation ===> Installing bootstrap dependencies for roralink-0.3.0-Source => Installing /opt/robotpkg/var/lib/robotpkg/packages/bsd/Debian-8-x86_64/All/digest-20080510.tgz => Installing /opt/robotpkg/var/lib/robotpkg/packages/bsd/Debian-8-x86_64/All/tnftp-20130505~ssl.tgz ===> Checking bootstrap dependencies for roralink-0.3.0-Source => Required robotpkg package digest>=20080510: digest-20080510 found => Required robotpkg package tnftp>=20091122: tnftp-20130505~ssl found => Required system package gnupg>=1: gnupg-1.4.18 found => Required system package gzip: gzip-1.6 found => Required system package pax and tar archivers: pax found => Required system package pkg_install>=20110805.9: pkg_install-20110805.9 found => Required system package pkgrepo2deb>=1.8: pkgrepo2deb-1.8 found ===> Done bootstrap-depends for roralink-0.3.0-Source ===> Installing full dependencies for roralink-0.3.0-Source => Dependency digest-20080510 already installed => Dependency tnftp-20130505~ssl already installed ===> Checking build options for roralink-0.3.0-Source => Building with no option. ===> Checking alternatives for roralink-0.3.0-Source => Use the GNU C compiler: c-compiler provided by gcc>=3 ===> Checking dependencies for roralink-0.3.0-Source => Required system package cmake>=2.6: cmake-3.0.2 found => Required system package gcc>=3: gcc-4.9.2 found ===> Done depends for roralink-0.3.0-Source ===> Fetching for roralink-0.3.0-Source => Fetching roralink-0.3.0-Source.tar.gz => Total size: 12237 bytes /opt/openrobots/sbin/tnftp -o roralink-0.3.0-Source.tar.gz ftp://ftp.openrobots.org/pub/openrobots/roralink/roralink-0.3.0-Source.tar.gz Can't open roralink-0.3.0-Source.tar.gz: No such file or directory fetch: Unable to fetch expected file roralink-0.3.0-Source.tar.gz /opt/openrobots/sbin/tnftp -o roralink-0.3.0-Source.tar.gz http://www.openrobots.org/distfiles/roralink/roralink-0.3.0-Source.tar.gz tnftp: Can't connect to `2001:660:6602:2::93:80': Connection timed out tnftp: Error retrieving file `404 Not Found' fetch: Unable to fetch expected file roralink-0.3.0-Source.tar.gz => Total size: 12237 bytes /opt/openrobots/sbin/tnftp -R -o roralink-0.3.0-Source.tar.gz http://robotpkg.openrobots.org/distfiles/roralink-0.3.0-Source.tar.gz tnftp: Error retrieving file `404 Not Found' fetch: Unable to fetch expected file roralink-0.3.0-Source.tar.gz ERROR: ====================================================================== ERROR: Could not fetch the following file: ERROR: roralink-0.3.0-Source.tar.gz ERROR: ERROR: Please retrieve this file manually into: ERROR: /opt/robotpkg/var/lib/robotpkg/distfiles/ /local/robotpkg/var/lib/robotpkg/mk/fetch/fetch.mk:184: recipe for target '/opt/robotpkg/var/lib/robotpkg/distfiles/roralink-0.3.0-Source.tar.gz' failed ERROR: ====================================================================== make[3]: *** [/opt/robotpkg/var/lib/robotpkg/distfiles/roralink-0.3.0-Source.tar.gz] Error 1 make[2]: *** [pkg-check-installed] Error 2 /local/robotpkg/var/lib/robotpkg/mk/pkg/package.mk:42: recipe for target 'pkg-check-installed' failed => Marking roralink-0.3.0-Source as broken ERROR: make: *** [package] Error 2 ===> Deinstalling for roralink-0.3.0 Removed digest-20080510 Removed tnftp-20130505~ssl