robotpkg/wip/qgv bulk build results

Log for qt5-qgv-1.1.0 on NetBSD-8.0-x86_64: bulk.log (Back)

=> Checking for clear installation ===> Installing bootstrap dependencies for qt5-qgv-1.1.0 => Installing /opt/robotpkg/var/lib/robotpkg/packages/bsd/NetBSD-8.0-x86_64/All/digest-20080510.tgz => Installing /opt/robotpkg/var/lib/robotpkg/packages/bsd/NetBSD-8.0-x86_64/All/tnftp-20130505~ssl.tgz ===> Checking bootstrap dependencies for qt5-qgv-1.1.0 => Required robotpkg package digest>=20080510: digest-20080510 found => Required robotpkg package tnftp>=20091122: tnftp-20130505~ssl found => Required system package gzip: gzip-20150113 found => Required system package pax and tar archivers: pax found => Required system package pkg_install>=20110805.9: pkg_install-20110805.9 found ===> Done bootstrap-depends for qt5-qgv-1.1.0 ===> Installing full dependencies for qt5-qgv-1.1.0 => Dependency digest-20080510 already installed => Dependency tnftp-20130505~ssl already installed ===> Checking build options for qt5-qgv-1.1.0 => Building with no option. ===> Checking alternatives for qt5-qgv-1.1.0 => Use the GNU C++ compiler: c++-compiler provided by g++>=3 => Use the GNU C compiler: c-compiler provided by gcc>=3 => Use qt-5: qt>=4 provided by ===> Checking dependencies for qt5-qgv-1.1.0 => Required system package cmake>=2.6: cmake-3.11.4 found => Required system package g++>=3: g++-5.5.0 found => Required system package gcc>=3: gcc-5.5.0 found => Required system package graphviz>=2: graphviz-2.40.1 found => Required system package libstdc++: libstdc++ found => Required system package pkg-config>=0.22: pkg-config-1.4.1 found => Required system package qt5-qtbase>=5<6: qt5-qtbase-5.11.1 found ===> Done depends for qt5-qgv-1.1.0 ===> Extracting for qt5-qgv-1.1.0 => SHA1 checksums OK => RMD160 checksums OK tar: ustar vol 1, 419 files, 2611200 bytes read, 0 bytes written in 1 secs (2611200 bytes/sec) ===> Configuring for qt5-qgv-1.1.0 CMake Deprecation Warning at CMakeLists.txt:64 (CMAKE_POLICY): The OLD behavior for policy CMP0020 will be removed from a future version of CMake. The cmake-policies(7) manual explains that the OLD behaviors of all policies are deprecated and that a policy should be set to OLD only under specific short-term circumstances. Projects should be ported to the NEW behavior and not rely on setting a policy to OLD. CMake Error: The following variables are used in this project, but they are set to NOTFOUND. Please set them or make sure they are set and tested correctly in the CMake files: GRAPHVIZ_INCLUDE_DIR (ADVANCED) used as include directory in directory /local/robotpkg/var/tmp/robotpkg/wip/qgv/work/qgv-1.1.0/QGVCore used as include directory in directory /local/robotpkg/var/tmp/robotpkg/wip/qgv/work/qgv-1.1.0/QGVCore used as include directory in directory /local/robotpkg/var/tmp/robotpkg/wip/qgv/work/qgv-1.1.0/QGVCore used as include directory in directory /local/robotpkg/var/tmp/robotpkg/wip/qgv/work/qgv-1.1.0/QGVCore used as include directory in directory /local/robotpkg/var/tmp/robotpkg/wip/qgv/work/qgv-1.1.0/QGVCore used as include directory in directory /local/robotpkg/var/tmp/robotpkg/wip/qgv/work/qgv-1.1.0/QGVCore used as include directory in directory /local/robotpkg/var/tmp/robotpkg/wip/qgv/work/qgv-1.1.0/QGVCore used as include directory in directory /local/robotpkg/var/tmp/robotpkg/wip/qgv/work/qgv-1.1.0/QGVCore An unexpected error occured. The last 10 log lines are shown below. | GRAPHVIZ_INCLUDE_DIR (ADVANCED) | used as include directory in directory /local/robotpkg/var/tmp/robotpkg/wip/qgv/work/qgv-1.1.0/QGVCore | used as include directory in directory /local/robotpkg/var/tmp/robotpkg/wip/qgv/work/qgv-1.1.0/QGVCore | used as include directory in directory /local/robotpkg/var/tmp/robotpkg/wip/qgv/work/qgv-1.1.0/QGVCore | used as include directory in directory /local/robotpkg/var/tmp/robotpkg/wip/qgv/work/qgv-1.1.0/QGVCore | used as include directory in directory /local/robotpkg/var/tmp/robotpkg/wip/qgv/work/qgv-1.1.0/QGVCore | used as include directory in directory /local/robotpkg/var/tmp/robotpkg/wip/qgv/work/qgv-1.1.0/QGVCore | used as include directory in directory /local/robotpkg/var/tmp/robotpkg/wip/qgv/work/qgv-1.1.0/QGVCore | used as include directory in directory /local/robotpkg/var/tmp/robotpkg/wip/qgv/work/qgv-1.1.0/QGVCore | For details or bug reports, check the complete log file in: /local/robotpkg/var/tmp/robotpkg/wip/qgv/work/configure.log gmake[3]: *** [do-configure-cmake] Error 1 /local/robotpkg/var/lib/robotpkg/mk/configure/cmake-configure.mk:100: recipe for target 'do-configure-cmake' failed gmake[2]: *** [pkg-check-installed] Error 2 /local/robotpkg/var/lib/robotpkg/mk/pkg/package.mk:42: recipe for target 'pkg-check-installed' failed => Marking qt5-qgv-1.1.0 as broken ERROR: /usr/pkg/bin/gmake: *** [package] Error 2 ===> Deinstalling for qt5-qgv Removed digest-20080510 Removed tnftp-20130505~ssl