robotpkg/wip/py-tsid bulk build results

Log for py27-tsid-1.2.1r1 on NetBSD-8.0-x86_64: bulk.log (Back)

=> Checking for clear installation ===> Installing bootstrap dependencies for py27-tsid-1.2.1r1 => Installing /opt/robotpkg/var/lib/robotpkg/packages/bsd/NetBSD-8.0-x86_64/All/digest-20080510.tgz => Installing /opt/robotpkg/var/lib/robotpkg/packages/bsd/NetBSD-8.0-x86_64/All/tnftp-20130505~ssl.tgz ===> Checking bootstrap dependencies for py27-tsid-1.2.1r1 => Required robotpkg package digest>=20080510: digest-20080510 found => Required robotpkg package tnftp>=20091122: tnftp-20130505~ssl found => Required system package gzip: gzip-20150113 found => Required system package patch>=2.0: patch-2.0128 found => Required system package pax and tar archivers: pax found => Required system package pkg_install>=20110805.9: pkg_install-20110805.9 found ===> Done bootstrap-depends for py27-tsid-1.2.1r1 ===> Installing full dependencies for py27-tsid-1.2.1r1 => Dependency digest-20080510 already installed => Installing /opt/robotpkg/var/lib/robotpkg/packages/bsd/NetBSD-8.0-x86_64/All/hpp-fcl-1.2.2~doc.tgz => Dependency octomap-1.9.0 already installed => Installing /opt/robotpkg/var/lib/robotpkg/packages/bsd/NetBSD-8.0-x86_64/All/pinocchio-2.2.2.tgz => Installing /opt/robotpkg/var/lib/robotpkg/packages/bsd/NetBSD-8.0-x86_64/All/py27-eigenpy-1.6.12.tgz => Installing /opt/robotpkg/var/lib/robotpkg/packages/bsd/NetBSD-8.0-x86_64/All/py27-pinocchio-2.2.2.tgz => Dependency tnftp-20130505~ssl already installed => Installing /opt/robotpkg/var/lib/robotpkg/wip/packages/bsd/NetBSD-8.0-x86_64/All/tsid-1.2.0.tgz => Dependency urdfdom-0.3.0r2 already installed ===> Checking build options for py27-tsid-1.2.1r1 => Building with no option. ===> Checking alternatives for py27-tsid-1.2.1r1 => Use the GNU C++ compiler: c++-compiler provided by g++>=3 => Use the GNU C compiler: c-compiler provided by gcc>=3 => Use python-2.7: python>=2.5<3.9 provided by python27>=2.7<2.8 ===> Checking dependencies for py27-tsid-1.2.1r1 => Required system package boost-headers>=1.34.1: boost-headers-1.71 found => Required system package boostlib-python>=1.34.1: boost-libs-1.71 found => Required system package boostlib-unit_test_framework>=1.34.1: boost-libs-1.71 found => Required system package cmake>=2.6: cmake-3.15.3 found => Required system package doxygen>=1.5: doxygen-1.8.15 found => Required system package eigen3>=3.0.0: eigen3-3.3.7 found => Required system package g++>=3: g++-5.5.0 found => Required system package gcc>=3: gcc-5.5.0 found => Required system package libstdc++: libstdc++ found => Required system package pkg-config>=0.22: pkg-config-1.6.0 found => Required system package py27-numpy>=1: py27-numpy-1.16.4 found => Required system package python27>=2.7<2.8: python27-2.7.16 found => Required system package tinyxml>=2: tinyxml-2.6.2 found => Required robotpkg package hpp-fcl>=1.2.1: hpp-fcl-1.2.2~doc found => Required robotpkg package octomap>=1.6.0: octomap-1.9.0 found => Required robotpkg package pinocchio>=2.0.0<3.0.0: pinocchio-2.2.2 found => Required robotpkg package py27-eigenpy>=1.6.12: py27-eigenpy-1.6.12 found => Required robotpkg package py27-pinocchio>=2.0.0<3.0.0: py27-pinocchio-2.2.2 found => Required robotpkg package tsid>=1.0.0: tsid-1.2.0 found => Required robotpkg package urdfdom>=0.2.8: urdfdom-0.3.0r2 found ===> Done depends for py27-tsid-1.2.1r1 ===> Extracting for py27-tsid-1.2.1r1 => SHA1 checksums OK => RMD160 checksums OK tar: ustar vol 1, 704 files, 40263680 bytes read, 0 bytes written in 9 secs (4473742 bytes/sec) ===> Patching for py27-tsid-1.2.1r1 => Applying robotpkg patches for py27-tsid-1.2.1r1 ===> Configuring for py27-tsid-1.2.1r1 CMake Warning (dev) in CMakeLists.txt: No project() command is present. The top-level CMakeLists.txt file must contain a literal, direct call to the project() command. Add a line of code such as project(ProjectName) near the top of the file, but after cmake_minimum_required(). CMake is pretending there is a "project(Project)" command on the first line. This warning is for project developers. Use -Wno-dev to suppress it. CMake Error at /usr/pkg/share/cmake-3.15/Modules/FindPkgConfig.cmake:458 (message): A required package was not found Call Stack (most recent call first): /usr/pkg/share/cmake-3.15/Modules/FindPkgConfig.cmake:637 (_pkg_check_modules_internal) cmake/pkg-config.cmake:298 (PKG_CHECK_MODULES) cmake/pkg-config.cmake:510 (ADD_DEPENDENCY) CMakeLists.txt:82 (ADD_REQUIRED_DEPENDENCY) An unexpected error occured. The last 10 log lines are shown below. | A required package was not found | Call Stack (most recent call first): | /usr/pkg/share/cmake-3.15/Modules/FindPkgConfig.cmake:637 (_pkg_check_modules_internal) | cmake/pkg-config.cmake:298 (PKG_CHECK_MODULES) | cmake/pkg-config.cmake:510 (ADD_DEPENDENCY) | CMakeLists.txt:82 (ADD_REQUIRED_DEPENDENCY) | | | -- Configuring incomplete, errors occurred! | See also "/local/robotpkg/var/tmp/robotpkg/wip/py-tsid/work/tsid-1.2.1/CMakeFiles/CMakeOutput.log". For details or bug reports, check the complete log file in: /local/robotpkg/var/tmp/robotpkg/wip/py-tsid/work/configure.log gmake[3]: *** [/local/robotpkg/var/lib/robotpkg/mk/configure/cmake-configure.mk:100: do-configure-cmake] Error 1 gmake[2]: *** [/local/robotpkg/var/lib/robotpkg/mk/pkg/package.mk:42: pkg-check-installed] Error 2 => Marking py27-tsid-1.2.1r1 as broken ERROR: /usr/pkg/bin/gmake: *** [package] Error 2 ===> Deinstalling for py27-tsid Removed digest-20080510 Removing dependency assimp-3.0.1270 Removing dependency libccd-2.0 Removing dependency octomap-1.9.0 Removing dependency Removing dependency pinocchio-2.2.2 Removing dependency tsid-1.2.0 Removing dependency py27-pinocchio-2.2.2 Removed hpp-fcl-1.2.2~doc Removed tnftp-20130505~ssl