robotpkg/wip/py-sot-application bulk build results

py27-sot-application-1.0.0r2 (category scripts or summary)

Platform Status Date Time
Start Total
CentOS-7-x86_64?---
Debian-8-x86_64?---
Debian-9-x86_64?---
Fedora-27-x86_64OK2018/03/ 714:40:5200:00:59
Fedora-28-x86_64?---
NetBSD-8.0-x86_64?---
Ubuntu-14.04-x86_64OK2018/03/ 714:25:1600:01:22
Ubuntu-16.04-x86_64OK2018/03/ 714:26:2300:00:48
Ubuntu-18.04-x86_64?---
Ubuntu-19.04-x86_64?---

py34-sot-application-1.0.0r2 (category scripts or summary)

Platform Status Date Time Log files
Start Total brokenbuildbulkcmakeconfigureextractinstallplist
CentOS-7-x86_64?---
Debian-8-x86_64?---
Debian-9-x86_64?---
Fedora-27-x86_64?---
Fedora-28-x86_64?---
NetBSD-8.0-x86_64?---
Ubuntu-14.04-x86_64Broken2018/03/ 715:43:5100:00:41
make: *** [package] Error 2
ViewViewViewViewViewViewView
Ubuntu-16.04-x86_64?---
Ubuntu-18.04-x86_64?---
Ubuntu-19.04-x86_64?---

py35-sot-application-1.0.0r2 (category scripts or summary)

Platform Status Date Time Log files
Start Total brokenbuildbulkcmakeconfigureextractinstallplist
CentOS-7-x86_64?---
Debian-8-x86_64?---
Debian-9-x86_64?---
Fedora-27-x86_64?---
Fedora-28-x86_64?---
NetBSD-8.0-x86_64?---
Ubuntu-14.04-x86_64?---
Ubuntu-16.04-x86_64Broken2018/03/ 715:10:4200:00:24
make: *** [package] Error 2
ViewViewViewViewViewViewView
Ubuntu-18.04-x86_64?---
Ubuntu-19.04-x86_64?---

py36-sot-application-1.0.0r2 (category scripts or summary)

Platform Status Date Time Log files
Start Total brokenbuildbulkcmakeconfigureextractinstallplist
CentOS-7-x86_64?---
Debian-8-x86_64?---
Debian-9-x86_64?---
Fedora-27-x86_64Broken2018/03/ 715:17:5200:00:44
make: *** [package] Error 2
ViewViewViewViewViewViewView
Fedora-28-x86_64?---
NetBSD-8.0-x86_64?---
Ubuntu-14.04-x86_64?---
Ubuntu-16.04-x86_64?---
Ubuntu-18.04-x86_64?---
Ubuntu-19.04-x86_64?---