robotpkg/wip/py-pal bulk build results

Log for pal-python-0.9.14os1 on Fedora-27-x86_64: bulk.log (Back)

=> Checking for clear installation ===> Installing bootstrap dependencies for pal-python-0.9.14os1 => Installing /opt/robotpkg/var/lib/robotpkg/packages/bsd/Fedora-27-x86_64/All/digest-20080510.tgz => Installing /opt/robotpkg/var/lib/robotpkg/packages/bsd/Fedora-27-x86_64/All/tnftp-20130505~ssl.tgz ===> Checking bootstrap dependencies for pal-python-0.9.14os1 => Required robotpkg package digest>=20080510: digest-20080510 found => Required robotpkg package tnftp>=20130505~ssl: tnftp-20130505~ssl found => Required system package gzip: gzip-1.8 found => Required system package pax and tar archivers: pax found => Required system package pkg_install>=20110805.9: pkg_install-20110805.9 found ===> Done bootstrap-depends for pal-python-0.9.14os1 ===> Installing full dependencies for pal-python-0.9.14os1 => Dependency digest-20080510 already installed => Dependency tnftp-20130505~ssl already installed ===> Checking alternatives for pal-python-0.9.14os1 => Use python-2.7: python>=2.5<3.9 provided by python27>=2.7<2.8 ===> Checking dependencies for pal-python-0.9.14os1 => Required system package python27>=2.7<2.8: python27-2.7.15 found ===> Done depends for pal-python-0.9.14os1 ===> Extracting for pal-python-0.9.14os1 => SHA1 checksums OK => RMD160 checksums OK ===> Configuring for pal-python-0.9.14os1 ===> Building for pal-python-0.9.14os1 Traceback (most recent call last): File "setup.py", line 4, in from catkin_pkg.python_setup import generate_distutils_setup ImportError: No module named catkin_pkg.python_setup An unexpected error occured. The last 10 log lines are shown below. | CPP=false | LC_TIME=C | _=/usr/bin/env | --- | Running set -e; | cd /local/robotpkg/var/tmp/robotpkg/wip/py-pal/work/pal_python-0.9.14os1 && cd /local/robotpkg/var/tmp/robotpkg/wip/py-pal/work/pal_python-0.9.14os1 && /usr/bin/env MAKELEVEL= MAKEOVERRIDES= MAKEFLAGS= MFLAGS= PREFIX='/opt/openrobots' HOME=/local/robotpkg/var/tmp/robotpkg/wip/py-pal/work PATH='/opt/openrobots/sbin:/usr/local/sbin:/usr/local/bin:/usr/sbin:/usr/bin' LD_LIBRARY_PATH='' LOCALBASE=/opt/openrobots PKGMANDIR=man /usr/bin/python2.7 setup.py build ; | Traceback (most recent call last): | File "setup.py", line 4, in | from catkin_pkg.python_setup import generate_distutils_setup | ImportError: No module named catkin_pkg.python_setup For details or bug reports, check the complete log file in: /local/robotpkg/var/tmp/robotpkg/wip/py-pal/work/build.log make[3]: *** [/local/robotpkg/var/lib/robotpkg/mk/build/build.mk:199: do-build] Error 1 make[2]: *** [/local/robotpkg/var/lib/robotpkg/mk/pkg/package.mk:42: pkg-check-installed] Error 2 => Marking pal-python-0.9.14os1 as broken ERROR: make: *** [package] Error 2 ===> Deinstalling for pal-python Removed digest-20080510 Removed tnftp-20130505~ssl