robotpkg/wip/py-mavlink bulk build results

Log for py36-mavlink-1.1.62 on NetBSD-8.0-x86_64: bulk.log (Back)

=> Checking for clear installation ===> Installing bootstrap dependencies for py36-mavlink-1.1.62 => Installing /opt/robotpkg/var/lib/robotpkg/packages/bsd/NetBSD-8.0-x86_64/All/digest-20080510.tgz => Installing /opt/robotpkg/var/lib/robotpkg/packages/bsd/NetBSD-8.0-x86_64/All/tnftp-20130505~ssl.tgz ===> Checking bootstrap dependencies for py36-mavlink-1.1.62 => Required robotpkg package digest>=20080510: digest-20080510 found => Required robotpkg package tnftp>=20091122: tnftp-20130505~ssl found => Required system package git>=1.6: git-2.23.0 found => Required system package gzip: gzip-20150113 found => Required system package pax and tar archivers: pax found => Required system package pkg_install>=20110805.9: pkg_install-20110805.9 found ===> Done bootstrap-depends for py36-mavlink-1.1.62 ===> Installing full dependencies for py36-mavlink-1.1.62 => Dependency digest-20080510 already installed => Dependency tnftp-20130505~ssl already installed ===> Checking build options for py36-mavlink-1.1.62 => Building with no option. ===> Checking alternatives for py36-mavlink-1.1.62 => Use the GNU C compiler: c-compiler provided by gcc>=3 => Use python-3.6: python>=2.5<3.9 provided by python36>=3.6<3.7 ===> Checking dependencies for py36-mavlink-1.1.62 => Required system package gcc>=3: gcc-5.5.0 found => Required system package python36>=3.6<3.7: python36-3.6.9 found ===> Done depends for py36-mavlink-1.1.62 ===> Extracting for py36-mavlink-1.1.62 => SHA1 checksums OK => RMD160 checksums OK tar: Global extended headers posix ustar archive. Extracting as plain files. Following files might be in the wrong directory or have wrong attributes. tar: ustar vol 1, 260 files, 2319872 bytes read, 0 bytes written in 1 secs (2319872 bytes/sec) ===> Configuring for py36-mavlink-1.1.62 ===> Building for py36-mavlink-1.1.62 warning: build_py: byte-compiling is disabled, skipping. ===> Installing for py36-mavlink-1.1.62 warning: build_py: byte-compiling is disabled, skipping. warning: install_lib: byte-compiling is disabled, skipping. => Compiling python files File "/opt/openrobots/lib/python3.6/site-packages/pymavlink/generator/lib/genxmlif/__init__.py", line 81 raise AttributeError, "Unknown XML interface: %s" %(xmlIf) ^ SyntaxError: invalid syntax File "/opt/openrobots/lib/python3.6/site-packages/pymavlink/generator/lib/genxmlif/xmlif4Dom.py", line 58 print "Using 4Dom interface module..." ^ SyntaxError: Missing parentheses in call to 'print'. Did you mean print("Using 4Dom interface module...")? File "/opt/openrobots/lib/python3.6/site-packages/pymavlink/generator/lib/genxmlif/xmlifApi.py", line 370 raise AttributeError, "Attribute %s not found!" %(repr(tupleOrAttrName)) ^ SyntaxError: invalid syntax File "/opt/openrobots/lib/python3.6/site-packages/pymavlink/generator/lib/genxmlif/xmlifDom.py", line 69 print "Xinclude: %s" %href ^ SyntaxError: Missing parentheses in call to 'print'. Did you mean print("Xinclude: %s" %href)? File "/opt/openrobots/lib/python3.6/site-packages/pymavlink/generator/lib/genxmlif/xmlifElementTree.py", line 72 print "Using elementtree interface module..." ^ SyntaxError: Missing parentheses in call to 'print'. Did you mean print("Using elementtree interface module...")? File "/opt/openrobots/lib/python3.6/site-packages/pymavlink/generator/lib/genxmlif/xmlifMinidom.py", line 63 print "Using minidom interface module..." ^ SyntaxError: Missing parentheses in call to 'print'. Did you mean print("Using minidom interface module...")? File "/opt/openrobots/lib/python3.6/site-packages/pymavlink/generator/lib/genxmlif/xmlifUtils.py", line 193 raise LookupError, "Prefix for namespaceURI '%s' not found!" % (ns) ^ SyntaxError: invalid syntax File "/opt/openrobots/lib/python3.6/site-packages/pymavlink/generator/lib/genxmlif/xmliftest.py", line 12 print xmlTree.printTree(prettyPrint=1) ^ SyntaxError: invalid syntax File "/opt/openrobots/lib/python3.6/site-packages/pymavlink/generator/lib/minixsv/minixsvWrapper.py", line 36 print validSyntaxText ^ SyntaxError: Missing parentheses in call to 'print'. Did you mean print(validSyntaxText)? File "/opt/openrobots/lib/python3.6/site-packages/pymavlink/generator/lib/minixsv/pyxsval.py", line 93 raise KeyError, "xmlIfKey %s already implemented!" %(xmlIfKey) ^ SyntaxError: invalid syntax File "/opt/openrobots/lib/python3.6/site-packages/pymavlink/generator/lib/minixsv/xsvalBase.py", line 135 except TagException, errInst: ^ SyntaxError: invalid syntax File "/opt/openrobots/lib/python3.6/site-packages/pymavlink/generator/lib/minixsv/xsvalErrorHandler.py", line 122 print string.join (self.infoDict.keys(), "n") ^ SyntaxError: invalid syntax File "/opt/openrobots/lib/python3.6/site-packages/pymavlink/generator/lib/minixsv/xsvalSchema.py", line 431 except TagException, errInst: ^ SyntaxError: invalid syntax File "/opt/openrobots/lib/python3.6/site-packages/pymavlink/generator/lib/minixsv/xsvalSimpleTypes.py", line 78 except BaseTypeError, errstr: ^ SyntaxError: invalid syntax File "/opt/openrobots/lib/python3.6/site-packages/pymavlink/generator/lib/minixsv/xsvalUtils.py", line 48 r"Cc" : ur"x00-x1fx7f-x9f", ^ SyntaxError: invalid syntax File "/opt/openrobots/lib/python3.6/site-packages/pymavlink/generator/lib/genxmlif/__init__.py", line 81 raise AttributeError, "Unknown XML interface: %s" %(xmlIf) ^ SyntaxError: invalid syntax File "/opt/openrobots/lib/python3.6/site-packages/pymavlink/generator/lib/genxmlif/xmlif4Dom.py", line 58 print "Using 4Dom interface module..." ^ SyntaxError: Missing parentheses in call to 'print'. Did you mean print("Using 4Dom interface module...")? File "/opt/openrobots/lib/python3.6/site-packages/pymavlink/generator/lib/genxmlif/xmlifApi.py", line 370 raise AttributeError, "Attribute %s not found!" %(repr(tupleOrAttrName)) ^ SyntaxError: invalid syntax File "/opt/openrobots/lib/python3.6/site-packages/pymavlink/generator/lib/genxmlif/xmlifDom.py", line 69 print "Xinclude: %s" %href ^ SyntaxError: Missing parentheses in call to 'print'. Did you mean print("Xinclude: %s" %href)? File "/opt/openrobots/lib/python3.6/site-packages/pymavlink/generator/lib/genxmlif/xmlifElementTree.py", line 72 print "Using elementtree interface module..." ^ SyntaxError: Missing parentheses in call to 'print'. Did you mean print("Using elementtree interface module...")? File "/opt/openrobots/lib/python3.6/site-packages/pymavlink/generator/lib/genxmlif/xmlifMinidom.py", line 63 print "Using minidom interface module..." ^ SyntaxError: Missing parentheses in call to 'print'. Did you mean print("Using minidom interface module...")? File "/opt/openrobots/lib/python3.6/site-packages/pymavlink/generator/lib/genxmlif/xmlifUtils.py", line 193 raise LookupError, "Prefix for namespaceURI '%s' not found!" % (ns) ^ SyntaxError: invalid syntax File "/opt/openrobots/lib/python3.6/site-packages/pymavlink/generator/lib/genxmlif/xmliftest.py", line 12 print xmlTree.printTree(prettyPrint=1) ^ SyntaxError: invalid syntax File "/opt/openrobots/lib/python3.6/site-packages/pymavlink/generator/lib/minixsv/minixsvWrapper.py", line 36 print validSyntaxText ^ SyntaxError: Missing parentheses in call to 'print'. Did you mean print(validSyntaxText)? File "/opt/openrobots/lib/python3.6/site-packages/pymavlink/generator/lib/minixsv/pyxsval.py", line 93 raise KeyError, "xmlIfKey %s already implemented!" %(xmlIfKey) ^ SyntaxError: invalid syntax File "/opt/openrobots/lib/python3.6/site-packages/pymavlink/generator/lib/minixsv/xsvalBase.py", line 135 except TagException, errInst: ^ SyntaxError: invalid syntax File "/opt/openrobots/lib/python3.6/site-packages/pymavlink/generator/lib/minixsv/xsvalErrorHandler.py", line 122 print string.join (self.infoDict.keys(), "n") ^ SyntaxError: invalid syntax File "/opt/openrobots/lib/python3.6/site-packages/pymavlink/generator/lib/minixsv/xsvalSchema.py", line 431 except TagException, errInst: ^ SyntaxError: invalid syntax File "/opt/openrobots/lib/python3.6/site-packages/pymavlink/generator/lib/minixsv/xsvalSimpleTypes.py", line 78 except BaseTypeError, errstr: ^ SyntaxError: invalid syntax File "/opt/openrobots/lib/python3.6/site-packages/pymavlink/generator/lib/minixsv/xsvalUtils.py", line 48 r"Cc" : ur"x00-x1fx7f-x9f", ^ SyntaxError: invalid syntax robotpkg_create: can't stat `/opt/openrobots/lib/python3.6/site-packages/pymavlink/generator/lib/genxmlif/__pycache__/__init__.cpython-36.pyc' robotpkg_create: can't stat `/opt/openrobots/lib/python3.6/site-packages/pymavlink/generator/lib/genxmlif/__pycache__/__init__.cpython-36.opt-1.pyc' robotpkg_create: can't stat `/opt/openrobots/lib/python3.6/site-packages/pymavlink/generator/lib/genxmlif/__pycache__/xmlif4Dom.cpython-36.pyc' robotpkg_create: can't stat `/opt/openrobots/lib/python3.6/site-packages/pymavlink/generator/lib/genxmlif/__pycache__/xmlif4Dom.cpython-36.opt-1.pyc' robotpkg_create: can't stat `/opt/openrobots/lib/python3.6/site-packages/pymavlink/generator/lib/genxmlif/__pycache__/xmlifApi.cpython-36.pyc' robotpkg_create: can't stat `/opt/openrobots/lib/python3.6/site-packages/pymavlink/generator/lib/genxmlif/__pycache__/xmlifApi.cpython-36.opt-1.pyc' robotpkg_create: can't stat `/opt/openrobots/lib/python3.6/site-packages/pymavlink/generator/lib/genxmlif/__pycache__/xmlifDom.cpython-36.pyc' robotpkg_create: can't stat `/opt/openrobots/lib/python3.6/site-packages/pymavlink/generator/lib/genxmlif/__pycache__/xmlifDom.cpython-36.opt-1.pyc' robotpkg_create: can't stat `/opt/openrobots/lib/python3.6/site-packages/pymavlink/generator/lib/genxmlif/__pycache__/xmlifElementTree.cpython-36.pyc' robotpkg_create: can't stat `/opt/openrobots/lib/python3.6/site-packages/pymavlink/generator/lib/genxmlif/__pycache__/xmlifElementTree.cpython-36.opt-1.pyc' robotpkg_create: can't stat `/opt/openrobots/lib/python3.6/site-packages/pymavlink/generator/lib/genxmlif/__pycache__/xmlifMinidom.cpython-36.pyc' robotpkg_create: can't stat `/opt/openrobots/lib/python3.6/site-packages/pymavlink/generator/lib/genxmlif/__pycache__/xmlifMinidom.cpython-36.opt-1.pyc' robotpkg_create: can't stat `/opt/openrobots/lib/python3.6/site-packages/pymavlink/generator/lib/genxmlif/__pycache__/xmlifUtils.cpython-36.pyc' robotpkg_create: can't stat `/opt/openrobots/lib/python3.6/site-packages/pymavlink/generator/lib/genxmlif/__pycache__/xmlifUtils.cpython-36.opt-1.pyc' robotpkg_create: can't stat `/opt/openrobots/lib/python3.6/site-packages/pymavlink/generator/lib/genxmlif/__pycache__/xmliftest.cpython-36.pyc' robotpkg_create: can't stat `/opt/openrobots/lib/python3.6/site-packages/pymavlink/generator/lib/genxmlif/__pycache__/xmliftest.cpython-36.opt-1.pyc' robotpkg_create: can't stat `/opt/openrobots/lib/python3.6/site-packages/pymavlink/generator/lib/minixsv/__pycache__/minixsvWrapper.cpython-36.pyc' robotpkg_create: can't stat `/opt/openrobots/lib/python3.6/site-packages/pymavlink/generator/lib/minixsv/__pycache__/minixsvWrapper.cpython-36.opt-1.pyc' robotpkg_create: can't stat `/opt/openrobots/lib/python3.6/site-packages/pymavlink/generator/lib/minixsv/__pycache__/pyxsval.cpython-36.pyc' robotpkg_create: can't stat `/opt/openrobots/lib/python3.6/site-packages/pymavlink/generator/lib/minixsv/__pycache__/pyxsval.cpython-36.opt-1.pyc' robotpkg_create: can't stat `/opt/openrobots/lib/python3.6/site-packages/pymavlink/generator/lib/minixsv/__pycache__/xsvalBase.cpython-36.pyc' robotpkg_create: can't stat `/opt/openrobots/lib/python3.6/site-packages/pymavlink/generator/lib/minixsv/__pycache__/xsvalBase.cpython-36.opt-1.pyc' robotpkg_create: can't stat `/opt/openrobots/lib/python3.6/site-packages/pymavlink/generator/lib/minixsv/__pycache__/xsvalErrorHandler.cpython-36.pyc' robotpkg_create: can't stat `/opt/openrobots/lib/python3.6/site-packages/pymavlink/generator/lib/minixsv/__pycache__/xsvalErrorHandler.cpython-36.opt-1.pyc' robotpkg_create: can't stat `/opt/openrobots/lib/python3.6/site-packages/pymavlink/generator/lib/minixsv/__pycache__/xsvalSchema.cpython-36.pyc' robotpkg_create: can't stat `/opt/openrobots/lib/python3.6/site-packages/pymavlink/generator/lib/minixsv/__pycache__/xsvalSchema.cpython-36.opt-1.pyc' robotpkg_create: can't stat `/opt/openrobots/lib/python3.6/site-packages/pymavlink/generator/lib/minixsv/__pycache__/xsvalSimpleTypes.cpython-36.pyc' robotpkg_create: can't stat `/opt/openrobots/lib/python3.6/site-packages/pymavlink/generator/lib/minixsv/__pycache__/xsvalSimpleTypes.cpython-36.opt-1.pyc' robotpkg_create: can't stat `/opt/openrobots/lib/python3.6/site-packages/pymavlink/generator/lib/minixsv/__pycache__/xsvalUtils.cpython-36.pyc' robotpkg_create: can't stat `/opt/openrobots/lib/python3.6/site-packages/pymavlink/generator/lib/minixsv/__pycache__/xsvalUtils.cpython-36.opt-1.pyc' => Registering installation for py36-mavlink-1.1.62 robotpkg_admin: py36-mavlink-1.1.62: File `/opt/openrobots/lib/python3.6/site-packages/pymavlink/generator/lib/genxmlif/__pycache__/__init__.cpython-36.pyc' is in +CONTENTS but not on filesystem! robotpkg_admin: py36-mavlink-1.1.62: File `/opt/openrobots/lib/python3.6/site-packages/pymavlink/generator/lib/genxmlif/__pycache__/__init__.cpython-36.opt-1.pyc' is in +CONTENTS but not on filesystem! robotpkg_admin: py36-mavlink-1.1.62: File `/opt/openrobots/lib/python3.6/site-packages/pymavlink/generator/lib/genxmlif/__pycache__/xmlif4Dom.cpython-36.pyc' is in +CONTENTS but not on filesystem! robotpkg_admin: py36-mavlink-1.1.62: File `/opt/openrobots/lib/python3.6/site-packages/pymavlink/generator/lib/genxmlif/__pycache__/xmlif4Dom.cpython-36.opt-1.pyc' is in +CONTENTS but not on filesystem! robotpkg_admin: py36-mavlink-1.1.62: File `/opt/openrobots/lib/python3.6/site-packages/pymavlink/generator/lib/genxmlif/__pycache__/xmlifApi.cpython-36.pyc' is in +CONTENTS but not on filesystem! robotpkg_admin: py36-mavlink-1.1.62: File `/opt/openrobots/lib/python3.6/site-packages/pymavlink/generator/lib/genxmlif/__pycache__/xmlifApi.cpython-36.opt-1.pyc' is in +CONTENTS but not on filesystem! robotpkg_admin: py36-mavlink-1.1.62: File `/opt/openrobots/lib/python3.6/site-packages/pymavlink/generator/lib/genxmlif/__pycache__/xmlifDom.cpython-36.pyc' is in +CONTENTS but not on filesystem! robotpkg_admin: py36-mavlink-1.1.62: File `/opt/openrobots/lib/python3.6/site-packages/pymavlink/generator/lib/genxmlif/__pycache__/xmlifDom.cpython-36.opt-1.pyc' is in +CONTENTS but not on filesystem! robotpkg_admin: py36-mavlink-1.1.62: File `/opt/openrobots/lib/python3.6/site-packages/pymavlink/generator/lib/genxmlif/__pycache__/xmlifElementTree.cpython-36.pyc' is in +CONTENTS but not on filesystem! robotpkg_admin: py36-mavlink-1.1.62: File `/opt/openrobots/lib/python3.6/site-packages/pymavlink/generator/lib/genxmlif/__pycache__/xmlifElementTree.cpython-36.opt-1.pyc' is in +CONTENTS but not on filesystem! robotpkg_admin: py36-mavlink-1.1.62: File `/opt/openrobots/lib/python3.6/site-packages/pymavlink/generator/lib/genxmlif/__pycache__/xmlifMinidom.cpython-36.pyc' is in +CONTENTS but not on filesystem! robotpkg_admin: py36-mavlink-1.1.62: File `/opt/openrobots/lib/python3.6/site-packages/pymavlink/generator/lib/genxmlif/__pycache__/xmlifMinidom.cpython-36.opt-1.pyc' is in +CONTENTS but not on filesystem! robotpkg_admin: py36-mavlink-1.1.62: File `/opt/openrobots/lib/python3.6/site-packages/pymavlink/generator/lib/genxmlif/__pycache__/xmlifUtils.cpython-36.pyc' is in +CONTENTS but not on filesystem! robotpkg_admin: py36-mavlink-1.1.62: File `/opt/openrobots/lib/python3.6/site-packages/pymavlink/generator/lib/genxmlif/__pycache__/xmlifUtils.cpython-36.opt-1.pyc' is in +CONTENTS but not on filesystem! robotpkg_admin: py36-mavlink-1.1.62: File `/opt/openrobots/lib/python3.6/site-packages/pymavlink/generator/lib/genxmlif/__pycache__/xmliftest.cpython-36.pyc' is in +CONTENTS but not on filesystem! robotpkg_admin: py36-mavlink-1.1.62: File `/opt/openrobots/lib/python3.6/site-packages/pymavlink/generator/lib/genxmlif/__pycache__/xmliftest.cpython-36.opt-1.pyc' is in +CONTENTS but not on filesystem! robotpkg_admin: py36-mavlink-1.1.62: File `/opt/openrobots/lib/python3.6/site-packages/pymavlink/generator/lib/minixsv/__pycache__/minixsvWrapper.cpython-36.pyc' is in +CONTENTS but not on filesystem! robotpkg_admin: py36-mavlink-1.1.62: File `/opt/openrobots/lib/python3.6/site-packages/pymavlink/generator/lib/minixsv/__pycache__/minixsvWrapper.cpython-36.opt-1.pyc' is in +CONTENTS but not on filesystem! robotpkg_admin: py36-mavlink-1.1.62: File `/opt/openrobots/lib/python3.6/site-packages/pymavlink/generator/lib/minixsv/__pycache__/pyxsval.cpython-36.pyc' is in +CONTENTS but not on filesystem! robotpkg_admin: py36-mavlink-1.1.62: File `/opt/openrobots/lib/python3.6/site-packages/pymavlink/generator/lib/minixsv/__pycache__/pyxsval.cpython-36.opt-1.pyc' is in +CONTENTS but not on filesystem! robotpkg_admin: py36-mavlink-1.1.62: File `/opt/openrobots/lib/python3.6/site-packages/pymavlink/generator/lib/minixsv/__pycache__/xsvalBase.cpython-36.pyc' is in +CONTENTS but not on filesystem! robotpkg_admin: py36-mavlink-1.1.62: File `/opt/openrobots/lib/python3.6/site-packages/pymavlink/generator/lib/minixsv/__pycache__/xsvalBase.cpython-36.opt-1.pyc' is in +CONTENTS but not on filesystem! robotpkg_admin: py36-mavlink-1.1.62: File `/opt/openrobots/lib/python3.6/site-packages/pymavlink/generator/lib/minixsv/__pycache__/xsvalErrorHandler.cpython-36.pyc' is in +CONTENTS but not on filesystem! robotpkg_admin: py36-mavlink-1.1.62: File `/opt/openrobots/lib/python3.6/site-packages/pymavlink/generator/lib/minixsv/__pycache__/xsvalErrorHandler.cpython-36.opt-1.pyc' is in +CONTENTS but not on filesystem! robotpkg_admin: py36-mavlink-1.1.62: File `/opt/openrobots/lib/python3.6/site-packages/pymavlink/generator/lib/minixsv/__pycache__/xsvalSchema.cpython-36.pyc' is in +CONTENTS but not on filesystem! robotpkg_admin: py36-mavlink-1.1.62: File `/opt/openrobots/lib/python3.6/site-packages/pymavlink/generator/lib/minixsv/__pycache__/xsvalSchema.cpython-36.opt-1.pyc' is in +CONTENTS but not on filesystem! robotpkg_admin: py36-mavlink-1.1.62: File `/opt/openrobots/lib/python3.6/site-packages/pymavlink/generator/lib/minixsv/__pycache__/xsvalSimpleTypes.cpython-36.pyc' is in +CONTENTS but not on filesystem! robotpkg_admin: py36-mavlink-1.1.62: File `/opt/openrobots/lib/python3.6/site-packages/pymavlink/generator/lib/minixsv/__pycache__/xsvalSimpleTypes.cpython-36.opt-1.pyc' is in +CONTENTS but not on filesystem! robotpkg_admin: py36-mavlink-1.1.62: File `/opt/openrobots/lib/python3.6/site-packages/pymavlink/generator/lib/minixsv/__pycache__/xsvalUtils.cpython-36.pyc' is in +CONTENTS but not on filesystem! robotpkg_admin: py36-mavlink-1.1.62: File `/opt/openrobots/lib/python3.6/site-packages/pymavlink/generator/lib/minixsv/__pycache__/xsvalUtils.cpython-36.opt-1.pyc' is in +CONTENTS but not on filesystem! ===> Done install for py36-mavlink-1.1.62 ===> Building binary package for py36-mavlink-1.1.62 robotpkg_create: can't stat `/opt/openrobots/lib/python3.6/site-packages/pymavlink/generator/lib/genxmlif/__pycache__/__init__.cpython-36.pyc' robotpkg_create: can't stat `/opt/openrobots/lib/python3.6/site-packages/pymavlink/generator/lib/genxmlif/__pycache__/__init__.cpython-36.opt-1.pyc' robotpkg_create: can't stat `/opt/openrobots/lib/python3.6/site-packages/pymavlink/generator/lib/genxmlif/__pycache__/xmlif4Dom.cpython-36.pyc' robotpkg_create: can't stat `/opt/openrobots/lib/python3.6/site-packages/pymavlink/generator/lib/genxmlif/__pycache__/xmlif4Dom.cpython-36.opt-1.pyc' robotpkg_create: can't stat `/opt/openrobots/lib/python3.6/site-packages/pymavlink/generator/lib/genxmlif/__pycache__/xmlifApi.cpython-36.pyc' robotpkg_create: can't stat `/opt/openrobots/lib/python3.6/site-packages/pymavlink/generator/lib/genxmlif/__pycache__/xmlifApi.cpython-36.opt-1.pyc' robotpkg_create: can't stat `/opt/openrobots/lib/python3.6/site-packages/pymavlink/generator/lib/genxmlif/__pycache__/xmlifDom.cpython-36.pyc' robotpkg_create: can't stat `/opt/openrobots/lib/python3.6/site-packages/pymavlink/generator/lib/genxmlif/__pycache__/xmlifDom.cpython-36.opt-1.pyc' robotpkg_create: can't stat `/opt/openrobots/lib/python3.6/site-packages/pymavlink/generator/lib/genxmlif/__pycache__/xmlifElementTree.cpython-36.pyc' robotpkg_create: can't stat `/opt/openrobots/lib/python3.6/site-packages/pymavlink/generator/lib/genxmlif/__pycache__/xmlifElementTree.cpython-36.opt-1.pyc' robotpkg_create: can't stat `/opt/openrobots/lib/python3.6/site-packages/pymavlink/generator/lib/genxmlif/__pycache__/xmlifMinidom.cpython-36.pyc' robotpkg_create: can't stat `/opt/openrobots/lib/python3.6/site-packages/pymavlink/generator/lib/genxmlif/__pycache__/xmlifMinidom.cpython-36.opt-1.pyc' robotpkg_create: can't stat `/opt/openrobots/lib/python3.6/site-packages/pymavlink/generator/lib/genxmlif/__pycache__/xmlifUtils.cpython-36.pyc' robotpkg_create: can't stat `/opt/openrobots/lib/python3.6/site-packages/pymavlink/generator/lib/genxmlif/__pycache__/xmlifUtils.cpython-36.opt-1.pyc' robotpkg_create: can't stat `/opt/openrobots/lib/python3.6/site-packages/pymavlink/generator/lib/genxmlif/__pycache__/xmliftest.cpython-36.pyc' robotpkg_create: can't stat `/opt/openrobots/lib/python3.6/site-packages/pymavlink/generator/lib/genxmlif/__pycache__/xmliftest.cpython-36.opt-1.pyc' robotpkg_create: can't stat `/opt/openrobots/lib/python3.6/site-packages/pymavlink/generator/lib/minixsv/__pycache__/minixsvWrapper.cpython-36.pyc' robotpkg_create: can't stat `/opt/openrobots/lib/python3.6/site-packages/pymavlink/generator/lib/minixsv/__pycache__/minixsvWrapper.cpython-36.opt-1.pyc' robotpkg_create: can't stat `/opt/openrobots/lib/python3.6/site-packages/pymavlink/generator/lib/minixsv/__pycache__/pyxsval.cpython-36.pyc' robotpkg_create: can't stat `/opt/openrobots/lib/python3.6/site-packages/pymavlink/generator/lib/minixsv/__pycache__/pyxsval.cpython-36.opt-1.pyc' robotpkg_create: can't stat `/opt/openrobots/lib/python3.6/site-packages/pymavlink/generator/lib/minixsv/__pycache__/xsvalBase.cpython-36.pyc' robotpkg_create: can't stat `/opt/openrobots/lib/python3.6/site-packages/pymavlink/generator/lib/minixsv/__pycache__/xsvalBase.cpython-36.opt-1.pyc' robotpkg_create: can't stat `/opt/openrobots/lib/python3.6/site-packages/pymavlink/generator/lib/minixsv/__pycache__/xsvalErrorHandler.cpython-36.pyc' robotpkg_create: can't stat `/opt/openrobots/lib/python3.6/site-packages/pymavlink/generator/lib/minixsv/__pycache__/xsvalErrorHandler.cpython-36.opt-1.pyc' robotpkg_create: can't stat `/opt/openrobots/lib/python3.6/site-packages/pymavlink/generator/lib/minixsv/__pycache__/xsvalSchema.cpython-36.pyc' robotpkg_create: can't stat `/opt/openrobots/lib/python3.6/site-packages/pymavlink/generator/lib/minixsv/__pycache__/xsvalSchema.cpython-36.opt-1.pyc' robotpkg_create: can't stat `/opt/openrobots/lib/python3.6/site-packages/pymavlink/generator/lib/minixsv/__pycache__/xsvalSimpleTypes.cpython-36.pyc' robotpkg_create: can't stat `/opt/openrobots/lib/python3.6/site-packages/pymavlink/generator/lib/minixsv/__pycache__/xsvalSimpleTypes.cpython-36.opt-1.pyc' robotpkg_create: can't stat `/opt/openrobots/lib/python3.6/site-packages/pymavlink/generator/lib/minixsv/__pycache__/xsvalUtils.cpython-36.pyc' robotpkg_create: can't stat `/opt/openrobots/lib/python3.6/site-packages/pymavlink/generator/lib/minixsv/__pycache__/xsvalUtils.cpython-36.opt-1.pyc' robotpkg_create: lstat failed for file lib/python3.6/site-packages/pymavlink/generator/lib/genxmlif/__pycache__/__init__.cpython-36.pyc: No such file or directory Creating package /opt/robotpkg/var/lib/robotpkg/wip/packages/bsd/NetBSD-8.0-x86_64/All/py36-mavlink-1.1.62 gmake[3]: *** [/local/robotpkg/var/lib/robotpkg/mk/pkg/package.mk:74: pkg-tarup] Error 2 => Unlinking package in /opt/robotpkg/var/lib/robotpkg/wip/packages/bsd/NetBSD-8.0-x86_64/All => Unlinking package in /opt/robotpkg/var/lib/robotpkg/wip/packages/bsd/NetBSD-8.0-x86_64/pub => Unlinking package in /opt/robotpkg/var/lib/robotpkg/wip/packages/bsd/NetBSD-8.0-x86_64/jrl => Unlinking package in /opt/robotpkg/var/lib/robotpkg/wip/packages/bsd/NetBSD-8.0-x86_64/pal gmake[2]: *** [/local/robotpkg/var/lib/robotpkg/mk/package/package.mk:147: package-failed] Error 2 => Marking py36-mavlink-1.1.62 as broken ERROR: /usr/pkg/bin/gmake: *** [package] Error 2 ===> Deinstalling for py36-mavlink robotpkg_delete: Couldn't remove /opt/openrobots/lib/python3.6/site-packages/pymavlink/generator/lib/genxmlif/__pycache__/__init__.cpython-36.pyc robotpkg_delete: Couldn't remove /opt/openrobots/lib/python3.6/site-packages/pymavlink/generator/lib/genxmlif/__pycache__/__init__.cpython-36.opt-1.pyc robotpkg_delete: Couldn't remove /opt/openrobots/lib/python3.6/site-packages/pymavlink/generator/lib/genxmlif/__pycache__/xmlif4Dom.cpython-36.pyc robotpkg_delete: Couldn't remove /opt/openrobots/lib/python3.6/site-packages/pymavlink/generator/lib/genxmlif/__pycache__/xmlif4Dom.cpython-36.opt-1.pyc robotpkg_delete: Couldn't remove /opt/openrobots/lib/python3.6/site-packages/pymavlink/generator/lib/genxmlif/__pycache__/xmlifApi.cpython-36.pyc robotpkg_delete: Couldn't remove /opt/openrobots/lib/python3.6/site-packages/pymavlink/generator/lib/genxmlif/__pycache__/xmlifApi.cpython-36.opt-1.pyc robotpkg_delete: Couldn't remove /opt/openrobots/lib/python3.6/site-packages/pymavlink/generator/lib/genxmlif/__pycache__/xmlifDom.cpython-36.pyc robotpkg_delete: Couldn't remove /opt/openrobots/lib/python3.6/site-packages/pymavlink/generator/lib/genxmlif/__pycache__/xmlifDom.cpython-36.opt-1.pyc robotpkg_delete: Couldn't remove /opt/openrobots/lib/python3.6/site-packages/pymavlink/generator/lib/genxmlif/__pycache__/xmlifElementTree.cpython-36.pyc robotpkg_delete: Couldn't remove /opt/openrobots/lib/python3.6/site-packages/pymavlink/generator/lib/genxmlif/__pycache__/xmlifElementTree.cpython-36.opt-1.pyc robotpkg_delete: Couldn't remove /opt/openrobots/lib/python3.6/site-packages/pymavlink/generator/lib/genxmlif/__pycache__/xmlifMinidom.cpython-36.pyc robotpkg_delete: Couldn't remove /opt/openrobots/lib/python3.6/site-packages/pymavlink/generator/lib/genxmlif/__pycache__/xmlifMinidom.cpython-36.opt-1.pyc robotpkg_delete: Couldn't remove /opt/openrobots/lib/python3.6/site-packages/pymavlink/generator/lib/genxmlif/__pycache__/xmlifUtils.cpython-36.pyc robotpkg_delete: Couldn't remove /opt/openrobots/lib/python3.6/site-packages/pymavlink/generator/lib/genxmlif/__pycache__/xmlifUtils.cpython-36.opt-1.pyc robotpkg_delete: Couldn't remove /opt/openrobots/lib/python3.6/site-packages/pymavlink/generator/lib/genxmlif/__pycache__/xmliftest.cpython-36.pyc robotpkg_delete: Couldn't remove /opt/openrobots/lib/python3.6/site-packages/pymavlink/generator/lib/genxmlif/__pycache__/xmliftest.cpython-36.opt-1.pyc robotpkg_delete: Couldn't remove /opt/openrobots/lib/python3.6/site-packages/pymavlink/generator/lib/minixsv/__pycache__/minixsvWrapper.cpython-36.pyc robotpkg_delete: Couldn't remove /opt/openrobots/lib/python3.6/site-packages/pymavlink/generator/lib/minixsv/__pycache__/minixsvWrapper.cpython-36.opt-1.pyc robotpkg_delete: Couldn't remove /opt/openrobots/lib/python3.6/site-packages/pymavlink/generator/lib/minixsv/__pycache__/pyxsval.cpython-36.pyc robotpkg_delete: Couldn't remove /opt/openrobots/lib/python3.6/site-packages/pymavlink/generator/lib/minixsv/__pycache__/pyxsval.cpython-36.opt-1.pyc robotpkg_delete: Couldn't remove /opt/openrobots/lib/python3.6/site-packages/pymavlink/generator/lib/minixsv/__pycache__/xsvalBase.cpython-36.pyc robotpkg_delete: Couldn't remove /opt/openrobots/lib/python3.6/site-packages/pymavlink/generator/lib/minixsv/__pycache__/xsvalBase.cpython-36.opt-1.pyc robotpkg_delete: Couldn't remove /opt/openrobots/lib/python3.6/site-packages/pymavlink/generator/lib/minixsv/__pycache__/xsvalErrorHandler.cpython-36.pyc robotpkg_delete: Couldn't remove /opt/openrobots/lib/python3.6/site-packages/pymavlink/generator/lib/minixsv/__pycache__/xsvalErrorHandler.cpython-36.opt-1.pyc robotpkg_delete: Couldn't remove /opt/openrobots/lib/python3.6/site-packages/pymavlink/generator/lib/minixsv/__pycache__/xsvalSchema.cpython-36.pyc robotpkg_delete: Couldn't remove /opt/openrobots/lib/python3.6/site-packages/pymavlink/generator/lib/minixsv/__pycache__/xsvalSchema.cpython-36.opt-1.pyc robotpkg_delete: Couldn't remove /opt/openrobots/lib/python3.6/site-packages/pymavlink/generator/lib/minixsv/__pycache__/xsvalSimpleTypes.cpython-36.pyc robotpkg_delete: Couldn't remove /opt/openrobots/lib/python3.6/site-packages/pymavlink/generator/lib/minixsv/__pycache__/xsvalSimpleTypes.cpython-36.opt-1.pyc robotpkg_delete: Couldn't remove /opt/openrobots/lib/python3.6/site-packages/pymavlink/generator/lib/minixsv/__pycache__/xsvalUtils.cpython-36.pyc robotpkg_delete: Couldn't remove /opt/openrobots/lib/python3.6/site-packages/pymavlink/generator/lib/minixsv/__pycache__/xsvalUtils.cpython-36.opt-1.pyc robotpkg_delete: Directory `/opt/openrobots/share/mavlink' disappeared, skipping Removed py36-mavlink-1.1.62 Removed digest-20080510 Removed tnftp-20130505~ssl