robotpkg/wip/py-dynamic-graph-v3 bulk build results

Log for py36-dynamic-graph-v3-3.2.0 on NetBSD-8.0-x86_64: bulk.log (Back)

=> Checking for clear installation ===> Installing bootstrap dependencies for py36-dynamic-graph-v3-3.2.0 => Installing /opt/robotpkg/var/lib/robotpkg/packages/bsd/NetBSD-8.0-x86_64/All/digest-20080510.tgz => Installing /opt/robotpkg/var/lib/robotpkg/packages/bsd/NetBSD-8.0-x86_64/All/tnftp-20130505~ssl.tgz ===> Checking bootstrap dependencies for py36-dynamic-graph-v3-3.2.0 => Required robotpkg package digest>=20080510: digest-20080510 found => Required robotpkg package tnftp>=20091122: tnftp-20130505~ssl found => Required system package gzip: gzip-20150113 found => Required system package patch>=2.0: patch-2.0128 found => Required system package pax and tar archivers: pax found => Required system package pkg_install>=20110805.9: pkg_install-20110805.9 found ===> Done bootstrap-depends for py36-dynamic-graph-v3-3.2.0 ===> Installing full dependencies for py36-dynamic-graph-v3-3.2.0 => Dependency digest-20080510 already installed => Installing /opt/robotpkg/var/lib/robotpkg/wip/packages/bsd/NetBSD-8.0-x86_64/All/dynamic-graph-v3-3.3.0.tgz => Dependency tnftp-20130505~ssl already installed ===> Checking build options for py36-dynamic-graph-v3-3.2.0 => Building with no option. ===> Checking alternatives for py36-dynamic-graph-v3-3.2.0 => Use the GNU C++ compiler: c++-compiler provided by g++>=3 => Use the GNU C compiler: c-compiler provided by gcc>=3 => Use python-3.6: python>=2.5<3.8 provided by python36>=3.6<3.7 ===> Checking dependencies for py36-dynamic-graph-v3-3.2.0 => Required system package cmake>=2.6: cmake-3.11.4 found => Required system package doxygen>=1.5: doxygen-1.8.13 found => Required system package eigen3>=3.0.0: eigen3-3.3.4 found => Required system package g++>=3: g++-5.5.0 found => Required system package gcc>=3: gcc-5.5.0 found => Required system package graphviz>=2: graphviz-2.40.1 found => Required system package libstdc++: libstdc++ found => Required system package pkg-config>=0.22: pkg-config-1.4.1 found => Required system package py-sphinx>=1.1: py-sphinx-1.7.5 found => Required system package python36>=3.6<3.7: python36-3.6.5 found => Required robotpkg package dynamic-graph-v3>=3.0.0: dynamic-graph-v3-3.3.0 found ===> Done depends for py36-dynamic-graph-v3-3.2.0 ===> Extracting for py36-dynamic-graph-v3-3.2.0 => SHA1 checksums OK => RMD160 checksums OK tar: ustar vol 1, 527 files, 2838016 bytes read, 0 bytes written in 1 secs (2838016 bytes/sec) ===> Patching for py36-dynamic-graph-v3-3.2.0 => Applying robotpkg patches for py36-dynamic-graph-v3-3.2.0 ===> Configuring for py36-dynamic-graph-v3-3.2.0 CMake Error at /usr/pkg/share/cmake-3.11/Modules/FindPackageHandleStandardArgs.cmake:137 (message): Could NOT find PythonInterp: Found unsuitable version "3.6.5", but required is exact version "2.7" (found /usr/pkg/bin/python3.6) Call Stack (most recent call first): /usr/pkg/share/cmake-3.11/Modules/FindPackageHandleStandardArgs.cmake:376 (_FPHSA_FAILURE_MESSAGE) /usr/pkg/share/cmake-3.11/Modules/FindPythonInterp.cmake:162 (FIND_PACKAGE_HANDLE_STANDARD_ARGS) cmake/python.cmake:47 (FIND_PACKAGE) CMakeLists.txt:45 (FINDPYTHON) An unexpected error occured. The last 10 log lines are shown below. | Call Stack (most recent call first): /local/robotpkg/var/lib/robotpkg/mk/configure/ recipe for target 'do-configure-cmake' failed /local/robotpkg/var/lib/robotpkg/mk/pkg/ recipe for target 'pkg-check-installed' failed | /usr/pkg/share/cmake-3.11/Modules/FindPackageHandleStandardArgs.cmake:376 (_FPHSA_FAILURE_MESSAGE) | /usr/pkg/share/cmake-3.11/Modules/FindPythonInterp.cmake:162 (FIND_PACKAGE_HANDLE_STANDARD_ARGS) | cmake/python.cmake:47 (FIND_PACKAGE) | CMakeLists.txt:45 (FINDPYTHON) | | => Marking py36-dynamic-graph-v3-3.2.0 as broken | -- Configuring incomplete, errors occurred! | See also "/local/robotpkg/var/tmp/robotpkg/wip/py-dynamic-graph-v3/work/dynamic-graph-python-3.2.0/CMakeFiles/CMakeOutput.log". | See also "/local/robotpkg/var/tmp/robotpkg/wip/py-dynamic-graph-v3/work/dynamic-graph-python-3.2.0/CMakeFiles/CMakeError.log". For details or bug reports, check the complete log file in: /local/robotpkg/var/tmp/robotpkg/wip/py-dynamic-graph-v3/work/configure.log gmake[3]: *** [do-configure-cmake] Error 1 gmake[2]: *** [pkg-check-installed] Error 2 ERROR: /usr/pkg/bin/gmake: *** [package] Error 2 ===> Deinstalling for py36-dynamic-graph-v3 Removed digest-20080510 Removed dynamic-graph-v3-3.3.0 Removed tnftp-20130505~ssl