robotpkg/wip/py-dynamic-graph-v3 bulk build results

Log for py34-dynamic-graph-v3-3.2.0 on Ubuntu-14.04-x86_64: build.log (Back)

--- Environment --- LOWER_ARCH=x86_64 OPSYS=Ubuntu GZIP_CMD=/bin/gzip _override_vars_pkgtools_pkg_install=PKGREQD PKGREQD PKGREQD LC_TIME=C OS_KERNEL_VERSION=3.13.0-167-generic PKGREPO2DEB=/local/robotpkg/sbin/pkgrepo2deb BULKBASE=/opt/openrobots _override_vars_wip_py_dynamic_graph_v3=PKGREQD SPHINX_BUILD=/usr/bin/sphinx-build ECHO_N=echo -n _overrides_pkgtools_pkg_install_PKGREQD=pkg_install>=20110805.9 pkg_install>=20110805.9 pkg_install>=20110805.9 OS_VERSION=14.04 ROBOTPKG_BASE=/local/robotpkg PYTHON_LIB=/usr/lib/x86_64-linux-gnu/libpython3.4m.so _overrides_wip_py_dynamic_graph_v3_PKGREQD=py34-dynamic-graph-v3-3.2.0 OLDPWD=/local/robotpkg/var/lib/robotpkg/wip/py-dynamic-graph-v3 _override_vars_pkgtools_tnftp=PKGREQD PKGREQD PYTHON=/usr/bin/python3.4 PKG_DBDIR=/opt/openrobots/var/db/robotpkg hline="$bf======================================================================$rm" MACHINE_ARCH=x86_64 _overrides_pkgtools_tnftp_PKGREQD=tnftp>=20091122 tnftp>=20091122 FC=false LC_CTYPE=C EXPECT_TARGETS=fetch install package LC_MONETARY=C PATCH=/usr/bin/patch PKG_CONFIG=/usr/bin/pkg-config MAKEFLAGS= --no-print-directory -- PKGREQD.cmdline=py34-dynamic-graph-v3-3.2.0 RECURSIVE_PKGPATH=wip/py-dynamic-graph-v3\ tag=Ubuntu-14.04-x86_64 BULK_LOGDIR=/local/robotpkg/var/log/bulk BULKBASE=/opt/openrobots LOCALBASE=/opt/openrobots PKG_DBDIR=/opt/openrobots/var/db/robotpkg EXPECT_TARGETS=fetch\ install\ package _override_vars_pkgtools_digest=PKGREQD PKGREQD CPP=/usr/bin/gcc -E LOWER_OPSYS=ubuntu bf= _override_vars_pkgtools_pkgrepo2deb=PKGREQD PKGREQD _overrides_pkgtools_digest_PKGREQD=digest>=20080510 digest>=20080510 GCC=/usr/bin/gcc DIGEST=/opt/openrobots/sbin/robotpkg_digest TAR=/bin/tar LOWER_OS_VERSION=14.04 MACHINE_KERNEL=Linux-3.13.0-167-generic-x86_64 _overrides_pkgtools_pkgrepo2deb_PKGREQD=pkgrepo2deb>=1.5 pkgrepo2deb>=1.5 OWNER_GID=robots PKGTOOLS_VERSION=20110805.9 RECURSIVE_PKGPATH=wip/py-dynamic-graph-v3 PKG_CONFIG_PATH=/opt/openrobots/lib/pkgconfig GXX=/usr/bin/g++ TERM=linux MAKECONF=/opt/robotpkg/etc/robotpkg-wip.conf _override_vars_archivers_pax=PKGREQD PKGREQD rm= PYTHON34_INCLUDE=/usr/include/python3.4/ PYTHON_INCLUDE_CONFIG=/usr/include/python3.4/ LC_COLLATE=C OS_KERNEL=Linux ROBOTPKG_TRUSTED_ENV=robotpkg PATH=/usr/local/sbin:/usr/local/bin:/usr/bin:/usr/sbin:/sbin:/bin _overrides_archivers_pax_PKGREQD=pax pax CMAKE=/usr/bin/cmake CXXCPP=/usr/bin/g++ -E MAKELEVEL=4 DEB_HOST_MULTIARCH=x86_64-linux-gnu MACHINE_PLATFORM=Ubuntu-14.04-x86_64 ROBOTPKG_DIR=/local/robotpkg/var/lib/robotpkg TNFTP=/opt/openrobots/sbin/tnftp LANG=C MAKEOVERRIDES=PKGREQD.cmdline=py34-dynamic-graph-v3-3.2.0 RECURSIVE_PKGPATH=wip/py-dynamic-graph-v3\ tag=Ubuntu-14.04-x86_64 BULK_LOGDIR=/local/robotpkg/var/log/bulk BULKBASE=/opt/openrobots LOCALBASE=/opt/openrobots PKG_DBDIR=/opt/openrobots/var/db/robotpkg EXPECT_TARGETS=fetch\ install\ package _override_vars_wip_dynamic_graph_v3=PKGREQD PKGREQD PKGREQD LC_MESSAGES=C tag=Ubuntu-14.04-x86_64 CXX=/usr/bin/g++ _overrides_wip_dynamic_graph_v3_PKGREQD=dynamic-graph-v3>=3.0.0 dynamic-graph-v3>=3.0.0 dynamic-graph-v3>=3.0.0 LOCALBASE=/opt/openrobots _override_vars_pkgtools_pkg_config=PKGREQD PKGREQD PKGREQD PYTHON34_LIB=/usr/lib/x86_64-linux-gnu/libpython3.4m.so OWNER_UID=rbulk BULK_LOGDIR=/local/robotpkg/var/log/bulk ZCAT=/bin/zcat DOXYGEN=/usr/bin/doxygen PAX=/bin/pax LOWER_OS_KERNEL=linux _overrides_pkgtools_pkg_config_PKGREQD=pkg-config>=0.22 pkg-config>=0.22 pkg-config>=0.22 _override_vars_math_eigen3=PKGREQD PKGREQD PKGREQD GPG=/usr/bin/gpg --homedir=/opt/robotpkg/etc/gnupg PYTHON34=/usr/bin/python3.4 PYTHON_INCLUDE=/usr/include/python3.4/ PWD=/local/robotpkg/var/lib/robotpkg/wip/py-dynamic-graph-v3 _overrides_math_eigen3_PKGREQD=eigen3>=3.0.0 eigen3>=3.0.0 eigen3>=3.0.0 _ROBOTPKG_NOW=0325204813 PYTHONPATH= LC_NUMERIC=C CC=/usr/bin/gcc MFLAGS=- --no-print-directory PKG_CONFIG_LIBDIR=/usr/lib/x86_64-linux-gnu/pkgconfig:/usr/lib/pkgconfig:/usr/share/pkgconfig NODENAME=fluffy64-ubuntu1404 --- Running set -e; \ cd /local/robotpkg/var/tmp/robotpkg/wip/py-dynamic-graph-v3/work/dynamic-graph-python-3.2.0 && cd /local/robotpkg/var/tmp/robotpkg/wip/py-dynamic-graph-v3/work/dynamic-graph-python-3.2.0 && /usr/bin/env MAKELEVEL= MAKEOVERRIDES= MAKEFLAGS= MFLAGS= 'CPPFLAGS=' 'CFLAGS=-pipe -O3 -DNDEBUG' 'LDFLAGS=' 'CXXFLAGS=-pipe -O3 -DNDEBUG' PREFIX='/opt/openrobots' HOME=/local/robotpkg/var/tmp/robotpkg/wip/py-dynamic-graph-v3/work PATH='/opt/openrobots/sbin:/usr/local/sbin:/usr/local/bin:/usr/bin:/usr/sbin:/sbin:/bin' LD_LIBRARY_PATH='' LOCALBASE=/opt/openrobots PKGMANDIR=man make -j4 -f Makefile all; /usr/bin/cmake -H/local/robotpkg/var/tmp/robotpkg/wip/py-dynamic-graph-v3/work/dynamic-graph-python-3.2.0 -B/local/robotpkg/var/tmp/robotpkg/wip/py-dynamic-graph-v3/work/dynamic-graph-python-3.2.0 --check-build-system CMakeFiles/Makefile.cmake 0 /usr/bin/cmake -E cmake_progress_start /local/robotpkg/var/tmp/robotpkg/wip/py-dynamic-graph-v3/work/dynamic-graph-python-3.2.0/CMakeFiles /local/robotpkg/var/tmp/robotpkg/wip/py-dynamic-graph-v3/work/dynamic-graph-python-3.2.0/CMakeFiles/progress.marks make -f CMakeFiles/Makefile2 all make[1]: Entering directory `/local/robotpkg/var/tmp/robotpkg/wip/py-dynamic-graph-v3/work/dynamic-graph-python-3.2.0' make -f src/CMakeFiles/dynamic-graph-python.dir/build.make src/CMakeFiles/dynamic-graph-python.dir/depend make[2]: Entering directory `/local/robotpkg/var/tmp/robotpkg/wip/py-dynamic-graph-v3/work/dynamic-graph-python-3.2.0' cd /local/robotpkg/var/tmp/robotpkg/wip/py-dynamic-graph-v3/work/dynamic-graph-python-3.2.0 && /usr/bin/cmake -E cmake_depends "Unix Makefiles" /local/robotpkg/var/tmp/robotpkg/wip/py-dynamic-graph-v3/work/dynamic-graph-python-3.2.0 /local/robotpkg/var/tmp/robotpkg/wip/py-dynamic-graph-v3/work/dynamic-graph-python-3.2.0/src /local/robotpkg/var/tmp/robotpkg/wip/py-dynamic-graph-v3/work/dynamic-graph-python-3.2.0 /local/robotpkg/var/tmp/robotpkg/wip/py-dynamic-graph-v3/work/dynamic-graph-python-3.2.0/src /local/robotpkg/var/tmp/robotpkg/wip/py-dynamic-graph-v3/work/dynamic-graph-python-3.2.0/src/CMakeFiles/dynamic-graph-python.dir/DependInfo.cmake --color= make -f src/CMakeFiles/dynamic_graph___init__.pyc.dir/build.make src/CMakeFiles/dynamic_graph___init__.pyc.dir/depend make -f src/CMakeFiles/dynamic_graph_attrpath.pyc.dir/build.make src/CMakeFiles/dynamic_graph_attrpath.pyc.dir/depend make -f src/CMakeFiles/dynamic_graph_entity.pyc.dir/build.make src/CMakeFiles/dynamic_graph_entity.pyc.dir/depend make[2]: Entering directory `/local/robotpkg/var/tmp/robotpkg/wip/py-dynamic-graph-v3/work/dynamic-graph-python-3.2.0' cd /local/robotpkg/var/tmp/robotpkg/wip/py-dynamic-graph-v3/work/dynamic-graph-python-3.2.0 && /usr/bin/cmake -E cmake_depends "Unix Makefiles" /local/robotpkg/var/tmp/robotpkg/wip/py-dynamic-graph-v3/work/dynamic-graph-python-3.2.0 /local/robotpkg/var/tmp/robotpkg/wip/py-dynamic-graph-v3/work/dynamic-graph-python-3.2.0/src /local/robotpkg/var/tmp/robotpkg/wip/py-dynamic-graph-v3/work/dynamic-graph-python-3.2.0 /local/robotpkg/var/tmp/robotpkg/wip/py-dynamic-graph-v3/work/dynamic-graph-python-3.2.0/src /local/robotpkg/var/tmp/robotpkg/wip/py-dynamic-graph-v3/work/dynamic-graph-python-3.2.0/src/CMakeFiles/dynamic_graph___init__.pyc.dir/DependInfo.cmake --color= make[2]: Entering directory `/local/robotpkg/var/tmp/robotpkg/wip/py-dynamic-graph-v3/work/dynamic-graph-python-3.2.0' cd /local/robotpkg/var/tmp/robotpkg/wip/py-dynamic-graph-v3/work/dynamic-graph-python-3.2.0 && /usr/bin/cmake -E cmake_depends "Unix Makefiles" /local/robotpkg/var/tmp/robotpkg/wip/py-dynamic-graph-v3/work/dynamic-graph-python-3.2.0 /local/robotpkg/var/tmp/robotpkg/wip/py-dynamic-graph-v3/work/dynamic-graph-python-3.2.0/src /local/robotpkg/var/tmp/robotpkg/wip/py-dynamic-graph-v3/work/dynamic-graph-python-3.2.0 /local/robotpkg/var/tmp/robotpkg/wip/py-dynamic-graph-v3/work/dynamic-graph-python-3.2.0/src /local/robotpkg/var/tmp/robotpkg/wip/py-dynamic-graph-v3/work/dynamic-graph-python-3.2.0/src/CMakeFiles/dynamic_graph_attrpath.pyc.dir/DependInfo.cmake --color= make[2]: Entering directory `/local/robotpkg/var/tmp/robotpkg/wip/py-dynamic-graph-v3/work/dynamic-graph-python-3.2.0' cd /local/robotpkg/var/tmp/robotpkg/wip/py-dynamic-graph-v3/work/dynamic-graph-python-3.2.0 && /usr/bin/cmake -E cmake_depends "Unix Makefiles" /local/robotpkg/var/tmp/robotpkg/wip/py-dynamic-graph-v3/work/dynamic-graph-python-3.2.0 /local/robotpkg/var/tmp/robotpkg/wip/py-dynamic-graph-v3/work/dynamic-graph-python-3.2.0/src /local/robotpkg/var/tmp/robotpkg/wip/py-dynamic-graph-v3/work/dynamic-graph-python-3.2.0 /local/robotpkg/var/tmp/robotpkg/wip/py-dynamic-graph-v3/work/dynamic-graph-python-3.2.0/src /local/robotpkg/var/tmp/robotpkg/wip/py-dynamic-graph-v3/work/dynamic-graph-python-3.2.0/src/CMakeFiles/dynamic_graph_entity.pyc.dir/DependInfo.cmake --color= Scanning dependencies of target dynamic_graph_attrpath.pyc make[2]: Leaving directory `/local/robotpkg/var/tmp/robotpkg/wip/py-dynamic-graph-v3/work/dynamic-graph-python-3.2.0' make -f src/CMakeFiles/dynamic_graph_attrpath.pyc.dir/build.make src/CMakeFiles/dynamic_graph_attrpath.pyc.dir/build make[2]: Entering directory `/local/robotpkg/var/tmp/robotpkg/wip/py-dynamic-graph-v3/work/dynamic-graph-python-3.2.0' cd /local/robotpkg/var/tmp/robotpkg/wip/py-dynamic-graph-v3/work/dynamic-graph-python-3.2.0/src && /usr/bin/python3.4 /local/robotpkg/var/tmp/robotpkg/wip/py-dynamic-graph-v3/work/dynamic-graph-python-3.2.0/cmake/compile.py /local/robotpkg/var/tmp/robotpkg/wip/py-dynamic-graph-v3/work/dynamic-graph-python-3.2.0/src /local/robotpkg/var/tmp/robotpkg/wip/py-dynamic-graph-v3/work/dynamic-graph-python-3.2.0/src dynamic_graph/attrpath.py Scanning dependencies of target dynamic_graph_entity.pyc Scanning dependencies of target dynamic_graph___init__.pyc make[2]: Leaving directory `/local/robotpkg/var/tmp/robotpkg/wip/py-dynamic-graph-v3/work/dynamic-graph-python-3.2.0' make -f src/CMakeFiles/dynamic_graph_entity.pyc.dir/build.make src/CMakeFiles/dynamic_graph_entity.pyc.dir/build make[2]: Leaving directory `/local/robotpkg/var/tmp/robotpkg/wip/py-dynamic-graph-v3/work/dynamic-graph-python-3.2.0' make -f src/CMakeFiles/dynamic_graph___init__.pyc.dir/build.make src/CMakeFiles/dynamic_graph___init__.pyc.dir/build make[2]: Entering directory `/local/robotpkg/var/tmp/robotpkg/wip/py-dynamic-graph-v3/work/dynamic-graph-python-3.2.0' cd /local/robotpkg/var/tmp/robotpkg/wip/py-dynamic-graph-v3/work/dynamic-graph-python-3.2.0/src && /usr/bin/python3.4 /local/robotpkg/var/tmp/robotpkg/wip/py-dynamic-graph-v3/work/dynamic-graph-python-3.2.0/cmake/compile.py /local/robotpkg/var/tmp/robotpkg/wip/py-dynamic-graph-v3/work/dynamic-graph-python-3.2.0/src /local/robotpkg/var/tmp/robotpkg/wip/py-dynamic-graph-v3/work/dynamic-graph-python-3.2.0/src dynamic_graph/__init__.py make[2]: Entering directory `/local/robotpkg/var/tmp/robotpkg/wip/py-dynamic-graph-v3/work/dynamic-graph-python-3.2.0' cd /local/robotpkg/var/tmp/robotpkg/wip/py-dynamic-graph-v3/work/dynamic-graph-python-3.2.0/src && /usr/bin/python3.4 /local/robotpkg/var/tmp/robotpkg/wip/py-dynamic-graph-v3/work/dynamic-graph-python-3.2.0/cmake/compile.py /local/robotpkg/var/tmp/robotpkg/wip/py-dynamic-graph-v3/work/dynamic-graph-python-3.2.0/src /local/robotpkg/var/tmp/robotpkg/wip/py-dynamic-graph-v3/work/dynamic-graph-python-3.2.0/src dynamic_graph/entity.py Scanning dependencies of target dynamic-graph-python make[2]: Leaving directory `/local/robotpkg/var/tmp/robotpkg/wip/py-dynamic-graph-v3/work/dynamic-graph-python-3.2.0' make -f src/CMakeFiles/dynamic-graph-python.dir/build.make src/CMakeFiles/dynamic-graph-python.dir/build make[2]: Entering directory `/local/robotpkg/var/tmp/robotpkg/wip/py-dynamic-graph-v3/work/dynamic-graph-python-3.2.0' /usr/bin/cmake -E cmake_progress_report /local/robotpkg/var/tmp/robotpkg/wip/py-dynamic-graph-v3/work/dynamic-graph-python-3.2.0/CMakeFiles 11 [ 7%] Building CXX object src/CMakeFiles/dynamic-graph-python.dir/interpreter.cc.o cd /local/robotpkg/var/tmp/robotpkg/wip/py-dynamic-graph-v3/work/dynamic-graph-python-3.2.0/src && /usr/bin/g++ -Ddynamic_graph_python_EXPORTS -pedantic -Wno-long-long -Wall -Wextra -Wcast-align -Wcast-qual -Wformat -Wwrite-strings -Wconversion -pipe -O3 -DNDEBUG -fPIC -I/local/robotpkg/var/tmp/robotpkg/wip/py-dynamic-graph-v3/work/dynamic-graph-python-3.2.0 -I/local/robotpkg/var/tmp/robotpkg/wip/py-dynamic-graph-v3/work/dynamic-graph-python-3.2.0/include -isystem /usr/include/eigen3 -isystem /opt/openrobots/include -isystem /usr/include/python3.4 -I/local/robotpkg/var/tmp/robotpkg/wip/py-dynamic-graph-v3/work/dynamic-graph-python-3.2.0/src -o CMakeFiles/dynamic-graph-python.dir/interpreter.cc.o -c /local/robotpkg/var/tmp/robotpkg/wip/py-dynamic-graph-v3/work/dynamic-graph-python-3.2.0/src/interpreter.cc make[2]: Leaving directory `/local/robotpkg/var/tmp/robotpkg/wip/py-dynamic-graph-v3/work/dynamic-graph-python-3.2.0' /usr/bin/cmake -E cmake_progress_report /local/robotpkg/var/tmp/robotpkg/wip/py-dynamic-graph-v3/work/dynamic-graph-python-3.2.0/CMakeFiles Failed to compile python script: '/local/robotpkg/var/tmp/robotpkg/wip/py-dynamic-graph-v3/work/dynamic-graph-python-3.2.0/src/dynamic_graph/entity.py' Exception raised: File "/local/robotpkg/var/tmp/robotpkg/wip/py-dynamic-graph-v3/work/dynamic-graph-python-3.2.0/src/dynamic_graph/entity.py", line 151 print self.__doc__ ^ SyntaxError: Missing parentheses in call to 'print' [ 7%] make[2]: Leaving directory `/local/robotpkg/var/tmp/robotpkg/wip/py-dynamic-graph-v3/work/dynamic-graph-python-3.2.0' /usr/bin/cmake -E cmake_progress_report /local/robotpkg/var/tmp/robotpkg/wip/py-dynamic-graph-v3/work/dynamic-graph-python-3.2.0/CMakeFiles Built target dynamic_graph___init__.pyc make[2]: *** [src/CMakeFiles/dynamic_graph_entity.pyc] Error 1 make -f src/CMakeFiles/dynamic_graph_matlab.pyc.dir/build.make src/CMakeFiles/dynamic_graph_matlab.pyc.dir/depend make[2]: Leaving directory `/local/robotpkg/var/tmp/robotpkg/wip/py-dynamic-graph-v3/work/dynamic-graph-python-3.2.0' make[1]: *** [src/CMakeFiles/dynamic_graph_entity.pyc.dir/all] Error 2 make[1]: *** Waiting for unfinished jobs.... make[2]: Entering directory `/local/robotpkg/var/tmp/robotpkg/wip/py-dynamic-graph-v3/work/dynamic-graph-python-3.2.0' cd /local/robotpkg/var/tmp/robotpkg/wip/py-dynamic-graph-v3/work/dynamic-graph-python-3.2.0 && /usr/bin/cmake -E cmake_depends "Unix Makefiles" /local/robotpkg/var/tmp/robotpkg/wip/py-dynamic-graph-v3/work/dynamic-graph-python-3.2.0 /local/robotpkg/var/tmp/robotpkg/wip/py-dynamic-graph-v3/work/dynamic-graph-python-3.2.0/src /local/robotpkg/var/tmp/robotpkg/wip/py-dynamic-graph-v3/work/dynamic-graph-python-3.2.0 /local/robotpkg/var/tmp/robotpkg/wip/py-dynamic-graph-v3/work/dynamic-graph-python-3.2.0/src /local/robotpkg/var/tmp/robotpkg/wip/py-dynamic-graph-v3/work/dynamic-graph-python-3.2.0/src/CMakeFiles/dynamic_graph_matlab.pyc.dir/DependInfo.cmake --color= [ 7%] Built target dynamic_graph_attrpath.pyc Scanning dependencies of target dynamic_graph_matlab.pyc make[2]: Leaving directory `/local/robotpkg/var/tmp/robotpkg/wip/py-dynamic-graph-v3/work/dynamic-graph-python-3.2.0' make -f src/CMakeFiles/dynamic_graph_matlab.pyc.dir/build.make src/CMakeFiles/dynamic_graph_matlab.pyc.dir/build make[2]: Entering directory `/local/robotpkg/var/tmp/robotpkg/wip/py-dynamic-graph-v3/work/dynamic-graph-python-3.2.0' cd /local/robotpkg/var/tmp/robotpkg/wip/py-dynamic-graph-v3/work/dynamic-graph-python-3.2.0/src && /usr/bin/python3.4 /local/robotpkg/var/tmp/robotpkg/wip/py-dynamic-graph-v3/work/dynamic-graph-python-3.2.0/cmake/compile.py /local/robotpkg/var/tmp/robotpkg/wip/py-dynamic-graph-v3/work/dynamic-graph-python-3.2.0/src /local/robotpkg/var/tmp/robotpkg/wip/py-dynamic-graph-v3/work/dynamic-graph-python-3.2.0/src dynamic_graph/matlab.py make[2]: Leaving directory `/local/robotpkg/var/tmp/robotpkg/wip/py-dynamic-graph-v3/work/dynamic-graph-python-3.2.0' /usr/bin/cmake -E cmake_progress_report /local/robotpkg/var/tmp/robotpkg/wip/py-dynamic-graph-v3/work/dynamic-graph-python-3.2.0/CMakeFiles [ 7%] Built target dynamic_graph_matlab.pyc /local/robotpkg/var/tmp/robotpkg/wip/py-dynamic-graph-v3/work/dynamic-graph-python-3.2.0/src/interpreter.cc: In function 'bool dynamicgraph::python::HandleErr(std::string&, PyObject*, PyObject*, int)': /local/robotpkg/var/tmp/robotpkg/wip/py-dynamic-graph-v3/work/dynamic-graph-python-3.2.0/src/interpreter.cc:89:55: error: 'PyString_AsString' was not declared in this scope (PyString_AsString(PyList_GET_ITEM(pyerr, i))); ^ /local/robotpkg/var/tmp/robotpkg/wip/py-dynamic-graph-v3/work/dynamic-graph-python-3.2.0/src/interpreter.cc:93:51: error: 'PyString_FromString' was not declared in this scope pyerr = PyString_FromString(stringRes.c_str()); ^ /local/robotpkg/var/tmp/robotpkg/wip/py-dynamic-graph-v3/work/dynamic-graph-python-3.2.0/src/interpreter.cc:94:34: error: 'PyString_AsString' was not declared in this scope err = PyString_AsString(pyerr); ^ /local/robotpkg/var/tmp/robotpkg/wip/py-dynamic-graph-v3/work/dynamic-graph-python-3.2.0/src/interpreter.cc:122:37: error: 'PyString_AsString' was not declared in this scope out = PyString_AsString(stdout_obj); ^ /local/robotpkg/var/tmp/robotpkg/wip/py-dynamic-graph-v3/work/dynamic-graph-python-3.2.0/src/interpreter.cc: In destructor 'dynamicgraph::python::Interpreter::~Interpreter()': /local/robotpkg/var/tmp/robotpkg/wip/py-dynamic-graph-v3/work/dynamic-graph-python-3.2.0/src/interpreter.cc:178:59: error: 'PyString_AS_STRING' was not declared in this scope std::string oAttrName (PyString_AS_STRING(poAttrName)); ^ /local/robotpkg/var/tmp/robotpkg/wip/py-dynamic-graph-v3/work/dynamic-graph-python-3.2.0/src/interpreter.cc: In member function 'void dynamicgraph::python::Interpreter::python(const string&, std::string&, std::string&, std::string&)': /local/robotpkg/var/tmp/robotpkg/wip/py-dynamic-graph-v3/work/dynamic-graph-python-3.2.0/src/interpreter.cc:262:37: error: 'PyString_AsString' was not declared in this scope out = PyString_AsString(stdout_obj); ^ /local/robotpkg/var/tmp/robotpkg/wip/py-dynamic-graph-v3/work/dynamic-graph-python-3.2.0/src/interpreter.cc: In member function 'void dynamicgraph::python::Interpreter::runMain()': /local/robotpkg/var/tmp/robotpkg/wip/py-dynamic-graph-v3/work/dynamic-graph-python-3.2.0/src/interpreter.cc:331:37: error: cannot convert 'char**' to 'wchar_t**' for argument '2' to 'int Py_Main(int, wchar_t**)' Py_Main(1,const_cast(argv)); ^ make[2]: *** [src/CMakeFiles/dynamic-graph-python.dir/interpreter.cc.o] Error 1 make[1]: *** [src/CMakeFiles/dynamic-graph-python.dir/all] Error 2 make: *** [all] Error 2 make[2]: Leaving directory `/local/robotpkg/var/tmp/robotpkg/wip/py-dynamic-graph-v3/work/dynamic-graph-python-3.2.0' make[1]: Leaving directory `/local/robotpkg/var/tmp/robotpkg/wip/py-dynamic-graph-v3/work/dynamic-graph-python-3.2.0'