robotpkg/wip/prf-gazebo-ros-pkgs bulk build results

Log for prf-gazebo-ros-pkgs-2.6.7r4 on Ubuntu-14.04-x86_64: build.log (Back)

--- Environment --- _overrides_lang_ros_message_generation_PKGREQD=ros-message-generation>=0.2<0.3 ros-message-generation>=0.2<0.3 ros-message-generation>=0.2<0.3 _override_vars_interfaces_ros_common_msgs=PKGREQD PKGREQD PKGREQD ROS_LANG_DISABLE=geneus:gennodejs LOWER_ARCH=x86_64 OPSYS=Ubuntu _overrides_interfaces_ros_common_msgs_PKGREQD=ros-common-msgs>=1.11<1.12 ros-common-msgs>=1.11<1.12 ros-common-msgs>=1.11<1.12 GZIP_CMD=/bin/gzip OS_KERNEL_VERSION=3.13.0-160-generic _override_vars_pkgtools_pkg_install=PKGREQD PKGREQD PKGREQD LC_TIME=C PKGREPO2DEB=/local/robotpkg/sbin/pkgrepo2deb BULKBASE=/opt/openrobots ROS_PACKAGE_PATH=/opt/ros/indigo ECHO_N=echo -n _overrides_pkgtools_pkg_install_PKGREQD=pkg_install>=20110805.9 pkg_install>=20110805.9 pkg_install>=20110805.9 OS_VERSION=14.04 _override_vars_devel_boost_headers=PKGREQD PKGREQD PKGREQD ROBOTPKG_BASE=/local/robotpkg PYTHON_LIB=/usr/lib/x86_64-linux-gnu/libpython2.7.so OLDPWD=/local/robotpkg/var/lib/robotpkg/wip/libmove3d-hri _override_vars_pkgtools_tnftp=PKGREQD PKGREQD PYTHON=/usr/bin/python2.7 _overrides_devel_boost_headers_PKGREQD=boost-headers>=1.34.1 boost-headers>=1.34.1 boost-headers>=1.34.1 PKG_DBDIR=/opt/openrobots/var/db/robotpkg hline="$bf======================================================================$rm" _override_vars_devel_ros_catkin=PKGREQD PKGREQD PKGREQD MACHINE_ARCH=x86_64 _overrides_pkgtools_tnftp_PKGREQD=tnftp>=20130505~ssl tnftp>=20130505~ssl FC=false LC_CTYPE=C NOSETESTS=/usr/bin/nosetests-2.7 _override_vars_devel_ros_class_loader=PKGREQD PKGREQD PKGREQD _overrides_devel_ros_catkin_PKGREQD=ros-catkin>=0.6<0.7 ros-catkin>=0.6<0.7 ros-catkin>=0.6<0.7 EXPECT_TARGETS=fetch install package LC_MONETARY=C PKG_CONFIG=/usr/bin/pkg-config _override_vars_devel_boost_libs=PKGREQD PKGREQD PKGREQD PKGREQD PKGREQD PKGREQD PKGREQD PKGREQD PKGREQD PKGREQD PKGREQD PKGREQD _override_vars_graphics_ros_urdf=PKGREQD PKGREQD PKGREQD MAKEFLAGS= --no-print-directory -- PKGREQD.cmdline=prf-gazebo-ros-pkgs-2.6.7r4 RECURSIVE_PKGPATH=wip/prf-gazebo-ros-pkgs\ tag=Ubuntu-14.04-x86_64 BULK_LOGDIR=/local/robotpkg/var/log/bulk BULKBASE=/opt/openrobots LOCALBASE=/opt/openrobots PKG_DBDIR=/opt/openrobots/var/db/robotpkg EXPECT_TARGETS=fetch\ install\ package _override_vars_pkgtools_digest=PKGREQD PKGREQD CPP=/usr/bin/gcc -E _overrides_devel_ros_class_loader_PKGREQD=ros-class-loader>=0.3<0.4 ros-class-loader>=0.3<0.4 ros-class-loader>=0.3<0.4 LOWER_OPSYS=ubuntu _overrides_devel_boost_libs_PKGREQD=boost-libs>=1.34.1 boost-libs>=1.34.1 boost-libs>=1.34.1 boost-libs>=1.34.1 boost-libs>=1.34.1 boost-libs>=1.34.1 boost-libs>=1.34.1 boost-libs>=1.34.1 boost-libs>=1.34.1 boost-libs>=1.34.1 boost-libs>=1.34.1 boost-libs>=1.34.1 bf= _overrides_graphics_ros_urdf_PKGREQD=ros-urdf>=1.11<1.12 ros-urdf>=1.11<1.12 ros-urdf>=1.11<1.12 _override_vars_pkgtools_pkgrepo2deb=PKGREQD PKGREQD _overrides_pkgtools_digest_PKGREQD=digest>=20080510 digest>=20080510 _override_vars_lang_ros_message_runtime=PKGREQD PKGREQD PKGREQD GCC=/usr/bin/gcc DIGEST=/opt/openrobots/sbin/robotpkg_digest TAR=/bin/tar LOWER_OS_VERSION=14.04 MACHINE_KERNEL=Linux-3.13.0-160-generic-x86_64 _overrides_pkgtools_pkgrepo2deb_PKGREQD=pkgrepo2deb>=1.4 pkgrepo2deb>=1.4 OWNER_GID=robots _override_vars_motion_ros_control_toolbox=PKGREQD PKGREQD PKGREQD _override_vars_middleware_ros_comm=PKGREQD PKGREQD PKGREQD _overrides_lang_ros_message_runtime_PKGREQD=ros-message-runtime>=0.4<0.5 ros-message-runtime>=0.4<0.5 ros-message-runtime>=0.4<0.5 PKGTOOLS_VERSION=20110805.9 RECURSIVE_PKGPATH=wip/prf-gazebo-ros-pkgs PKG_CONFIG_PATH=/opt/openrobots/lib/pkgconfig:/opt/ros/indigo/lib/pkgconfig _overrides_motion_ros_control_toolbox_PKGREQD=ros-control-toolbox>=1.13<1.15 ros-control-toolbox>=1.13<1.15 ros-control-toolbox>=1.13<1.15 _overrides_middleware_ros_comm_PKGREQD=ros-comm>=1.11<1.12 ros-comm>=1.11<1.12 ros-comm>=1.11<1.12 GXX=/usr/bin/g++ TERM=linux MAKECONF=/opt/robotpkg/etc/robotpkg-wip.conf _override_vars_archivers_pax=PKGREQD PKGREQD rm= PYTHON_INCLUDE_CONFIG=/usr/include/x86_64-linux-gnu/python2.7/ LC_COLLATE=C OS_KERNEL=Linux ROBOTPKG_TRUSTED_ENV=robotpkg PATH=/usr/local/sbin:/usr/local/bin:/usr/bin:/usr/sbin:/sbin:/bin _overrides_archivers_pax_PKGREQD=pax pax PYTHON27_INCLUDE=/usr/include/python2.7/ CMAKE=/usr/bin/cmake CXXCPP=/usr/bin/g++ -E MAKELEVEL=4 _override_vars_wip_prf_ros_control=PKGREQD PKGREQD PKGREQD DEB_HOST_MULTIARCH=x86_64-linux-gnu MACHINE_PLATFORM=Ubuntu-14.04-x86_64 ROBOTPKG_DIR=/local/robotpkg/var/lib/robotpkg TNFTP=/opt/openrobots/sbin/tnftp LANG=C _overrides_wip_prf_ros_control_PKGREQD=prf-ros-control>=0.2 prf-ros-control>=0.2 prf-ros-control>=0.2 MAKEOVERRIDES=PKGREQD.cmdline=prf-gazebo-ros-pkgs-2.6.7r4 RECURSIVE_PKGPATH=wip/prf-gazebo-ros-pkgs\ tag=Ubuntu-14.04-x86_64 BULK_LOGDIR=/local/robotpkg/var/log/bulk BULKBASE=/opt/openrobots LOCALBASE=/opt/openrobots PKG_DBDIR=/opt/openrobots/var/db/robotpkg EXPECT_TARGETS=fetch\ install\ package LC_MESSAGES=C _override_vars_devel_ros_ros=PKGREQD PKGREQD PKGREQD tag=Ubuntu-14.04-x86_64 CXX=/usr/bin/g++ _override_vars_wip_prf_gazebo_ros_pkgs=PKGREQD _overrides_devel_ros_ros_PKGREQD=ros-ros>=1.11<1.12 ros-ros>=1.11<1.12 ros-ros>=1.11<1.12 _override_vars_devel_ros_pluginlib=PKGREQD PKGREQD PKGREQD LOCALBASE=/opt/openrobots _override_vars_pkgtools_pkg_config=PKGREQD PKGREQD PKGREQD OWNER_UID=rbulk BULK_LOGDIR=/local/robotpkg/var/log/bulk _overrides_devel_ros_pluginlib_PKGREQD=ros-pluginlib>=1.10<1.11 ros-pluginlib>=1.10<1.11 ros-pluginlib>=1.10<1.11 _overrides_wip_prf_gazebo_ros_pkgs_PKGREQD=prf-gazebo-ros-pkgs-2.6.7r4 _override_vars_middleware_ros_actionlib=PKGREQD PKGREQD PKGREQD ZCAT=/bin/zcat _override_vars_math_ros_geometry=PKGREQD PKGREQD PKGREQD PAX=/bin/pax LOWER_OS_KERNEL=linux _overrides_pkgtools_pkg_config_PKGREQD=pkg-config>=0.22 pkg-config>=0.22 pkg-config>=0.22 _override_vars_math_eigen3=PKGREQD PKGREQD PKGREQD GPG=/usr/bin/gpg --homedir=/opt/robotpkg/etc/gnupg PYTHON27_LIB=/usr/lib/x86_64-linux-gnu/libpython2.7.so _overrides_middleware_ros_actionlib_PKGREQD=ros-actionlib>=1.11<1.12 ros-actionlib>=1.11<1.12 ros-actionlib>=1.11<1.12 _overrides_math_ros_geometry_PKGREQD=ros-geometry>=1.11<1.12 ros-geometry>=1.11<1.12 ros-geometry>=1.11<1.12 PYTHON_INCLUDE=/usr/include/python2.7/ PWD=/local/robotpkg/var/lib/robotpkg/wip/prf-gazebo-ros-pkgs _override_vars_interfaces_ros_std_msgs=PKGREQD PKGREQD PKGREQD _overrides_math_eigen3_PKGREQD=eigen3>=3.0.0 eigen3>=3.0.0 eigen3>=3.0.0 _override_vars_middleware_ros_genmsg=PKGREQD PKGREQD PKGREQD PYTHON27=/usr/bin/python2.7 _ROBOTPKG_NOW=1018144857 _overrides_interfaces_ros_std_msgs_PKGREQD=ros-std-msgs>=0.5 ros-std-msgs>=0.5 ros-std-msgs>=0.5 PYTHONPATH=/usr/lib/python2.7/dist-packages:/opt/ros/indigo/lib/python2.7/dist-packages LC_NUMERIC=C _overrides_middleware_ros_genmsg_PKGREQD=ros-genmsg>=0.5<0.6 ros-genmsg>=0.5<0.6 ros-genmsg>=0.5<0.6 CC=/usr/bin/gcc MFLAGS=- --no-print-directory _override_vars_lang_ros_message_generation=PKGREQD PKGREQD PKGREQD PKG_CONFIG_LIBDIR=/usr/lib/x86_64-linux-gnu/pkgconfig:/usr/lib/pkgconfig:/usr/share/pkgconfig NODENAME=fluffy64-ubuntu1404 --- Running set -e; \ cd /local/robotpkg/var/tmp/robotpkg/wip/prf-gazebo-ros-pkgs/work/gazebo_ros_pkgs-2.6.7 && cd /local/robotpkg/var/tmp/robotpkg/wip/prf-gazebo-ros-pkgs/work/gazebo_ros_pkgs-2.6.7/build && /usr/bin/env MAKELEVEL= MAKEOVERRIDES= MAKEFLAGS= MFLAGS= 'CPPFLAGS=' 'CFLAGS=-pipe -O3 -DNDEBUG' 'LDFLAGS=' 'CXXFLAGS=-pipe -O3 -DNDEBUG' PREFIX='/opt/openrobots' HOME=/local/robotpkg/var/tmp/robotpkg/wip/prf-gazebo-ros-pkgs/work PATH='/opt/openrobots/sbin:/opt/ros/indigo/bin:/usr/local/sbin:/usr/local/bin:/usr/bin:/usr/sbin:/sbin:/bin' LD_LIBRARY_PATH='' LOCALBASE=/opt/openrobots PKGMANDIR=man make -j4 -f Makefile all; /usr/bin/cmake -H/local/robotpkg/var/tmp/robotpkg/wip/prf-gazebo-ros-pkgs/work/gazebo_ros_pkgs-2.6.7 -B/local/robotpkg/var/tmp/robotpkg/wip/prf-gazebo-ros-pkgs/work/gazebo_ros_pkgs-2.6.7/build --check-build-system CMakeFiles/Makefile.cmake 0 /usr/bin/cmake -E cmake_progress_start /local/robotpkg/var/tmp/robotpkg/wip/prf-gazebo-ros-pkgs/work/gazebo_ros_pkgs-2.6.7/build/CMakeFiles /local/robotpkg/var/tmp/robotpkg/wip/prf-gazebo-ros-pkgs/work/gazebo_ros_pkgs-2.6.7/build/CMakeFiles/progress.marks make -f CMakeFiles/Makefile2 all make[1]: Entering directory `/local/robotpkg/var/tmp/robotpkg/wip/prf-gazebo-ros-pkgs/work/gazebo_ros_pkgs-2.6.7/build' make -f gazebo_msgs/CMakeFiles/_gazebo_msgs_generate_messages_check_deps_GetModelProperties.dir/build.make gazebo_msgs/CMakeFiles/_gazebo_msgs_generate_messages_check_deps_GetModelProperties.dir/depend make[2]: Entering directory `/local/robotpkg/var/tmp/robotpkg/wip/prf-gazebo-ros-pkgs/work/gazebo_ros_pkgs-2.6.7/build' cd /local/robotpkg/var/tmp/robotpkg/wip/prf-gazebo-ros-pkgs/work/gazebo_ros_pkgs-2.6.7/build && /usr/bin/cmake -E cmake_depends "Unix Makefiles" /local/robotpkg/var/tmp/robotpkg/wip/prf-gazebo-ros-pkgs/work/gazebo_ros_pkgs-2.6.7 /local/robotpkg/var/tmp/robotpkg/wip/prf-gazebo-ros-pkgs/work/gazebo_ros_pkgs-2.6.7/gazebo_msgs /local/robotpkg/var/tmp/robotpkg/wip/prf-gazebo-ros-pkgs/work/gazebo_ros_pkgs-2.6.7/build /local/robotpkg/var/tmp/robotpkg/wip/prf-gazebo-ros-pkgs/work/gazebo_ros_pkgs-2.6.7/build/gazebo_msgs /local/robotpkg/var/tmp/robotpkg/wip/prf-gazebo-ros-pkgs/work/gazebo_ros_pkgs-2.6.7/build/gazebo_msgs/CMakeFiles/_gazebo_msgs_generate_messages_check_deps_GetModelProperties.dir/DependInfo.cmake --color= make -f gazebo_msgs/CMakeFiles/std_msgs_generate_messages_py.dir/build.make gazebo_msgs/CMakeFiles/std_msgs_generate_messages_py.dir/depend make[2]: Entering directory `/local/robotpkg/var/tmp/robotpkg/wip/prf-gazebo-ros-pkgs/work/gazebo_ros_pkgs-2.6.7/build' cd /local/robotpkg/var/tmp/robotpkg/wip/prf-gazebo-ros-pkgs/work/gazebo_ros_pkgs-2.6.7/build && /usr/bin/cmake -E cmake_depends "Unix Makefiles" /local/robotpkg/var/tmp/robotpkg/wip/prf-gazebo-ros-pkgs/work/gazebo_ros_pkgs-2.6.7 /local/robotpkg/var/tmp/robotpkg/wip/prf-gazebo-ros-pkgs/work/gazebo_ros_pkgs-2.6.7/gazebo_msgs /local/robotpkg/var/tmp/robotpkg/wip/prf-gazebo-ros-pkgs/work/gazebo_ros_pkgs-2.6.7/build /local/robotpkg/var/tmp/robotpkg/wip/prf-gazebo-ros-pkgs/work/gazebo_ros_pkgs-2.6.7/build/gazebo_msgs /local/robotpkg/var/tmp/robotpkg/wip/prf-gazebo-ros-pkgs/work/gazebo_ros_pkgs-2.6.7/build/gazebo_msgs/CMakeFiles/std_msgs_generate_messages_py.dir/DependInfo.cmake --color= make -f gazebo_msgs/CMakeFiles/sensor_msgs_generate_messages_py.dir/build.make gazebo_msgs/CMakeFiles/sensor_msgs_generate_messages_py.dir/depend make -f gazebo_msgs/CMakeFiles/trajectory_msgs_generate_messages_py.dir/build.make gazebo_msgs/CMakeFiles/trajectory_msgs_generate_messages_py.dir/depend make[2]: Entering directory `/local/robotpkg/var/tmp/robotpkg/wip/prf-gazebo-ros-pkgs/work/gazebo_ros_pkgs-2.6.7/build' cd /local/robotpkg/var/tmp/robotpkg/wip/prf-gazebo-ros-pkgs/work/gazebo_ros_pkgs-2.6.7/build && /usr/bin/cmake -E cmake_depends "Unix Makefiles" /local/robotpkg/var/tmp/robotpkg/wip/prf-gazebo-ros-pkgs/work/gazebo_ros_pkgs-2.6.7 /local/robotpkg/var/tmp/robotpkg/wip/prf-gazebo-ros-pkgs/work/gazebo_ros_pkgs-2.6.7/gazebo_msgs /local/robotpkg/var/tmp/robotpkg/wip/prf-gazebo-ros-pkgs/work/gazebo_ros_pkgs-2.6.7/build /local/robotpkg/var/tmp/robotpkg/wip/prf-gazebo-ros-pkgs/work/gazebo_ros_pkgs-2.6.7/build/gazebo_msgs /local/robotpkg/var/tmp/robotpkg/wip/prf-gazebo-ros-pkgs/work/gazebo_ros_pkgs-2.6.7/build/gazebo_msgs/CMakeFiles/sensor_msgs_generate_messages_py.dir/DependInfo.cmake --color= make[2]: Entering directory `/local/robotpkg/var/tmp/robotpkg/wip/prf-gazebo-ros-pkgs/work/gazebo_ros_pkgs-2.6.7/build' cd /local/robotpkg/var/tmp/robotpkg/wip/prf-gazebo-ros-pkgs/work/gazebo_ros_pkgs-2.6.7/build && /usr/bin/cmake -E cmake_depends "Unix Makefiles" /local/robotpkg/var/tmp/robotpkg/wip/prf-gazebo-ros-pkgs/work/gazebo_ros_pkgs-2.6.7 /local/robotpkg/var/tmp/robotpkg/wip/prf-gazebo-ros-pkgs/work/gazebo_ros_pkgs-2.6.7/gazebo_msgs /local/robotpkg/var/tmp/robotpkg/wip/prf-gazebo-ros-pkgs/work/gazebo_ros_pkgs-2.6.7/build /local/robotpkg/var/tmp/robotpkg/wip/prf-gazebo-ros-pkgs/work/gazebo_ros_pkgs-2.6.7/build/gazebo_msgs /local/robotpkg/var/tmp/robotpkg/wip/prf-gazebo-ros-pkgs/work/gazebo_ros_pkgs-2.6.7/build/gazebo_msgs/CMakeFiles/trajectory_msgs_generate_messages_py.dir/DependInfo.cmake --color= Scanning dependencies of target _gazebo_msgs_generate_messages_check_deps_GetModelProperties make[2]: Leaving directory `/local/robotpkg/var/tmp/robotpkg/wip/prf-gazebo-ros-pkgs/work/gazebo_ros_pkgs-2.6.7/build' make -f gazebo_msgs/CMakeFiles/_gazebo_msgs_generate_messages_check_deps_GetModelProperties.dir/build.make gazebo_msgs/CMakeFiles/_gazebo_msgs_generate_messages_check_deps_GetModelProperties.dir/build Scanning dependencies of target std_msgs_generate_messages_py make[2]: Leaving directory `/local/robotpkg/var/tmp/robotpkg/wip/prf-gazebo-ros-pkgs/work/gazebo_ros_pkgs-2.6.7/build' make -f gazebo_msgs/CMakeFiles/std_msgs_generate_messages_py.dir/build.make gazebo_msgs/CMakeFiles/std_msgs_generate_messages_py.dir/build make[2]: Entering directory `/local/robotpkg/var/tmp/robotpkg/wip/prf-gazebo-ros-pkgs/work/gazebo_ros_pkgs-2.6.7/build' cd /local/robotpkg/var/tmp/robotpkg/wip/prf-gazebo-ros-pkgs/work/gazebo_ros_pkgs-2.6.7/build/gazebo_msgs && ../catkin_generated/env_cached.sh /usr/bin/python2.7 /opt/ros/indigo/share/genmsg/cmake//../../../lib/genmsg/genmsg_check_deps.py gazebo_msgs /local/robotpkg/var/tmp/robotpkg/wip/prf-gazebo-ros-pkgs/work/gazebo_ros_pkgs-2.6.7/gazebo_msgs/srv/GetModelProperties.srv make[2]: Entering directory `/local/robotpkg/var/tmp/robotpkg/wip/prf-gazebo-ros-pkgs/work/gazebo_ros_pkgs-2.6.7/build' make[2]: Nothing to be done for `gazebo_msgs/CMakeFiles/std_msgs_generate_messages_py.dir/build'. make[2]: Leaving directory `/local/robotpkg/var/tmp/robotpkg/wip/prf-gazebo-ros-pkgs/work/gazebo_ros_pkgs-2.6.7/build' /usr/bin/cmake -E cmake_progress_report /local/robotpkg/var/tmp/robotpkg/wip/prf-gazebo-ros-pkgs/work/gazebo_ros_pkgs-2.6.7/build/CMakeFiles Scanning dependencies of target trajectory_msgs_generate_messages_py make[2]: Leaving directory `/local/robotpkg/var/tmp/robotpkg/wip/prf-gazebo-ros-pkgs/work/gazebo_ros_pkgs-2.6.7/build' make -f gazebo_msgs/CMakeFiles/trajectory_msgs_generate_messages_py.dir/build.make gazebo_msgs/CMakeFiles/trajectory_msgs_generate_messages_py.dir/build Scanning dependencies of target sensor_msgs_generate_messages_py make[2]: Leaving directory `/local/robotpkg/var/tmp/robotpkg/wip/prf-gazebo-ros-pkgs/work/gazebo_ros_pkgs-2.6.7/build' make -f gazebo_msgs/CMakeFiles/sensor_msgs_generate_messages_py.dir/build.make gazebo_msgs/CMakeFiles/sensor_msgs_generate_messages_py.dir/build make[2]: Entering directory `/local/robotpkg/var/tmp/robotpkg/wip/prf-gazebo-ros-pkgs/work/gazebo_ros_pkgs-2.6.7/build' [ 0%] make[2]: Nothing to be done for `gazebo_msgs/CMakeFiles/trajectory_msgs_generate_messages_py.dir/build'. make[2]: Leaving directory `/local/robotpkg/var/tmp/robotpkg/wip/prf-gazebo-ros-pkgs/work/gazebo_ros_pkgs-2.6.7/build' /usr/bin/cmake -E cmake_progress_report /local/robotpkg/var/tmp/robotpkg/wip/prf-gazebo-ros-pkgs/work/gazebo_ros_pkgs-2.6.7/build/CMakeFiles make[2]: Entering directory `/local/robotpkg/var/tmp/robotpkg/wip/prf-gazebo-ros-pkgs/work/gazebo_ros_pkgs-2.6.7/build' make[2]: Nothing to be done for `gazebo_msgs/CMakeFiles/sensor_msgs_generate_messages_py.dir/build'. make[2]: Leaving directory `/local/robotpkg/var/tmp/robotpkg/wip/prf-gazebo-ros-pkgs/work/gazebo_ros_pkgs-2.6.7/build' /usr/bin/cmake -E cmake_progress_report /local/robotpkg/var/tmp/robotpkg/wip/prf-gazebo-ros-pkgs/work/gazebo_ros_pkgs-2.6.7/build/CMakeFiles Built target std_msgs_generate_messages_py [ 0%] [ 0%] Built target trajectory_msgs_generate_messages_py make -f gazebo_msgs/CMakeFiles/geometry_msgs_generate_messages_py.dir/build.make gazebo_msgs/CMakeFiles/geometry_msgs_generate_messages_py.dir/depend Built target sensor_msgs_generate_messages_py make[2]: Entering directory `/local/robotpkg/var/tmp/robotpkg/wip/prf-gazebo-ros-pkgs/work/gazebo_ros_pkgs-2.6.7/build' cd /local/robotpkg/var/tmp/robotpkg/wip/prf-gazebo-ros-pkgs/work/gazebo_ros_pkgs-2.6.7/build && /usr/bin/cmake -E cmake_depends "Unix Makefiles" /local/robotpkg/var/tmp/robotpkg/wip/prf-gazebo-ros-pkgs/work/gazebo_ros_pkgs-2.6.7 /local/robotpkg/var/tmp/robotpkg/wip/prf-gazebo-ros-pkgs/work/gazebo_ros_pkgs-2.6.7/gazebo_msgs /local/robotpkg/var/tmp/robotpkg/wip/prf-gazebo-ros-pkgs/work/gazebo_ros_pkgs-2.6.7/build /local/robotpkg/var/tmp/robotpkg/wip/prf-gazebo-ros-pkgs/work/gazebo_ros_pkgs-2.6.7/build/gazebo_msgs /local/robotpkg/var/tmp/robotpkg/wip/prf-gazebo-ros-pkgs/work/gazebo_ros_pkgs-2.6.7/build/gazebo_msgs/CMakeFiles/geometry_msgs_generate_messages_py.dir/DependInfo.cmake --color= make -f gazebo_msgs/CMakeFiles/_gazebo_msgs_generate_messages_check_deps_SetJointProperties.dir/build.make gazebo_msgs/CMakeFiles/_gazebo_msgs_generate_messages_check_deps_SetJointProperties.dir/depend make -f gazebo_msgs/CMakeFiles/_gazebo_msgs_generate_messages_check_deps_SetJointTrajectory.dir/build.make gazebo_msgs/CMakeFiles/_gazebo_msgs_generate_messages_check_deps_SetJointTrajectory.dir/depend make[2]: Entering directory `/local/robotpkg/var/tmp/robotpkg/wip/prf-gazebo-ros-pkgs/work/gazebo_ros_pkgs-2.6.7/build' cd /local/robotpkg/var/tmp/robotpkg/wip/prf-gazebo-ros-pkgs/work/gazebo_ros_pkgs-2.6.7/build && /usr/bin/cmake -E cmake_depends "Unix Makefiles" /local/robotpkg/var/tmp/robotpkg/wip/prf-gazebo-ros-pkgs/work/gazebo_ros_pkgs-2.6.7 /local/robotpkg/var/tmp/robotpkg/wip/prf-gazebo-ros-pkgs/work/gazebo_ros_pkgs-2.6.7/gazebo_msgs /local/robotpkg/var/tmp/robotpkg/wip/prf-gazebo-ros-pkgs/work/gazebo_ros_pkgs-2.6.7/build /local/robotpkg/var/tmp/robotpkg/wip/prf-gazebo-ros-pkgs/work/gazebo_ros_pkgs-2.6.7/build/gazebo_msgs /local/robotpkg/var/tmp/robotpkg/wip/prf-gazebo-ros-pkgs/work/gazebo_ros_pkgs-2.6.7/build/gazebo_msgs/CMakeFiles/_gazebo_msgs_generate_messages_check_deps_SetJointProperties.dir/DependInfo.cmake --color= make[2]: Entering directory `/local/robotpkg/var/tmp/robotpkg/wip/prf-gazebo-ros-pkgs/work/gazebo_ros_pkgs-2.6.7/build' cd /local/robotpkg/var/tmp/robotpkg/wip/prf-gazebo-ros-pkgs/work/gazebo_ros_pkgs-2.6.7/build && /usr/bin/cmake -E cmake_depends "Unix Makefiles" /local/robotpkg/var/tmp/robotpkg/wip/prf-gazebo-ros-pkgs/work/gazebo_ros_pkgs-2.6.7 /local/robotpkg/var/tmp/robotpkg/wip/prf-gazebo-ros-pkgs/work/gazebo_ros_pkgs-2.6.7/gazebo_msgs /local/robotpkg/var/tmp/robotpkg/wip/prf-gazebo-ros-pkgs/work/gazebo_ros_pkgs-2.6.7/build /local/robotpkg/var/tmp/robotpkg/wip/prf-gazebo-ros-pkgs/work/gazebo_ros_pkgs-2.6.7/build/gazebo_msgs /local/robotpkg/var/tmp/robotpkg/wip/prf-gazebo-ros-pkgs/work/gazebo_ros_pkgs-2.6.7/build/gazebo_msgs/CMakeFiles/_gazebo_msgs_generate_messages_check_deps_SetJointTrajectory.dir/DependInfo.cmake --color= Scanning dependencies of target geometry_msgs_generate_messages_py make[2]: Leaving directory `/local/robotpkg/var/tmp/robotpkg/wip/prf-gazebo-ros-pkgs/work/gazebo_ros_pkgs-2.6.7/build' Scanning dependencies of target _gazebo_msgs_generate_messages_check_deps_SetJointProperties make -f gazebo_msgs/CMakeFiles/geometry_msgs_generate_messages_py.dir/build.make gazebo_msgs/CMakeFiles/geometry_msgs_generate_messages_py.dir/build make[2]: Leaving directory `/local/robotpkg/var/tmp/robotpkg/wip/prf-gazebo-ros-pkgs/work/gazebo_ros_pkgs-2.6.7/build' make -f gazebo_msgs/CMakeFiles/_gazebo_msgs_generate_messages_check_deps_SetJointProperties.dir/build.make gazebo_msgs/CMakeFiles/_gazebo_msgs_generate_messages_check_deps_SetJointProperties.dir/build make[2]: Entering directory `/local/robotpkg/var/tmp/robotpkg/wip/prf-gazebo-ros-pkgs/work/gazebo_ros_pkgs-2.6.7/build' cd /local/robotpkg/var/tmp/robotpkg/wip/prf-gazebo-ros-pkgs/work/gazebo_ros_pkgs-2.6.7/build/gazebo_msgs && ../catkin_generated/env_cached.sh /usr/bin/python2.7 /opt/ros/indigo/share/genmsg/cmake//../../../lib/genmsg/genmsg_check_deps.py gazebo_msgs /local/robotpkg/var/tmp/robotpkg/wip/prf-gazebo-ros-pkgs/work/gazebo_ros_pkgs-2.6.7/gazebo_msgs/srv/SetJointProperties.srv gazebo_msgs/ODEJointProperties make[2]: Entering directory `/local/robotpkg/var/tmp/robotpkg/wip/prf-gazebo-ros-pkgs/work/gazebo_ros_pkgs-2.6.7/build' make[2]: Nothing to be done for `gazebo_msgs/CMakeFiles/geometry_msgs_generate_messages_py.dir/build'. make[2]: Leaving directory `/local/robotpkg/var/tmp/robotpkg/wip/prf-gazebo-ros-pkgs/work/gazebo_ros_pkgs-2.6.7/build' /usr/bin/cmake -E cmake_progress_report /local/robotpkg/var/tmp/robotpkg/wip/prf-gazebo-ros-pkgs/work/gazebo_ros_pkgs-2.6.7/build/CMakeFiles Scanning dependencies of target _gazebo_msgs_generate_messages_check_deps_SetJointTrajectory make[2]: Leaving directory `/local/robotpkg/var/tmp/robotpkg/wip/prf-gazebo-ros-pkgs/work/gazebo_ros_pkgs-2.6.7/build' make -f gazebo_msgs/CMakeFiles/_gazebo_msgs_generate_messages_check_deps_SetJointTrajectory.dir/build.make gazebo_msgs/CMakeFiles/_gazebo_msgs_generate_messages_check_deps_SetJointTrajectory.dir/build make[2]: Leaving directory `/local/robotpkg/var/tmp/robotpkg/wip/prf-gazebo-ros-pkgs/work/gazebo_ros_pkgs-2.6.7/build' /usr/bin/cmake -E cmake_progress_report /local/robotpkg/var/tmp/robotpkg/wip/prf-gazebo-ros-pkgs/work/gazebo_ros_pkgs-2.6.7/build/CMakeFiles make[2]: Entering directory `/local/robotpkg/var/tmp/robotpkg/wip/prf-gazebo-ros-pkgs/work/gazebo_ros_pkgs-2.6.7/build' cd /local/robotpkg/var/tmp/robotpkg/wip/prf-gazebo-ros-pkgs/work/gazebo_ros_pkgs-2.6.7/build/gazebo_msgs && ../catkin_generated/env_cached.sh /usr/bin/python2.7 /opt/ros/indigo/share/genmsg/cmake//../../../lib/genmsg/genmsg_check_deps.py gazebo_msgs /local/robotpkg/var/tmp/robotpkg/wip/prf-gazebo-ros-pkgs/work/gazebo_ros_pkgs-2.6.7/gazebo_msgs/srv/SetJointTrajectory.srv geometry_msgs/Point:trajectory_msgs/JointTrajectory:std_msgs/Header:geometry_msgs/Quaternion:trajectory_msgs/JointTrajectoryPoint:geometry_msgs/Pose [ 0%] Built target geometry_msgs_generate_messages_py make -f gazebo_msgs/CMakeFiles/_gazebo_msgs_generate_messages_check_deps_ContactsState.dir/build.make gazebo_msgs/CMakeFiles/_gazebo_msgs_generate_messages_check_deps_ContactsState.dir/depend make[2]: Entering directory `/local/robotpkg/var/tmp/robotpkg/wip/prf-gazebo-ros-pkgs/work/gazebo_ros_pkgs-2.6.7/build' cd /local/robotpkg/var/tmp/robotpkg/wip/prf-gazebo-ros-pkgs/work/gazebo_ros_pkgs-2.6.7/build && /usr/bin/cmake -E cmake_depends "Unix Makefiles" /local/robotpkg/var/tmp/robotpkg/wip/prf-gazebo-ros-pkgs/work/gazebo_ros_pkgs-2.6.7 /local/robotpkg/var/tmp/robotpkg/wip/prf-gazebo-ros-pkgs/work/gazebo_ros_pkgs-2.6.7/gazebo_msgs /local/robotpkg/var/tmp/robotpkg/wip/prf-gazebo-ros-pkgs/work/gazebo_ros_pkgs-2.6.7/build /local/robotpkg/var/tmp/robotpkg/wip/prf-gazebo-ros-pkgs/work/gazebo_ros_pkgs-2.6.7/build/gazebo_msgs /local/robotpkg/var/tmp/robotpkg/wip/prf-gazebo-ros-pkgs/work/gazebo_ros_pkgs-2.6.7/build/gazebo_msgs/CMakeFiles/_gazebo_msgs_generate_messages_check_deps_ContactsState.dir/DependInfo.cmake --color= [ 0%] Built target _gazebo_msgs_generate_messages_check_deps_GetModelProperties make -f gazebo_msgs/CMakeFiles/_gazebo_msgs_generate_messages_check_deps_GetLinkState.dir/build.make gazebo_msgs/CMakeFiles/_gazebo_msgs_generate_messages_check_deps_GetLinkState.dir/depend make[2]: Entering directory `/local/robotpkg/var/tmp/robotpkg/wip/prf-gazebo-ros-pkgs/work/gazebo_ros_pkgs-2.6.7/build' cd /local/robotpkg/var/tmp/robotpkg/wip/prf-gazebo-ros-pkgs/work/gazebo_ros_pkgs-2.6.7/build && /usr/bin/cmake -E cmake_depends "Unix Makefiles" /local/robotpkg/var/tmp/robotpkg/wip/prf-gazebo-ros-pkgs/work/gazebo_ros_pkgs-2.6.7 /local/robotpkg/var/tmp/robotpkg/wip/prf-gazebo-ros-pkgs/work/gazebo_ros_pkgs-2.6.7/gazebo_msgs /local/robotpkg/var/tmp/robotpkg/wip/prf-gazebo-ros-pkgs/work/gazebo_ros_pkgs-2.6.7/build /local/robotpkg/var/tmp/robotpkg/wip/prf-gazebo-ros-pkgs/work/gazebo_ros_pkgs-2.6.7/build/gazebo_msgs /local/robotpkg/var/tmp/robotpkg/wip/prf-gazebo-ros-pkgs/work/gazebo_ros_pkgs-2.6.7/build/gazebo_msgs/CMakeFiles/_gazebo_msgs_generate_messages_check_deps_GetLinkState.dir/DependInfo.cmake --color= Scanning dependencies of target _gazebo_msgs_generate_messages_check_deps_ContactsState make[2]: Leaving directory `/local/robotpkg/var/tmp/robotpkg/wip/prf-gazebo-ros-pkgs/work/gazebo_ros_pkgs-2.6.7/build' make -f gazebo_msgs/CMakeFiles/_gazebo_msgs_generate_messages_check_deps_ContactsState.dir/build.make gazebo_msgs/CMakeFiles/_gazebo_msgs_generate_messages_check_deps_ContactsState.dir/build make[2]: Leaving directory `/local/robotpkg/var/tmp/robotpkg/wip/prf-gazebo-ros-pkgs/work/gazebo_ros_pkgs-2.6.7/build' make[2]: Entering directory `/local/robotpkg/var/tmp/robotpkg/wip/prf-gazebo-ros-pkgs/work/gazebo_ros_pkgs-2.6.7/build' cd /local/robotpkg/var/tmp/robotpkg/wip/prf-gazebo-ros-pkgs/work/gazebo_ros_pkgs-2.6.7/build/gazebo_msgs && ../catkin_generated/env_cached.sh /usr/bin/python2.7 /opt/ros/indigo/share/genmsg/cmake//../../../lib/genmsg/genmsg_check_deps.py gazebo_msgs /local/robotpkg/var/tmp/robotpkg/wip/prf-gazebo-ros-pkgs/work/gazebo_ros_pkgs-2.6.7/gazebo_msgs/msg/ContactsState.msg geometry_msgs/Vector3:geometry_msgs/Wrench:std_msgs/Header:gazebo_msgs/ContactState /usr/bin/cmake -E cmake_progress_report /local/robotpkg/var/tmp/robotpkg/wip/prf-gazebo-ros-pkgs/work/gazebo_ros_pkgs-2.6.7/build/CMakeFiles Scanning dependencies of target _gazebo_msgs_generate_messages_check_deps_GetLinkState make[2]: Leaving directory `/local/robotpkg/var/tmp/robotpkg/wip/prf-gazebo-ros-pkgs/work/gazebo_ros_pkgs-2.6.7/build' make -f gazebo_msgs/CMakeFiles/_gazebo_msgs_generate_messages_check_deps_GetLinkState.dir/build.make gazebo_msgs/CMakeFiles/_gazebo_msgs_generate_messages_check_deps_GetLinkState.dir/build [ 0%] make[2]: Entering directory `/local/robotpkg/var/tmp/robotpkg/wip/prf-gazebo-ros-pkgs/work/gazebo_ros_pkgs-2.6.7/build' cd /local/robotpkg/var/tmp/robotpkg/wip/prf-gazebo-ros-pkgs/work/gazebo_ros_pkgs-2.6.7/build/gazebo_msgs && ../catkin_generated/env_cached.sh /usr/bin/python2.7 /opt/ros/indigo/share/genmsg/cmake//../../../lib/genmsg/genmsg_check_deps.py gazebo_msgs /local/robotpkg/var/tmp/robotpkg/wip/prf-gazebo-ros-pkgs/work/gazebo_ros_pkgs-2.6.7/gazebo_msgs/srv/GetLinkState.srv geometry_msgs/Point:geometry_msgs/Vector3:geometry_msgs/Quaternion:gazebo_msgs/LinkState:geometry_msgs/Pose:geometry_msgs/Twist Built target _gazebo_msgs_generate_messages_check_deps_SetJointProperties make -f gazebo_msgs/CMakeFiles/_gazebo_msgs_generate_messages_check_deps_SetLinkState.dir/build.make gazebo_msgs/CMakeFiles/_gazebo_msgs_generate_messages_check_deps_SetLinkState.dir/depend make[2]: Entering directory `/local/robotpkg/var/tmp/robotpkg/wip/prf-gazebo-ros-pkgs/work/gazebo_ros_pkgs-2.6.7/build' cd /local/robotpkg/var/tmp/robotpkg/wip/prf-gazebo-ros-pkgs/work/gazebo_ros_pkgs-2.6.7/build && /usr/bin/cmake -E cmake_depends "Unix Makefiles" /local/robotpkg/var/tmp/robotpkg/wip/prf-gazebo-ros-pkgs/work/gazebo_ros_pkgs-2.6.7 /local/robotpkg/var/tmp/robotpkg/wip/prf-gazebo-ros-pkgs/work/gazebo_ros_pkgs-2.6.7/gazebo_msgs /local/robotpkg/var/tmp/robotpkg/wip/prf-gazebo-ros-pkgs/work/gazebo_ros_pkgs-2.6.7/build /local/robotpkg/var/tmp/robotpkg/wip/prf-gazebo-ros-pkgs/work/gazebo_ros_pkgs-2.6.7/build/gazebo_msgs /local/robotpkg/var/tmp/robotpkg/wip/prf-gazebo-ros-pkgs/work/gazebo_ros_pkgs-2.6.7/build/gazebo_msgs/CMakeFiles/_gazebo_msgs_generate_messages_check_deps_SetLinkState.dir/DependInfo.cmake --color= Scanning dependencies of target _gazebo_msgs_generate_messages_check_deps_SetLinkState make[2]: Leaving directory `/local/robotpkg/var/tmp/robotpkg/wip/prf-gazebo-ros-pkgs/work/gazebo_ros_pkgs-2.6.7/build' make -f gazebo_msgs/CMakeFiles/_gazebo_msgs_generate_messages_check_deps_SetLinkState.dir/build.make gazebo_msgs/CMakeFiles/_gazebo_msgs_generate_messages_check_deps_SetLinkState.dir/build make[2]: Entering directory `/local/robotpkg/var/tmp/robotpkg/wip/prf-gazebo-ros-pkgs/work/gazebo_ros_pkgs-2.6.7/build' cd /local/robotpkg/var/tmp/robotpkg/wip/prf-gazebo-ros-pkgs/work/gazebo_ros_pkgs-2.6.7/build/gazebo_msgs && ../catkin_generated/env_cached.sh /usr/bin/python2.7 /opt/ros/indigo/share/genmsg/cmake//../../../lib/genmsg/genmsg_check_deps.py gazebo_msgs /local/robotpkg/var/tmp/robotpkg/wip/prf-gazebo-ros-pkgs/work/gazebo_ros_pkgs-2.6.7/gazebo_msgs/srv/SetLinkState.srv geometry_msgs/Point:geometry_msgs/Vector3:geometry_msgs/Quaternion:gazebo_msgs/LinkState:geometry_msgs/Pose:geometry_msgs/Twist make[2]: Leaving directory `/local/robotpkg/var/tmp/robotpkg/wip/prf-gazebo-ros-pkgs/work/gazebo_ros_pkgs-2.6.7/build' /usr/bin/cmake -E cmake_progress_report /local/robotpkg/var/tmp/robotpkg/wip/prf-gazebo-ros-pkgs/work/gazebo_ros_pkgs-2.6.7/build/CMakeFiles make[2]: Leaving directory `/local/robotpkg/var/tmp/robotpkg/wip/prf-gazebo-ros-pkgs/work/gazebo_ros_pkgs-2.6.7/build' /usr/bin/cmake -E cmake_progress_report /local/robotpkg/var/tmp/robotpkg/wip/prf-gazebo-ros-pkgs/work/gazebo_ros_pkgs-2.6.7/build/CMakeFiles [ 0%] make[2]: Leaving directory `/local/robotpkg/var/tmp/robotpkg/wip/prf-gazebo-ros-pkgs/work/gazebo_ros_pkgs-2.6.7/build' /usr/bin/cmake -E cmake_progress_report /local/robotpkg/var/tmp/robotpkg/wip/prf-gazebo-ros-pkgs/work/gazebo_ros_pkgs-2.6.7/build/CMakeFiles Built target _gazebo_msgs_generate_messages_check_deps_SetJointTrajectory make -f gazebo_msgs/CMakeFiles/_gazebo_msgs_generate_messages_check_deps_DeleteLight.dir/build.make gazebo_msgs/CMakeFiles/_gazebo_msgs_generate_messages_check_deps_DeleteLight.dir/depend [ 0%] [ 0%] Built target _gazebo_msgs_generate_messages_check_deps_ContactsState Built target _gazebo_msgs_generate_messages_check_deps_GetLinkState make -f gazebo_msgs/CMakeFiles/_gazebo_msgs_generate_messages_check_deps_SpawnModel.dir/build.make gazebo_msgs/CMakeFiles/_gazebo_msgs_generate_messages_check_deps_SpawnModel.dir/depend make -f gazebo_msgs/CMakeFiles/_gazebo_msgs_generate_messages_check_deps_ModelStates.dir/build.make gazebo_msgs/CMakeFiles/_gazebo_msgs_generate_messages_check_deps_ModelStates.dir/depend make[2]: Entering directory `/local/robotpkg/var/tmp/robotpkg/wip/prf-gazebo-ros-pkgs/work/gazebo_ros_pkgs-2.6.7/build' cd /local/robotpkg/var/tmp/robotpkg/wip/prf-gazebo-ros-pkgs/work/gazebo_ros_pkgs-2.6.7/build && /usr/bin/cmake -E cmake_depends "Unix Makefiles" /local/robotpkg/var/tmp/robotpkg/wip/prf-gazebo-ros-pkgs/work/gazebo_ros_pkgs-2.6.7 /local/robotpkg/var/tmp/robotpkg/wip/prf-gazebo-ros-pkgs/work/gazebo_ros_pkgs-2.6.7/gazebo_msgs /local/robotpkg/var/tmp/robotpkg/wip/prf-gazebo-ros-pkgs/work/gazebo_ros_pkgs-2.6.7/build /local/robotpkg/var/tmp/robotpkg/wip/prf-gazebo-ros-pkgs/work/gazebo_ros_pkgs-2.6.7/build/gazebo_msgs /local/robotpkg/var/tmp/robotpkg/wip/prf-gazebo-ros-pkgs/work/gazebo_ros_pkgs-2.6.7/build/gazebo_msgs/CMakeFiles/_gazebo_msgs_generate_messages_check_deps_DeleteLight.dir/DependInfo.cmake --color= make[2]: Entering directory `/local/robotpkg/var/tmp/robotpkg/wip/prf-gazebo-ros-pkgs/work/gazebo_ros_pkgs-2.6.7/build' cd /local/robotpkg/var/tmp/robotpkg/wip/prf-gazebo-ros-pkgs/work/gazebo_ros_pkgs-2.6.7/build && /usr/bin/cmake -E cmake_depends "Unix Makefiles" /local/robotpkg/var/tmp/robotpkg/wip/prf-gazebo-ros-pkgs/work/gazebo_ros_pkgs-2.6.7 /local/robotpkg/var/tmp/robotpkg/wip/prf-gazebo-ros-pkgs/work/gazebo_ros_pkgs-2.6.7/gazebo_msgs /local/robotpkg/var/tmp/robotpkg/wip/prf-gazebo-ros-pkgs/work/gazebo_ros_pkgs-2.6.7/build /local/robotpkg/var/tmp/robotpkg/wip/prf-gazebo-ros-pkgs/work/gazebo_ros_pkgs-2.6.7/build/gazebo_msgs /local/robotpkg/var/tmp/robotpkg/wip/prf-gazebo-ros-pkgs/work/gazebo_ros_pkgs-2.6.7/build/gazebo_msgs/CMakeFiles/_gazebo_msgs_generate_messages_check_deps_SpawnModel.dir/DependInfo.cmake --color= make[2]: Entering directory `/local/robotpkg/var/tmp/robotpkg/wip/prf-gazebo-ros-pkgs/work/gazebo_ros_pkgs-2.6.7/build' cd /local/robotpkg/var/tmp/robotpkg/wip/prf-gazebo-ros-pkgs/work/gazebo_ros_pkgs-2.6.7/build && /usr/bin/cmake -E cmake_depends "Unix Makefiles" /local/robotpkg/var/tmp/robotpkg/wip/prf-gazebo-ros-pkgs/work/gazebo_ros_pkgs-2.6.7 /local/robotpkg/var/tmp/robotpkg/wip/prf-gazebo-ros-pkgs/work/gazebo_ros_pkgs-2.6.7/gazebo_msgs /local/robotpkg/var/tmp/robotpkg/wip/prf-gazebo-ros-pkgs/work/gazebo_ros_pkgs-2.6.7/build /local/robotpkg/var/tmp/robotpkg/wip/prf-gazebo-ros-pkgs/work/gazebo_ros_pkgs-2.6.7/build/gazebo_msgs /local/robotpkg/var/tmp/robotpkg/wip/prf-gazebo-ros-pkgs/work/gazebo_ros_pkgs-2.6.7/build/gazebo_msgs/CMakeFiles/_gazebo_msgs_generate_messages_check_deps_ModelStates.dir/DependInfo.cmake --color= Scanning dependencies of target _gazebo_msgs_generate_messages_check_deps_ModelStates make[2]: Leaving directory `/local/robotpkg/var/tmp/robotpkg/wip/prf-gazebo-ros-pkgs/work/gazebo_ros_pkgs-2.6.7/build' make -f gazebo_msgs/CMakeFiles/_gazebo_msgs_generate_messages_check_deps_ModelStates.dir/build.make gazebo_msgs/CMakeFiles/_gazebo_msgs_generate_messages_check_deps_ModelStates.dir/build Scanning dependencies of target _gazebo_msgs_generate_messages_check_deps_SpawnModel make[2]: Entering directory `/local/robotpkg/var/tmp/robotpkg/wip/prf-gazebo-ros-pkgs/work/gazebo_ros_pkgs-2.6.7/build' cd /local/robotpkg/var/tmp/robotpkg/wip/prf-gazebo-ros-pkgs/work/gazebo_ros_pkgs-2.6.7/build/gazebo_msgs && ../catkin_generated/env_cached.sh /usr/bin/python2.7 /opt/ros/indigo/share/genmsg/cmake//../../../lib/genmsg/genmsg_check_deps.py gazebo_msgs /local/robotpkg/var/tmp/robotpkg/wip/prf-gazebo-ros-pkgs/work/gazebo_ros_pkgs-2.6.7/gazebo_msgs/msg/ModelStates.msg geometry_msgs/Quaternion:geometry_msgs/Vector3:geometry_msgs/Twist:geometry_msgs/Point:geometry_msgs/Pose make[2]: Leaving directory `/local/robotpkg/var/tmp/robotpkg/wip/prf-gazebo-ros-pkgs/work/gazebo_ros_pkgs-2.6.7/build' make -f gazebo_msgs/CMakeFiles/_gazebo_msgs_generate_messages_check_deps_SpawnModel.dir/build.make gazebo_msgs/CMakeFiles/_gazebo_msgs_generate_messages_check_deps_SpawnModel.dir/build make[2]: Entering directory `/local/robotpkg/var/tmp/robotpkg/wip/prf-gazebo-ros-pkgs/work/gazebo_ros_pkgs-2.6.7/build' cd /local/robotpkg/var/tmp/robotpkg/wip/prf-gazebo-ros-pkgs/work/gazebo_ros_pkgs-2.6.7/build/gazebo_msgs && ../catkin_generated/env_cached.sh /usr/bin/python2.7 /opt/ros/indigo/share/genmsg/cmake//../../../lib/genmsg/genmsg_check_deps.py gazebo_msgs /local/robotpkg/var/tmp/robotpkg/wip/prf-gazebo-ros-pkgs/work/gazebo_ros_pkgs-2.6.7/gazebo_msgs/srv/SpawnModel.srv geometry_msgs/Quaternion:geometry_msgs/Point:geometry_msgs/Pose Scanning dependencies of target _gazebo_msgs_generate_messages_check_deps_DeleteLight make[2]: Leaving directory `/local/robotpkg/var/tmp/robotpkg/wip/prf-gazebo-ros-pkgs/work/gazebo_ros_pkgs-2.6.7/build' make -f gazebo_msgs/CMakeFiles/_gazebo_msgs_generate_messages_check_deps_DeleteLight.dir/build.make gazebo_msgs/CMakeFiles/_gazebo_msgs_generate_messages_check_deps_DeleteLight.dir/build make[2]: Entering directory `/local/robotpkg/var/tmp/robotpkg/wip/prf-gazebo-ros-pkgs/work/gazebo_ros_pkgs-2.6.7/build' cd /local/robotpkg/var/tmp/robotpkg/wip/prf-gazebo-ros-pkgs/work/gazebo_ros_pkgs-2.6.7/build/gazebo_msgs && ../catkin_generated/env_cached.sh /usr/bin/python2.7 /opt/ros/indigo/share/genmsg/cmake//../../../lib/genmsg/genmsg_check_deps.py gazebo_msgs /local/robotpkg/var/tmp/robotpkg/wip/prf-gazebo-ros-pkgs/work/gazebo_ros_pkgs-2.6.7/gazebo_msgs/srv/DeleteLight.srv make[2]: Leaving directory `/local/robotpkg/var/tmp/robotpkg/wip/prf-gazebo-ros-pkgs/work/gazebo_ros_pkgs-2.6.7/build' make[2]: Leaving directory `/local/robotpkg/var/tmp/robotpkg/wip/prf-gazebo-ros-pkgs/work/gazebo_ros_pkgs-2.6.7/build' /usr/bin/cmake -E cmake_progress_report /local/robotpkg/var/tmp/robotpkg/wip/prf-gazebo-ros-pkgs/work/gazebo_ros_pkgs-2.6.7/build/CMakeFiles /usr/bin/cmake -E cmake_progress_report /local/robotpkg/var/tmp/robotpkg/wip/prf-gazebo-ros-pkgs/work/gazebo_ros_pkgs-2.6.7/build/CMakeFiles [ 0%] Built target _gazebo_msgs_generate_messages_check_deps_SetLinkState make -f gazebo_msgs/CMakeFiles/_gazebo_msgs_generate_messages_check_deps_DeleteModel.dir/build.make gazebo_msgs/CMakeFiles/_gazebo_msgs_generate_messages_check_deps_DeleteModel.dir/depend [ 0%] make[2]: Entering directory `/local/robotpkg/var/tmp/robotpkg/wip/prf-gazebo-ros-pkgs/work/gazebo_ros_pkgs-2.6.7/build' cd /local/robotpkg/var/tmp/robotpkg/wip/prf-gazebo-ros-pkgs/work/gazebo_ros_pkgs-2.6.7/build && /usr/bin/cmake -E cmake_depends "Unix Makefiles" /local/robotpkg/var/tmp/robotpkg/wip/prf-gazebo-ros-pkgs/work/gazebo_ros_pkgs-2.6.7 /local/robotpkg/var/tmp/robotpkg/wip/prf-gazebo-ros-pkgs/work/gazebo_ros_pkgs-2.6.7/gazebo_msgs /local/robotpkg/var/tmp/robotpkg/wip/prf-gazebo-ros-pkgs/work/gazebo_ros_pkgs-2.6.7/build /local/robotpkg/var/tmp/robotpkg/wip/prf-gazebo-ros-pkgs/work/gazebo_ros_pkgs-2.6.7/build/gazebo_msgs /local/robotpkg/var/tmp/robotpkg/wip/prf-gazebo-ros-pkgs/work/gazebo_ros_pkgs-2.6.7/build/gazebo_msgs/CMakeFiles/_gazebo_msgs_generate_messages_check_deps_DeleteModel.dir/DependInfo.cmake --color= Built target _gazebo_msgs_generate_messages_check_deps_SpawnModel make -f gazebo_msgs/CMakeFiles/_gazebo_msgs_generate_messages_check_deps_ModelState.dir/build.make gazebo_msgs/CMakeFiles/_gazebo_msgs_generate_messages_check_deps_ModelState.dir/depend make[2]: Entering directory `/local/robotpkg/var/tmp/robotpkg/wip/prf-gazebo-ros-pkgs/work/gazebo_ros_pkgs-2.6.7/build' cd /local/robotpkg/var/tmp/robotpkg/wip/prf-gazebo-ros-pkgs/work/gazebo_ros_pkgs-2.6.7/build && /usr/bin/cmake -E cmake_depends "Unix Makefiles" /local/robotpkg/var/tmp/robotpkg/wip/prf-gazebo-ros-pkgs/work/gazebo_ros_pkgs-2.6.7 /local/robotpkg/var/tmp/robotpkg/wip/prf-gazebo-ros-pkgs/work/gazebo_ros_pkgs-2.6.7/gazebo_msgs /local/robotpkg/var/tmp/robotpkg/wip/prf-gazebo-ros-pkgs/work/gazebo_ros_pkgs-2.6.7/build /local/robotpkg/var/tmp/robotpkg/wip/prf-gazebo-ros-pkgs/work/gazebo_ros_pkgs-2.6.7/build/gazebo_msgs /local/robotpkg/var/tmp/robotpkg/wip/prf-gazebo-ros-pkgs/work/gazebo_ros_pkgs-2.6.7/build/gazebo_msgs/CMakeFiles/_gazebo_msgs_generate_messages_check_deps_ModelState.dir/DependInfo.cmake --color= make[2]: Leaving directory `/local/robotpkg/var/tmp/robotpkg/wip/prf-gazebo-ros-pkgs/work/gazebo_ros_pkgs-2.6.7/build' /usr/bin/cmake -E cmake_progress_report /local/robotpkg/var/tmp/robotpkg/wip/prf-gazebo-ros-pkgs/work/gazebo_ros_pkgs-2.6.7/build/CMakeFiles make[2]: Leaving directory `/local/robotpkg/var/tmp/robotpkg/wip/prf-gazebo-ros-pkgs/work/gazebo_ros_pkgs-2.6.7/build' /usr/bin/cmake -E cmake_progress_report /local/robotpkg/var/tmp/robotpkg/wip/prf-gazebo-ros-pkgs/work/gazebo_ros_pkgs-2.6.7/build/CMakeFiles [ 0%] [ 0%] Scanning dependencies of target _gazebo_msgs_generate_messages_check_deps_ModelState Scanning dependencies of target _gazebo_msgs_generate_messages_check_deps_DeleteModel make[2]: Leaving directory `/local/robotpkg/var/tmp/robotpkg/wip/prf-gazebo-ros-pkgs/work/gazebo_ros_pkgs-2.6.7/build' make[2]: Leaving directory `/local/robotpkg/var/tmp/robotpkg/wip/prf-gazebo-ros-pkgs/work/gazebo_ros_pkgs-2.6.7/build' Built target _gazebo_msgs_generate_messages_check_deps_ModelStates make -f gazebo_msgs/CMakeFiles/_gazebo_msgs_generate_messages_check_deps_DeleteModel.dir/build.make gazebo_msgs/CMakeFiles/_gazebo_msgs_generate_messages_check_deps_DeleteModel.dir/build make[2]: Entering directory `/local/robotpkg/var/tmp/robotpkg/wip/prf-gazebo-ros-pkgs/work/gazebo_ros_pkgs-2.6.7/build' cd /local/robotpkg/var/tmp/robotpkg/wip/prf-gazebo-ros-pkgs/work/gazebo_ros_pkgs-2.6.7/build/gazebo_msgs && ../catkin_generated/env_cached.sh /usr/bin/python2.7 /opt/ros/indigo/share/genmsg/cmake//../../../lib/genmsg/genmsg_check_deps.py gazebo_msgs /local/robotpkg/var/tmp/robotpkg/wip/prf-gazebo-ros-pkgs/work/gazebo_ros_pkgs-2.6.7/gazebo_msgs/srv/DeleteModel.srv make -f gazebo_msgs/CMakeFiles/_gazebo_msgs_generate_messages_check_deps_ModelState.dir/build.make gazebo_msgs/CMakeFiles/_gazebo_msgs_generate_messages_check_deps_ModelState.dir/build make[2]: Entering directory `/local/robotpkg/var/tmp/robotpkg/wip/prf-gazebo-ros-pkgs/work/gazebo_ros_pkgs-2.6.7/build' cd /local/robotpkg/var/tmp/robotpkg/wip/prf-gazebo-ros-pkgs/work/gazebo_ros_pkgs-2.6.7/build/gazebo_msgs && ../catkin_generated/env_cached.sh /usr/bin/python2.7 /opt/ros/indigo/share/genmsg/cmake//../../../lib/genmsg/genmsg_check_deps.py gazebo_msgs /local/robotpkg/var/tmp/robotpkg/wip/prf-gazebo-ros-pkgs/work/gazebo_ros_pkgs-2.6.7/gazebo_msgs/msg/ModelState.msg geometry_msgs/Quaternion:geometry_msgs/Vector3:geometry_msgs/Twist:geometry_msgs/Point:geometry_msgs/Pose make -f gazebo_msgs/CMakeFiles/_gazebo_msgs_generate_messages_check_deps_SetPhysicsProperties.dir/build.make gazebo_msgs/CMakeFiles/_gazebo_msgs_generate_messages_check_deps_SetPhysicsProperties.dir/depend Built target _gazebo_msgs_generate_messages_check_deps_DeleteLight make -f gazebo_msgs/CMakeFiles/_gazebo_msgs_generate_messages_check_deps_SetModelState.dir/build.make gazebo_msgs/CMakeFiles/_gazebo_msgs_generate_messages_check_deps_SetModelState.dir/depend make[2]: Entering directory `/local/robotpkg/var/tmp/robotpkg/wip/prf-gazebo-ros-pkgs/work/gazebo_ros_pkgs-2.6.7/build' cd /local/robotpkg/var/tmp/robotpkg/wip/prf-gazebo-ros-pkgs/work/gazebo_ros_pkgs-2.6.7/build && /usr/bin/cmake -E cmake_depends "Unix Makefiles" /local/robotpkg/var/tmp/robotpkg/wip/prf-gazebo-ros-pkgs/work/gazebo_ros_pkgs-2.6.7 /local/robotpkg/var/tmp/robotpkg/wip/prf-gazebo-ros-pkgs/work/gazebo_ros_pkgs-2.6.7/gazebo_msgs /local/robotpkg/var/tmp/robotpkg/wip/prf-gazebo-ros-pkgs/work/gazebo_ros_pkgs-2.6.7/build /local/robotpkg/var/tmp/robotpkg/wip/prf-gazebo-ros-pkgs/work/gazebo_ros_pkgs-2.6.7/build/gazebo_msgs /local/robotpkg/var/tmp/robotpkg/wip/prf-gazebo-ros-pkgs/work/gazebo_ros_pkgs-2.6.7/build/gazebo_msgs/CMakeFiles/_gazebo_msgs_generate_messages_check_deps_SetModelState.dir/DependInfo.cmake --color= make[2]: Entering directory `/local/robotpkg/var/tmp/robotpkg/wip/prf-gazebo-ros-pkgs/work/gazebo_ros_pkgs-2.6.7/build' cd /local/robotpkg/var/tmp/robotpkg/wip/prf-gazebo-ros-pkgs/work/gazebo_ros_pkgs-2.6.7/build && /usr/bin/cmake -E cmake_depends "Unix Makefiles" /local/robotpkg/var/tmp/robotpkg/wip/prf-gazebo-ros-pkgs/work/gazebo_ros_pkgs-2.6.7 /local/robotpkg/var/tmp/robotpkg/wip/prf-gazebo-ros-pkgs/work/gazebo_ros_pkgs-2.6.7/gazebo_msgs /local/robotpkg/var/tmp/robotpkg/wip/prf-gazebo-ros-pkgs/work/gazebo_ros_pkgs-2.6.7/build /local/robotpkg/var/tmp/robotpkg/wip/prf-gazebo-ros-pkgs/work/gazebo_ros_pkgs-2.6.7/build/gazebo_msgs /local/robotpkg/var/tmp/robotpkg/wip/prf-gazebo-ros-pkgs/work/gazebo_ros_pkgs-2.6.7/build/gazebo_msgs/CMakeFiles/_gazebo_msgs_generate_messages_check_deps_SetPhysicsProperties.dir/DependInfo.cmake --color= Scanning dependencies of target _gazebo_msgs_generate_messages_check_deps_SetPhysicsProperties make[2]: Leaving directory `/local/robotpkg/var/tmp/robotpkg/wip/prf-gazebo-ros-pkgs/work/gazebo_ros_pkgs-2.6.7/build' make -f gazebo_msgs/CMakeFiles/_gazebo_msgs_generate_messages_check_deps_SetPhysicsProperties.dir/build.make gazebo_msgs/CMakeFiles/_gazebo_msgs_generate_messages_check_deps_SetPhysicsProperties.dir/build make[2]: Entering directory `/local/robotpkg/var/tmp/robotpkg/wip/prf-gazebo-ros-pkgs/work/gazebo_ros_pkgs-2.6.7/build' cd /local/robotpkg/var/tmp/robotpkg/wip/prf-gazebo-ros-pkgs/work/gazebo_ros_pkgs-2.6.7/build/gazebo_msgs && ../catkin_generated/env_cached.sh /usr/bin/python2.7 /opt/ros/indigo/share/genmsg/cmake//../../../lib/genmsg/genmsg_check_deps.py gazebo_msgs /local/robotpkg/var/tmp/robotpkg/wip/prf-gazebo-ros-pkgs/work/gazebo_ros_pkgs-2.6.7/gazebo_msgs/srv/SetPhysicsProperties.srv geometry_msgs/Vector3:gazebo_msgs/ODEPhysics Scanning dependencies of target _gazebo_msgs_generate_messages_check_deps_SetModelState make[2]: Leaving directory `/local/robotpkg/var/tmp/robotpkg/wip/prf-gazebo-ros-pkgs/work/gazebo_ros_pkgs-2.6.7/build' make -f gazebo_msgs/CMakeFiles/_gazebo_msgs_generate_messages_check_deps_SetModelState.dir/build.make gazebo_msgs/CMakeFiles/_gazebo_msgs_generate_messages_check_deps_SetModelState.dir/build make[2]: Entering directory `/local/robotpkg/var/tmp/robotpkg/wip/prf-gazebo-ros-pkgs/work/gazebo_ros_pkgs-2.6.7/build' cd /local/robotpkg/var/tmp/robotpkg/wip/prf-gazebo-ros-pkgs/work/gazebo_ros_pkgs-2.6.7/build/gazebo_msgs && ../catkin_generated/env_cached.sh /usr/bin/python2.7 /opt/ros/indigo/share/genmsg/cmake//../../../lib/genmsg/genmsg_check_deps.py gazebo_msgs /local/robotpkg/var/tmp/robotpkg/wip/prf-gazebo-ros-pkgs/work/gazebo_ros_pkgs-2.6.7/gazebo_msgs/srv/SetModelState.srv geometry_msgs/Point:geometry_msgs/Vector3:geometry_msgs/Quaternion:gazebo_msgs/ModelState:geometry_msgs/Pose:geometry_msgs/Twist make[2]: Leaving directory `/local/robotpkg/var/tmp/robotpkg/wip/prf-gazebo-ros-pkgs/work/gazebo_ros_pkgs-2.6.7/build' /usr/bin/cmake -E cmake_progress_report /local/robotpkg/var/tmp/robotpkg/wip/prf-gazebo-ros-pkgs/work/gazebo_ros_pkgs-2.6.7/build/CMakeFiles [ 0%] make[2]: Leaving directory `/local/robotpkg/var/tmp/robotpkg/wip/prf-gazebo-ros-pkgs/work/gazebo_ros_pkgs-2.6.7/build' Built target _gazebo_msgs_generate_messages_check_deps_ModelState /usr/bin/cmake -E cmake_progress_report /local/robotpkg/var/tmp/robotpkg/wip/prf-gazebo-ros-pkgs/work/gazebo_ros_pkgs-2.6.7/build/CMakeFiles make -f gazebo_msgs/CMakeFiles/_gazebo_msgs_generate_messages_check_deps_GetWorldProperties.dir/build.make gazebo_msgs/CMakeFiles/_gazebo_msgs_generate_messages_check_deps_GetWorldProperties.dir/depend make[2]: Leaving directory `/local/robotpkg/var/tmp/robotpkg/wip/prf-gazebo-ros-pkgs/work/gazebo_ros_pkgs-2.6.7/build' /usr/bin/cmake -E cmake_progress_report /local/robotpkg/var/tmp/robotpkg/wip/prf-gazebo-ros-pkgs/work/gazebo_ros_pkgs-2.6.7/build/CMakeFiles [ 0%] make[2]: Entering directory `/local/robotpkg/var/tmp/robotpkg/wip/prf-gazebo-ros-pkgs/work/gazebo_ros_pkgs-2.6.7/build' cd /local/robotpkg/var/tmp/robotpkg/wip/prf-gazebo-ros-pkgs/work/gazebo_ros_pkgs-2.6.7/build && /usr/bin/cmake -E cmake_depends "Unix Makefiles" /local/robotpkg/var/tmp/robotpkg/wip/prf-gazebo-ros-pkgs/work/gazebo_ros_pkgs-2.6.7 /local/robotpkg/var/tmp/robotpkg/wip/prf-gazebo-ros-pkgs/work/gazebo_ros_pkgs-2.6.7/gazebo_msgs /local/robotpkg/var/tmp/robotpkg/wip/prf-gazebo-ros-pkgs/work/gazebo_ros_pkgs-2.6.7/build /local/robotpkg/var/tmp/robotpkg/wip/prf-gazebo-ros-pkgs/work/gazebo_ros_pkgs-2.6.7/build/gazebo_msgs /local/robotpkg/var/tmp/robotpkg/wip/prf-gazebo-ros-pkgs/work/gazebo_ros_pkgs-2.6.7/build/gazebo_msgs/CMakeFiles/_gazebo_msgs_generate_messages_check_deps_GetWorldProperties.dir/DependInfo.cmake --color= Built target _gazebo_msgs_generate_messages_check_deps_DeleteModel make -f gazebo_msgs/CMakeFiles/_gazebo_msgs_generate_messages_check_deps_ODEJointProperties.dir/build.make gazebo_msgs/CMakeFiles/_gazebo_msgs_generate_messages_check_deps_ODEJointProperties.dir/depend make[2]: Entering directory `/local/robotpkg/var/tmp/robotpkg/wip/prf-gazebo-ros-pkgs/work/gazebo_ros_pkgs-2.6.7/build' cd /local/robotpkg/var/tmp/robotpkg/wip/prf-gazebo-ros-pkgs/work/gazebo_ros_pkgs-2.6.7/build && /usr/bin/cmake -E cmake_depends "Unix Makefiles" /local/robotpkg/var/tmp/robotpkg/wip/prf-gazebo-ros-pkgs/work/gazebo_ros_pkgs-2.6.7 /local/robotpkg/var/tmp/robotpkg/wip/prf-gazebo-ros-pkgs/work/gazebo_ros_pkgs-2.6.7/gazebo_msgs /local/robotpkg/var/tmp/robotpkg/wip/prf-gazebo-ros-pkgs/work/gazebo_ros_pkgs-2.6.7/build /local/robotpkg/var/tmp/robotpkg/wip/prf-gazebo-ros-pkgs/work/gazebo_ros_pkgs-2.6.7/build/gazebo_msgs /local/robotpkg/var/tmp/robotpkg/wip/prf-gazebo-ros-pkgs/work/gazebo_ros_pkgs-2.6.7/build/gazebo_msgs/CMakeFiles/_gazebo_msgs_generate_messages_check_deps_ODEJointProperties.dir/DependInfo.cmake --color= [ 0%] Built target _gazebo_msgs_generate_messages_check_deps_SetPhysicsProperties make -f gazebo_msgs/CMakeFiles/_gazebo_msgs_generate_messages_check_deps_GetLinkProperties.dir/build.make gazebo_msgs/CMakeFiles/_gazebo_msgs_generate_messages_check_deps_GetLinkProperties.dir/depend make[2]: Entering directory `/local/robotpkg/var/tmp/robotpkg/wip/prf-gazebo-ros-pkgs/work/gazebo_ros_pkgs-2.6.7/build' cd /local/robotpkg/var/tmp/robotpkg/wip/prf-gazebo-ros-pkgs/work/gazebo_ros_pkgs-2.6.7/build && /usr/bin/cmake -E cmake_depends "Unix Makefiles" /local/robotpkg/var/tmp/robotpkg/wip/prf-gazebo-ros-pkgs/work/gazebo_ros_pkgs-2.6.7 /local/robotpkg/var/tmp/robotpkg/wip/prf-gazebo-ros-pkgs/work/gazebo_ros_pkgs-2.6.7/gazebo_msgs /local/robotpkg/var/tmp/robotpkg/wip/prf-gazebo-ros-pkgs/work/gazebo_ros_pkgs-2.6.7/build /local/robotpkg/var/tmp/robotpkg/wip/prf-gazebo-ros-pkgs/work/gazebo_ros_pkgs-2.6.7/build/gazebo_msgs /local/robotpkg/var/tmp/robotpkg/wip/prf-gazebo-ros-pkgs/work/gazebo_ros_pkgs-2.6.7/build/gazebo_msgs/CMakeFiles/_gazebo_msgs_generate_messages_check_deps_GetLinkProperties.dir/DependInfo.cmake --color= Scanning dependencies of target _gazebo_msgs_generate_messages_check_deps_GetWorldProperties Scanning dependencies of target _gazebo_msgs_generate_messages_check_deps_ODEJointProperties make[2]: Leaving directory `/local/robotpkg/var/tmp/robotpkg/wip/prf-gazebo-ros-pkgs/work/gazebo_ros_pkgs-2.6.7/build' make[2]: Leaving directory `/local/robotpkg/var/tmp/robotpkg/wip/prf-gazebo-ros-pkgs/work/gazebo_ros_pkgs-2.6.7/build' make -f gazebo_msgs/CMakeFiles/_gazebo_msgs_generate_messages_check_deps_GetWorldProperties.dir/build.make gazebo_msgs/CMakeFiles/_gazebo_msgs_generate_messages_check_deps_GetWorldProperties.dir/build make -f gazebo_msgs/CMakeFiles/_gazebo_msgs_generate_messages_check_deps_ODEJointProperties.dir/build.make gazebo_msgs/CMakeFiles/_gazebo_msgs_generate_messages_check_deps_ODEJointProperties.dir/build make[2]: Entering directory `/local/robotpkg/var/tmp/robotpkg/wip/prf-gazebo-ros-pkgs/work/gazebo_ros_pkgs-2.6.7/build' cd /local/robotpkg/var/tmp/robotpkg/wip/prf-gazebo-ros-pkgs/work/gazebo_ros_pkgs-2.6.7/build/gazebo_msgs && ../catkin_generated/env_cached.sh /usr/bin/python2.7 /opt/ros/indigo/share/genmsg/cmake//../../../lib/genmsg/genmsg_check_deps.py gazebo_msgs /local/robotpkg/var/tmp/robotpkg/wip/prf-gazebo-ros-pkgs/work/gazebo_ros_pkgs-2.6.7/gazebo_msgs/srv/GetWorldProperties.srv make[2]: Entering directory `/local/robotpkg/var/tmp/robotpkg/wip/prf-gazebo-ros-pkgs/work/gazebo_ros_pkgs-2.6.7/build' cd /local/robotpkg/var/tmp/robotpkg/wip/prf-gazebo-ros-pkgs/work/gazebo_ros_pkgs-2.6.7/build/gazebo_msgs && ../catkin_generated/env_cached.sh /usr/bin/python2.7 /opt/ros/indigo/share/genmsg/cmake//../../../lib/genmsg/genmsg_check_deps.py gazebo_msgs /local/robotpkg/var/tmp/robotpkg/wip/prf-gazebo-ros-pkgs/work/gazebo_ros_pkgs-2.6.7/gazebo_msgs/msg/ODEJointProperties.msg make[2]: Leaving directory `/local/robotpkg/var/tmp/robotpkg/wip/prf-gazebo-ros-pkgs/work/gazebo_ros_pkgs-2.6.7/build' /usr/bin/cmake -E cmake_progress_report /local/robotpkg/var/tmp/robotpkg/wip/prf-gazebo-ros-pkgs/work/gazebo_ros_pkgs-2.6.7/build/CMakeFiles Scanning dependencies of target _gazebo_msgs_generate_messages_check_deps_GetLinkProperties make[2]: Leaving directory `/local/robotpkg/var/tmp/robotpkg/wip/prf-gazebo-ros-pkgs/work/gazebo_ros_pkgs-2.6.7/build' make -f gazebo_msgs/CMakeFiles/_gazebo_msgs_generate_messages_check_deps_GetLinkProperties.dir/build.make gazebo_msgs/CMakeFiles/_gazebo_msgs_generate_messages_check_deps_GetLinkProperties.dir/build [ 0%] Built target _gazebo_msgs_generate_messages_check_deps_SetModelState make -f gazebo_msgs/CMakeFiles/_gazebo_msgs_generate_messages_check_deps_ODEPhysics.dir/build.make gazebo_msgs/CMakeFiles/_gazebo_msgs_generate_messages_check_deps_ODEPhysics.dir/depend make[2]: Entering directory `/local/robotpkg/var/tmp/robotpkg/wip/prf-gazebo-ros-pkgs/work/gazebo_ros_pkgs-2.6.7/build' cd /local/robotpkg/var/tmp/robotpkg/wip/prf-gazebo-ros-pkgs/work/gazebo_ros_pkgs-2.6.7/build/gazebo_msgs && ../catkin_generated/env_cached.sh /usr/bin/python2.7 /opt/ros/indigo/share/genmsg/cmake//../../../lib/genmsg/genmsg_check_deps.py gazebo_msgs /local/robotpkg/var/tmp/robotpkg/wip/prf-gazebo-ros-pkgs/work/gazebo_ros_pkgs-2.6.7/gazebo_msgs/srv/GetLinkProperties.srv geometry_msgs/Quaternion:geometry_msgs/Point:geometry_msgs/Pose make[2]: Entering directory `/local/robotpkg/var/tmp/robotpkg/wip/prf-gazebo-ros-pkgs/work/gazebo_ros_pkgs-2.6.7/build' cd /local/robotpkg/var/tmp/robotpkg/wip/prf-gazebo-ros-pkgs/work/gazebo_ros_pkgs-2.6.7/build && /usr/bin/cmake -E cmake_depends "Unix Makefiles" /local/robotpkg/var/tmp/robotpkg/wip/prf-gazebo-ros-pkgs/work/gazebo_ros_pkgs-2.6.7 /local/robotpkg/var/tmp/robotpkg/wip/prf-gazebo-ros-pkgs/work/gazebo_ros_pkgs-2.6.7/gazebo_msgs /local/robotpkg/var/tmp/robotpkg/wip/prf-gazebo-ros-pkgs/work/gazebo_ros_pkgs-2.6.7/build /local/robotpkg/var/tmp/robotpkg/wip/prf-gazebo-ros-pkgs/work/gazebo_ros_pkgs-2.6.7/build/gazebo_msgs /local/robotpkg/var/tmp/robotpkg/wip/prf-gazebo-ros-pkgs/work/gazebo_ros_pkgs-2.6.7/build/gazebo_msgs/CMakeFiles/_gazebo_msgs_generate_messages_check_deps_ODEPhysics.dir/DependInfo.cmake --color= Scanning dependencies of target _gazebo_msgs_generate_messages_check_deps_ODEPhysics make[2]: Leaving directory `/local/robotpkg/var/tmp/robotpkg/wip/prf-gazebo-ros-pkgs/work/gazebo_ros_pkgs-2.6.7/build' make -f gazebo_msgs/CMakeFiles/_gazebo_msgs_generate_messages_check_deps_ODEPhysics.dir/build.make gazebo_msgs/CMakeFiles/_gazebo_msgs_generate_messages_check_deps_ODEPhysics.dir/build make[2]: Entering directory `/local/robotpkg/var/tmp/robotpkg/wip/prf-gazebo-ros-pkgs/work/gazebo_ros_pkgs-2.6.7/build' cd /local/robotpkg/var/tmp/robotpkg/wip/prf-gazebo-ros-pkgs/work/gazebo_ros_pkgs-2.6.7/build/gazebo_msgs && ../catkin_generated/env_cached.sh /usr/bin/python2.7 /opt/ros/indigo/share/genmsg/cmake//../../../lib/genmsg/genmsg_check_deps.py gazebo_msgs /local/robotpkg/var/tmp/robotpkg/wip/prf-gazebo-ros-pkgs/work/gazebo_ros_pkgs-2.6.7/gazebo_msgs/msg/ODEPhysics.msg make[2]: Leaving directory `/local/robotpkg/var/tmp/robotpkg/wip/prf-gazebo-ros-pkgs/work/gazebo_ros_pkgs-2.6.7/build' /usr/bin/cmake -E cmake_progress_report /local/robotpkg/var/tmp/robotpkg/wip/prf-gazebo-ros-pkgs/work/gazebo_ros_pkgs-2.6.7/build/CMakeFiles make[2]: Leaving directory `/local/robotpkg/var/tmp/robotpkg/wip/prf-gazebo-ros-pkgs/work/gazebo_ros_pkgs-2.6.7/build' /usr/bin/cmake -E cmake_progress_report /local/robotpkg/var/tmp/robotpkg/wip/prf-gazebo-ros-pkgs/work/gazebo_ros_pkgs-2.6.7/build/CMakeFiles [ 0%] Built target _gazebo_msgs_generate_messages_check_deps_ODEJointProperties make -f gazebo_msgs/CMakeFiles/_gazebo_msgs_generate_messages_check_deps_GetLightProperties.dir/build.make gazebo_msgs/CMakeFiles/_gazebo_msgs_generate_messages_check_deps_GetLightProperties.dir/depend make[2]: Entering directory `/local/robotpkg/var/tmp/robotpkg/wip/prf-gazebo-ros-pkgs/work/gazebo_ros_pkgs-2.6.7/build' cd /local/robotpkg/var/tmp/robotpkg/wip/prf-gazebo-ros-pkgs/work/gazebo_ros_pkgs-2.6.7/build && /usr/bin/cmake -E cmake_depends "Unix Makefiles" /local/robotpkg/var/tmp/robotpkg/wip/prf-gazebo-ros-pkgs/work/gazebo_ros_pkgs-2.6.7 /local/robotpkg/var/tmp/robotpkg/wip/prf-gazebo-ros-pkgs/work/gazebo_ros_pkgs-2.6.7/gazebo_msgs /local/robotpkg/var/tmp/robotpkg/wip/prf-gazebo-ros-pkgs/work/gazebo_ros_pkgs-2.6.7/build /local/robotpkg/var/tmp/robotpkg/wip/prf-gazebo-ros-pkgs/work/gazebo_ros_pkgs-2.6.7/build/gazebo_msgs /local/robotpkg/var/tmp/robotpkg/wip/prf-gazebo-ros-pkgs/work/gazebo_ros_pkgs-2.6.7/build/gazebo_msgs/CMakeFiles/_gazebo_msgs_generate_messages_check_deps_GetLightProperties.dir/DependInfo.cmake --color= [ 0%] Built target _gazebo_msgs_generate_messages_check_deps_GetWorldProperties make -f gazebo_msgs/CMakeFiles/_gazebo_msgs_generate_messages_check_deps_SetLightProperties.dir/build.make gazebo_msgs/CMakeFiles/_gazebo_msgs_generate_messages_check_deps_SetLightProperties.dir/depend Scanning dependencies of target _gazebo_msgs_generate_messages_check_deps_GetLightProperties make[2]: Leaving directory `/local/robotpkg/var/tmp/robotpkg/wip/prf-gazebo-ros-pkgs/work/gazebo_ros_pkgs-2.6.7/build' make[2]: Leaving directory `/local/robotpkg/var/tmp/robotpkg/wip/prf-gazebo-ros-pkgs/work/gazebo_ros_pkgs-2.6.7/build' /usr/bin/cmake -E cmake_progress_report /local/robotpkg/var/tmp/robotpkg/wip/prf-gazebo-ros-pkgs/work/gazebo_ros_pkgs-2.6.7/build/CMakeFiles make[2]: Entering directory `/local/robotpkg/var/tmp/robotpkg/wip/prf-gazebo-ros-pkgs/work/gazebo_ros_pkgs-2.6.7/build' cd /local/robotpkg/var/tmp/robotpkg/wip/prf-gazebo-ros-pkgs/work/gazebo_ros_pkgs-2.6.7/build && /usr/bin/cmake -E cmake_depends "Unix Makefiles" /local/robotpkg/var/tmp/robotpkg/wip/prf-gazebo-ros-pkgs/work/gazebo_ros_pkgs-2.6.7 /local/robotpkg/var/tmp/robotpkg/wip/prf-gazebo-ros-pkgs/work/gazebo_ros_pkgs-2.6.7/gazebo_msgs /local/robotpkg/var/tmp/robotpkg/wip/prf-gazebo-ros-pkgs/work/gazebo_ros_pkgs-2.6.7/build /local/robotpkg/var/tmp/robotpkg/wip/prf-gazebo-ros-pkgs/work/gazebo_ros_pkgs-2.6.7/build/gazebo_msgs /local/robotpkg/var/tmp/robotpkg/wip/prf-gazebo-ros-pkgs/work/gazebo_ros_pkgs-2.6.7/build/gazebo_msgs/CMakeFiles/_gazebo_msgs_generate_messages_check_deps_SetLightProperties.dir/DependInfo.cmake --color= Scanning dependencies of target _gazebo_msgs_generate_messages_check_deps_SetLightProperties make -f gazebo_msgs/CMakeFiles/_gazebo_msgs_generate_messages_check_deps_GetLightProperties.dir/build.make gazebo_msgs/CMakeFiles/_gazebo_msgs_generate_messages_check_deps_GetLightProperties.dir/build make[2]: Leaving directory `/local/robotpkg/var/tmp/robotpkg/wip/prf-gazebo-ros-pkgs/work/gazebo_ros_pkgs-2.6.7/build' make[2]: Leaving directory `/local/robotpkg/var/tmp/robotpkg/wip/prf-gazebo-ros-pkgs/work/gazebo_ros_pkgs-2.6.7/build' [ 0%] make[2]: Entering directory `/local/robotpkg/var/tmp/robotpkg/wip/prf-gazebo-ros-pkgs/work/gazebo_ros_pkgs-2.6.7/build' cd /local/robotpkg/var/tmp/robotpkg/wip/prf-gazebo-ros-pkgs/work/gazebo_ros_pkgs-2.6.7/build/gazebo_msgs && ../catkin_generated/env_cached.sh /usr/bin/python2.7 /opt/ros/indigo/share/genmsg/cmake//../../../lib/genmsg/genmsg_check_deps.py gazebo_msgs /local/robotpkg/var/tmp/robotpkg/wip/prf-gazebo-ros-pkgs/work/gazebo_ros_pkgs-2.6.7/gazebo_msgs/srv/GetLightProperties.srv std_msgs/ColorRGBA /usr/bin/cmake -E cmake_progress_report /local/robotpkg/var/tmp/robotpkg/wip/prf-gazebo-ros-pkgs/work/gazebo_ros_pkgs-2.6.7/build/CMakeFiles make -f gazebo_msgs/CMakeFiles/_gazebo_msgs_generate_messages_check_deps_SetLightProperties.dir/build.make gazebo_msgs/CMakeFiles/_gazebo_msgs_generate_messages_check_deps_SetLightProperties.dir/build [ 0%] make[2]: Entering directory `/local/robotpkg/var/tmp/robotpkg/wip/prf-gazebo-ros-pkgs/work/gazebo_ros_pkgs-2.6.7/build' cd /local/robotpkg/var/tmp/robotpkg/wip/prf-gazebo-ros-pkgs/work/gazebo_ros_pkgs-2.6.7/build/gazebo_msgs && ../catkin_generated/env_cached.sh /usr/bin/python2.7 /opt/ros/indigo/share/genmsg/cmake//../../../lib/genmsg/genmsg_check_deps.py gazebo_msgs /local/robotpkg/var/tmp/robotpkg/wip/prf-gazebo-ros-pkgs/work/gazebo_ros_pkgs-2.6.7/gazebo_msgs/srv/SetLightProperties.srv std_msgs/ColorRGBA Built target _gazebo_msgs_generate_messages_check_deps_GetLinkProperties make -f gazebo_msgs/CMakeFiles/_gazebo_msgs_generate_messages_check_deps_ApplyBodyWrench.dir/build.make gazebo_msgs/CMakeFiles/_gazebo_msgs_generate_messages_check_deps_ApplyBodyWrench.dir/depend Built target _gazebo_msgs_generate_messages_check_deps_ODEPhysics make -f gazebo_msgs/CMakeFiles/_gazebo_msgs_generate_messages_check_deps_LinkStates.dir/build.make gazebo_msgs/CMakeFiles/_gazebo_msgs_generate_messages_check_deps_LinkStates.dir/depend make[2]: Entering directory `/local/robotpkg/var/tmp/robotpkg/wip/prf-gazebo-ros-pkgs/work/gazebo_ros_pkgs-2.6.7/build' cd /local/robotpkg/var/tmp/robotpkg/wip/prf-gazebo-ros-pkgs/work/gazebo_ros_pkgs-2.6.7/build && /usr/bin/cmake -E cmake_depends "Unix Makefiles" /local/robotpkg/var/tmp/robotpkg/wip/prf-gazebo-ros-pkgs/work/gazebo_ros_pkgs-2.6.7 /local/robotpkg/var/tmp/robotpkg/wip/prf-gazebo-ros-pkgs/work/gazebo_ros_pkgs-2.6.7/gazebo_msgs /local/robotpkg/var/tmp/robotpkg/wip/prf-gazebo-ros-pkgs/work/gazebo_ros_pkgs-2.6.7/build /local/robotpkg/var/tmp/robotpkg/wip/prf-gazebo-ros-pkgs/work/gazebo_ros_pkgs-2.6.7/build/gazebo_msgs /local/robotpkg/var/tmp/robotpkg/wip/prf-gazebo-ros-pkgs/work/gazebo_ros_pkgs-2.6.7/build/gazebo_msgs/CMakeFiles/_gazebo_msgs_generate_messages_check_deps_ApplyBodyWrench.dir/DependInfo.cmake --color= make[2]: Entering directory `/local/robotpkg/var/tmp/robotpkg/wip/prf-gazebo-ros-pkgs/work/gazebo_ros_pkgs-2.6.7/build' cd /local/robotpkg/var/tmp/robotpkg/wip/prf-gazebo-ros-pkgs/work/gazebo_ros_pkgs-2.6.7/build && /usr/bin/cmake -E cmake_depends "Unix Makefiles" /local/robotpkg/var/tmp/robotpkg/wip/prf-gazebo-ros-pkgs/work/gazebo_ros_pkgs-2.6.7 /local/robotpkg/var/tmp/robotpkg/wip/prf-gazebo-ros-pkgs/work/gazebo_ros_pkgs-2.6.7/gazebo_msgs /local/robotpkg/var/tmp/robotpkg/wip/prf-gazebo-ros-pkgs/work/gazebo_ros_pkgs-2.6.7/build /local/robotpkg/var/tmp/robotpkg/wip/prf-gazebo-ros-pkgs/work/gazebo_ros_pkgs-2.6.7/build/gazebo_msgs /local/robotpkg/var/tmp/robotpkg/wip/prf-gazebo-ros-pkgs/work/gazebo_ros_pkgs-2.6.7/build/gazebo_msgs/CMakeFiles/_gazebo_msgs_generate_messages_check_deps_LinkStates.dir/DependInfo.cmake --color= Scanning dependencies of target _gazebo_msgs_generate_messages_check_deps_ApplyBodyWrench make[2]: Leaving directory `/local/robotpkg/var/tmp/robotpkg/wip/prf-gazebo-ros-pkgs/work/gazebo_ros_pkgs-2.6.7/build' make -f gazebo_msgs/CMakeFiles/_gazebo_msgs_generate_messages_check_deps_ApplyBodyWrench.dir/build.make gazebo_msgs/CMakeFiles/_gazebo_msgs_generate_messages_check_deps_ApplyBodyWrench.dir/build make[2]: Entering directory `/local/robotpkg/var/tmp/robotpkg/wip/prf-gazebo-ros-pkgs/work/gazebo_ros_pkgs-2.6.7/build' cd /local/robotpkg/var/tmp/robotpkg/wip/prf-gazebo-ros-pkgs/work/gazebo_ros_pkgs-2.6.7/build/gazebo_msgs && ../catkin_generated/env_cached.sh /usr/bin/python2.7 /opt/ros/indigo/share/genmsg/cmake//../../../lib/genmsg/genmsg_check_deps.py gazebo_msgs /local/robotpkg/var/tmp/robotpkg/wip/prf-gazebo-ros-pkgs/work/gazebo_ros_pkgs-2.6.7/gazebo_msgs/srv/ApplyBodyWrench.srv geometry_msgs/Vector3:geometry_msgs/Wrench:geometry_msgs/Point Scanning dependencies of target _gazebo_msgs_generate_messages_check_deps_LinkStates make[2]: Leaving directory `/local/robotpkg/var/tmp/robotpkg/wip/prf-gazebo-ros-pkgs/work/gazebo_ros_pkgs-2.6.7/build' make -f gazebo_msgs/CMakeFiles/_gazebo_msgs_generate_messages_check_deps_LinkStates.dir/build.make gazebo_msgs/CMakeFiles/_gazebo_msgs_generate_messages_check_deps_LinkStates.dir/build make[2]: Entering directory `/local/robotpkg/var/tmp/robotpkg/wip/prf-gazebo-ros-pkgs/work/gazebo_ros_pkgs-2.6.7/build' cd /local/robotpkg/var/tmp/robotpkg/wip/prf-gazebo-ros-pkgs/work/gazebo_ros_pkgs-2.6.7/build/gazebo_msgs && ../catkin_generated/env_cached.sh /usr/bin/python2.7 /opt/ros/indigo/share/genmsg/cmake//../../../lib/genmsg/genmsg_check_deps.py gazebo_msgs /local/robotpkg/var/tmp/robotpkg/wip/prf-gazebo-ros-pkgs/work/gazebo_ros_pkgs-2.6.7/gazebo_msgs/msg/LinkStates.msg geometry_msgs/Quaternion:geometry_msgs/Vector3:geometry_msgs/Twist:geometry_msgs/Point:geometry_msgs/Pose make[2]: Leaving directory `/local/robotpkg/var/tmp/robotpkg/wip/prf-gazebo-ros-pkgs/work/gazebo_ros_pkgs-2.6.7/build' /usr/bin/cmake -E cmake_progress_report /local/robotpkg/var/tmp/robotpkg/wip/prf-gazebo-ros-pkgs/work/gazebo_ros_pkgs-2.6.7/build/CMakeFiles make[2]: Leaving directory `/local/robotpkg/var/tmp/robotpkg/wip/prf-gazebo-ros-pkgs/work/gazebo_ros_pkgs-2.6.7/build' /usr/bin/cmake -E cmake_progress_report /local/robotpkg/var/tmp/robotpkg/wip/prf-gazebo-ros-pkgs/work/gazebo_ros_pkgs-2.6.7/build/CMakeFiles [ 0%] Built target _gazebo_msgs_generate_messages_check_deps_GetLightProperties make -f gazebo_msgs/CMakeFiles/_gazebo_msgs_generate_messages_check_deps_WorldState.dir/build.make gazebo_msgs/CMakeFiles/_gazebo_msgs_generate_messages_check_deps_WorldState.dir/depend make[2]: Entering directory `/local/robotpkg/var/tmp/robotpkg/wip/prf-gazebo-ros-pkgs/work/gazebo_ros_pkgs-2.6.7/build' cd /local/robotpkg/var/tmp/robotpkg/wip/prf-gazebo-ros-pkgs/work/gazebo_ros_pkgs-2.6.7/build && /usr/bin/cmake -E cmake_depends "Unix Makefiles" /local/robotpkg/var/tmp/robotpkg/wip/prf-gazebo-ros-pkgs/work/gazebo_ros_pkgs-2.6.7 /local/robotpkg/var/tmp/robotpkg/wip/prf-gazebo-ros-pkgs/work/gazebo_ros_pkgs-2.6.7/gazebo_msgs /local/robotpkg/var/tmp/robotpkg/wip/prf-gazebo-ros-pkgs/work/gazebo_ros_pkgs-2.6.7/build /local/robotpkg/var/tmp/robotpkg/wip/prf-gazebo-ros-pkgs/work/gazebo_ros_pkgs-2.6.7/build/gazebo_msgs /local/robotpkg/var/tmp/robotpkg/wip/prf-gazebo-ros-pkgs/work/gazebo_ros_pkgs-2.6.7/build/gazebo_msgs/CMakeFiles/_gazebo_msgs_generate_messages_check_deps_WorldState.dir/DependInfo.cmake --color= Scanning dependencies of target _gazebo_msgs_generate_messages_check_deps_WorldState make[2]: Leaving directory `/local/robotpkg/var/tmp/robotpkg/wip/prf-gazebo-ros-pkgs/work/gazebo_ros_pkgs-2.6.7/build' make -f gazebo_msgs/CMakeFiles/_gazebo_msgs_generate_messages_check_deps_WorldState.dir/build.make gazebo_msgs/CMakeFiles/_gazebo_msgs_generate_messages_check_deps_WorldState.dir/build [ 0%] make[2]: Leaving directory `/local/robotpkg/var/tmp/robotpkg/wip/prf-gazebo-ros-pkgs/work/gazebo_ros_pkgs-2.6.7/build' /usr/bin/cmake -E cmake_progress_report /local/robotpkg/var/tmp/robotpkg/wip/prf-gazebo-ros-pkgs/work/gazebo_ros_pkgs-2.6.7/build/CMakeFiles make[2]: Entering directory `/local/robotpkg/var/tmp/robotpkg/wip/prf-gazebo-ros-pkgs/work/gazebo_ros_pkgs-2.6.7/build' cd /local/robotpkg/var/tmp/robotpkg/wip/prf-gazebo-ros-pkgs/work/gazebo_ros_pkgs-2.6.7/build/gazebo_msgs && ../catkin_generated/env_cached.sh /usr/bin/python2.7 /opt/ros/indigo/share/genmsg/cmake//../../../lib/genmsg/genmsg_check_deps.py gazebo_msgs /local/robotpkg/var/tmp/robotpkg/wip/prf-gazebo-ros-pkgs/work/gazebo_ros_pkgs-2.6.7/gazebo_msgs/msg/WorldState.msg geometry_msgs/Wrench:geometry_msgs/Point:geometry_msgs/Vector3:std_msgs/Header:geometry_msgs/Quaternion:geometry_msgs/Pose:geometry_msgs/Twist make[2]: Leaving directory `/local/robotpkg/var/tmp/robotpkg/wip/prf-gazebo-ros-pkgs/work/gazebo_ros_pkgs-2.6.7/build' /usr/bin/cmake -E cmake_progress_report /local/robotpkg/var/tmp/robotpkg/wip/prf-gazebo-ros-pkgs/work/gazebo_ros_pkgs-2.6.7/build/CMakeFiles Built target _gazebo_msgs_generate_messages_check_deps_SetLightProperties make -f gazebo_msgs/CMakeFiles/_gazebo_msgs_generate_messages_check_deps_SetLinkProperties.dir/build.make gazebo_msgs/CMakeFiles/_gazebo_msgs_generate_messages_check_deps_SetLinkProperties.dir/depend make[2]: Entering directory `/local/robotpkg/var/tmp/robotpkg/wip/prf-gazebo-ros-pkgs/work/gazebo_ros_pkgs-2.6.7/build' cd /local/robotpkg/var/tmp/robotpkg/wip/prf-gazebo-ros-pkgs/work/gazebo_ros_pkgs-2.6.7/build && /usr/bin/cmake -E cmake_depends "Unix Makefiles" /local/robotpkg/var/tmp/robotpkg/wip/prf-gazebo-ros-pkgs/work/gazebo_ros_pkgs-2.6.7 /local/robotpkg/var/tmp/robotpkg/wip/prf-gazebo-ros-pkgs/work/gazebo_ros_pkgs-2.6.7/gazebo_msgs /local/robotpkg/var/tmp/robotpkg/wip/prf-gazebo-ros-pkgs/work/gazebo_ros_pkgs-2.6.7/build /local/robotpkg/var/tmp/robotpkg/wip/prf-gazebo-ros-pkgs/work/gazebo_ros_pkgs-2.6.7/build/gazebo_msgs /local/robotpkg/var/tmp/robotpkg/wip/prf-gazebo-ros-pkgs/work/gazebo_ros_pkgs-2.6.7/build/gazebo_msgs/CMakeFiles/_gazebo_msgs_generate_messages_check_deps_SetLinkProperties.dir/DependInfo.cmake --color= [ 0%] Built target _gazebo_msgs_generate_messages_check_deps_ApplyBodyWrench make -f gazebo_msgs/CMakeFiles/_gazebo_msgs_generate_messages_check_deps_ApplyJointEffort.dir/build.make gazebo_msgs/CMakeFiles/_gazebo_msgs_generate_messages_check_deps_ApplyJointEffort.dir/depend [ 0%] make[2]: Entering directory `/local/robotpkg/var/tmp/robotpkg/wip/prf-gazebo-ros-pkgs/work/gazebo_ros_pkgs-2.6.7/build' cd /local/robotpkg/var/tmp/robotpkg/wip/prf-gazebo-ros-pkgs/work/gazebo_ros_pkgs-2.6.7/build && /usr/bin/cmake -E cmake_depends "Unix Makefiles" /local/robotpkg/var/tmp/robotpkg/wip/prf-gazebo-ros-pkgs/work/gazebo_ros_pkgs-2.6.7 /local/robotpkg/var/tmp/robotpkg/wip/prf-gazebo-ros-pkgs/work/gazebo_ros_pkgs-2.6.7/gazebo_msgs /local/robotpkg/var/tmp/robotpkg/wip/prf-gazebo-ros-pkgs/work/gazebo_ros_pkgs-2.6.7/build /local/robotpkg/var/tmp/robotpkg/wip/prf-gazebo-ros-pkgs/work/gazebo_ros_pkgs-2.6.7/build/gazebo_msgs /local/robotpkg/var/tmp/robotpkg/wip/prf-gazebo-ros-pkgs/work/gazebo_ros_pkgs-2.6.7/build/gazebo_msgs/CMakeFiles/_gazebo_msgs_generate_messages_check_deps_ApplyJointEffort.dir/DependInfo.cmake --color= Scanning dependencies of target _gazebo_msgs_generate_messages_check_deps_SetLinkProperties make[2]: Leaving directory `/local/robotpkg/var/tmp/robotpkg/wip/prf-gazebo-ros-pkgs/work/gazebo_ros_pkgs-2.6.7/build' Built target _gazebo_msgs_generate_messages_check_deps_LinkStates make -f gazebo_msgs/CMakeFiles/_gazebo_msgs_generate_messages_check_deps_SetLinkProperties.dir/build.make gazebo_msgs/CMakeFiles/_gazebo_msgs_generate_messages_check_deps_SetLinkProperties.dir/build make[2]: Entering directory `/local/robotpkg/var/tmp/robotpkg/wip/prf-gazebo-ros-pkgs/work/gazebo_ros_pkgs-2.6.7/build' make -f gazebo_msgs/CMakeFiles/_gazebo_msgs_generate_messages_check_deps_JointRequest.dir/build.make gazebo_msgs/CMakeFiles/_gazebo_msgs_generate_messages_check_deps_JointRequest.dir/depend cd /local/robotpkg/var/tmp/robotpkg/wip/prf-gazebo-ros-pkgs/work/gazebo_ros_pkgs-2.6.7/build/gazebo_msgs && ../catkin_generated/env_cached.sh /usr/bin/python2.7 /opt/ros/indigo/share/genmsg/cmake//../../../lib/genmsg/genmsg_check_deps.py gazebo_msgs /local/robotpkg/var/tmp/robotpkg/wip/prf-gazebo-ros-pkgs/work/gazebo_ros_pkgs-2.6.7/gazebo_msgs/srv/SetLinkProperties.srv geometry_msgs/Quaternion:geometry_msgs/Point:geometry_msgs/Pose make[2]: Entering directory `/local/robotpkg/var/tmp/robotpkg/wip/prf-gazebo-ros-pkgs/work/gazebo_ros_pkgs-2.6.7/build' cd /local/robotpkg/var/tmp/robotpkg/wip/prf-gazebo-ros-pkgs/work/gazebo_ros_pkgs-2.6.7/build && /usr/bin/cmake -E cmake_depends "Unix Makefiles" /local/robotpkg/var/tmp/robotpkg/wip/prf-gazebo-ros-pkgs/work/gazebo_ros_pkgs-2.6.7 /local/robotpkg/var/tmp/robotpkg/wip/prf-gazebo-ros-pkgs/work/gazebo_ros_pkgs-2.6.7/gazebo_msgs /local/robotpkg/var/tmp/robotpkg/wip/prf-gazebo-ros-pkgs/work/gazebo_ros_pkgs-2.6.7/build /local/robotpkg/var/tmp/robotpkg/wip/prf-gazebo-ros-pkgs/work/gazebo_ros_pkgs-2.6.7/build/gazebo_msgs /local/robotpkg/var/tmp/robotpkg/wip/prf-gazebo-ros-pkgs/work/gazebo_ros_pkgs-2.6.7/build/gazebo_msgs/CMakeFiles/_gazebo_msgs_generate_messages_check_deps_JointRequest.dir/DependInfo.cmake --color= Scanning dependencies of target _gazebo_msgs_generate_messages_check_deps_ApplyJointEffort make[2]: Leaving directory `/local/robotpkg/var/tmp/robotpkg/wip/prf-gazebo-ros-pkgs/work/gazebo_ros_pkgs-2.6.7/build' make -f gazebo_msgs/CMakeFiles/_gazebo_msgs_generate_messages_check_deps_ApplyJointEffort.dir/build.make gazebo_msgs/CMakeFiles/_gazebo_msgs_generate_messages_check_deps_ApplyJointEffort.dir/build make[2]: Entering directory `/local/robotpkg/var/tmp/robotpkg/wip/prf-gazebo-ros-pkgs/work/gazebo_ros_pkgs-2.6.7/build' cd /local/robotpkg/var/tmp/robotpkg/wip/prf-gazebo-ros-pkgs/work/gazebo_ros_pkgs-2.6.7/build/gazebo_msgs && ../catkin_generated/env_cached.sh /usr/bin/python2.7 /opt/ros/indigo/share/genmsg/cmake//../../../lib/genmsg/genmsg_check_deps.py gazebo_msgs /local/robotpkg/var/tmp/robotpkg/wip/prf-gazebo-ros-pkgs/work/gazebo_ros_pkgs-2.6.7/gazebo_msgs/srv/ApplyJointEffort.srv Scanning dependencies of target _gazebo_msgs_generate_messages_check_deps_JointRequest make[2]: Leaving directory `/local/robotpkg/var/tmp/robotpkg/wip/prf-gazebo-ros-pkgs/work/gazebo_ros_pkgs-2.6.7/build' make -f gazebo_msgs/CMakeFiles/_gazebo_msgs_generate_messages_check_deps_JointRequest.dir/build.make gazebo_msgs/CMakeFiles/_gazebo_msgs_generate_messages_check_deps_JointRequest.dir/build make[2]: Entering directory `/local/robotpkg/var/tmp/robotpkg/wip/prf-gazebo-ros-pkgs/work/gazebo_ros_pkgs-2.6.7/build' cd /local/robotpkg/var/tmp/robotpkg/wip/prf-gazebo-ros-pkgs/work/gazebo_ros_pkgs-2.6.7/build/gazebo_msgs && ../catkin_generated/env_cached.sh /usr/bin/python2.7 /opt/ros/indigo/share/genmsg/cmake//../../../lib/genmsg/genmsg_check_deps.py gazebo_msgs /local/robotpkg/var/tmp/robotpkg/wip/prf-gazebo-ros-pkgs/work/gazebo_ros_pkgs-2.6.7/gazebo_msgs/srv/JointRequest.srv make[2]: Leaving directory `/local/robotpkg/var/tmp/robotpkg/wip/prf-gazebo-ros-pkgs/work/gazebo_ros_pkgs-2.6.7/build' /usr/bin/cmake -E cmake_progress_report /local/robotpkg/var/tmp/robotpkg/wip/prf-gazebo-ros-pkgs/work/gazebo_ros_pkgs-2.6.7/build/CMakeFiles [ 0%] make[2]: Leaving directory `/local/robotpkg/var/tmp/robotpkg/wip/prf-gazebo-ros-pkgs/work/gazebo_ros_pkgs-2.6.7/build' /usr/bin/cmake -E cmake_progress_report /local/robotpkg/var/tmp/robotpkg/wip/prf-gazebo-ros-pkgs/work/gazebo_ros_pkgs-2.6.7/build/CMakeFiles Built target _gazebo_msgs_generate_messages_check_deps_WorldState make -f gazebo_msgs/CMakeFiles/_gazebo_msgs_generate_messages_check_deps_ContactState.dir/build.make gazebo_msgs/CMakeFiles/_gazebo_msgs_generate_messages_check_deps_ContactState.dir/depend make[2]: Entering directory `/local/robotpkg/var/tmp/robotpkg/wip/prf-gazebo-ros-pkgs/work/gazebo_ros_pkgs-2.6.7/build' cd /local/robotpkg/var/tmp/robotpkg/wip/prf-gazebo-ros-pkgs/work/gazebo_ros_pkgs-2.6.7/build && /usr/bin/cmake -E cmake_depends "Unix Makefiles" /local/robotpkg/var/tmp/robotpkg/wip/prf-gazebo-ros-pkgs/work/gazebo_ros_pkgs-2.6.7 /local/robotpkg/var/tmp/robotpkg/wip/prf-gazebo-ros-pkgs/work/gazebo_ros_pkgs-2.6.7/gazebo_msgs /local/robotpkg/var/tmp/robotpkg/wip/prf-gazebo-ros-pkgs/work/gazebo_ros_pkgs-2.6.7/build /local/robotpkg/var/tmp/robotpkg/wip/prf-gazebo-ros-pkgs/work/gazebo_ros_pkgs-2.6.7/build/gazebo_msgs /local/robotpkg/var/tmp/robotpkg/wip/prf-gazebo-ros-pkgs/work/gazebo_ros_pkgs-2.6.7/build/gazebo_msgs/CMakeFiles/_gazebo_msgs_generate_messages_check_deps_ContactState.dir/DependInfo.cmake --color= [ 0%] Scanning dependencies of target _gazebo_msgs_generate_messages_check_deps_ContactState make[2]: Leaving directory `/local/robotpkg/var/tmp/robotpkg/wip/prf-gazebo-ros-pkgs/work/gazebo_ros_pkgs-2.6.7/build' make -f gazebo_msgs/CMakeFiles/_gazebo_msgs_generate_messages_check_deps_ContactState.dir/build.make gazebo_msgs/CMakeFiles/_gazebo_msgs_generate_messages_check_deps_ContactState.dir/build Built target _gazebo_msgs_generate_messages_check_deps_SetLinkProperties make -f gazebo_msgs/CMakeFiles/_gazebo_msgs_generate_messages_check_deps_LinkState.dir/build.make gazebo_msgs/CMakeFiles/_gazebo_msgs_generate_messages_check_deps_LinkState.dir/depend make[2]: Entering directory `/local/robotpkg/var/tmp/robotpkg/wip/prf-gazebo-ros-pkgs/work/gazebo_ros_pkgs-2.6.7/build' cd /local/robotpkg/var/tmp/robotpkg/wip/prf-gazebo-ros-pkgs/work/gazebo_ros_pkgs-2.6.7/build/gazebo_msgs && ../catkin_generated/env_cached.sh /usr/bin/python2.7 /opt/ros/indigo/share/genmsg/cmake//../../../lib/genmsg/genmsg_check_deps.py gazebo_msgs /local/robotpkg/var/tmp/robotpkg/wip/prf-gazebo-ros-pkgs/work/gazebo_ros_pkgs-2.6.7/gazebo_msgs/msg/ContactState.msg geometry_msgs/Vector3:geometry_msgs/Wrench make[2]: Entering directory `/local/robotpkg/var/tmp/robotpkg/wip/prf-gazebo-ros-pkgs/work/gazebo_ros_pkgs-2.6.7/build' cd /local/robotpkg/var/tmp/robotpkg/wip/prf-gazebo-ros-pkgs/work/gazebo_ros_pkgs-2.6.7/build && /usr/bin/cmake -E cmake_depends "Unix Makefiles" /local/robotpkg/var/tmp/robotpkg/wip/prf-gazebo-ros-pkgs/work/gazebo_ros_pkgs-2.6.7 /local/robotpkg/var/tmp/robotpkg/wip/prf-gazebo-ros-pkgs/work/gazebo_ros_pkgs-2.6.7/gazebo_msgs /local/robotpkg/var/tmp/robotpkg/wip/prf-gazebo-ros-pkgs/work/gazebo_ros_pkgs-2.6.7/build /local/robotpkg/var/tmp/robotpkg/wip/prf-gazebo-ros-pkgs/work/gazebo_ros_pkgs-2.6.7/build/gazebo_msgs /local/robotpkg/var/tmp/robotpkg/wip/prf-gazebo-ros-pkgs/work/gazebo_ros_pkgs-2.6.7/build/gazebo_msgs/CMakeFiles/_gazebo_msgs_generate_messages_check_deps_LinkState.dir/DependInfo.cmake --color= make[2]: Leaving directory `/local/robotpkg/var/tmp/robotpkg/wip/prf-gazebo-ros-pkgs/work/gazebo_ros_pkgs-2.6.7/build' /usr/bin/cmake -E cmake_progress_report /local/robotpkg/var/tmp/robotpkg/wip/prf-gazebo-ros-pkgs/work/gazebo_ros_pkgs-2.6.7/build/CMakeFiles Scanning dependencies of target _gazebo_msgs_generate_messages_check_deps_LinkState make[2]: Leaving directory `/local/robotpkg/var/tmp/robotpkg/wip/prf-gazebo-ros-pkgs/work/gazebo_ros_pkgs-2.6.7/build' make -f gazebo_msgs/CMakeFiles/_gazebo_msgs_generate_messages_check_deps_LinkState.dir/build.make gazebo_msgs/CMakeFiles/_gazebo_msgs_generate_messages_check_deps_LinkState.dir/build make[2]: Entering directory `/local/robotpkg/var/tmp/robotpkg/wip/prf-gazebo-ros-pkgs/work/gazebo_ros_pkgs-2.6.7/build' cd /local/robotpkg/var/tmp/robotpkg/wip/prf-gazebo-ros-pkgs/work/gazebo_ros_pkgs-2.6.7/build/gazebo_msgs && ../catkin_generated/env_cached.sh /usr/bin/python2.7 /opt/ros/indigo/share/genmsg/cmake//../../../lib/genmsg/genmsg_check_deps.py gazebo_msgs /local/robotpkg/var/tmp/robotpkg/wip/prf-gazebo-ros-pkgs/work/gazebo_ros_pkgs-2.6.7/gazebo_msgs/msg/LinkState.msg geometry_msgs/Quaternion:geometry_msgs/Vector3:geometry_msgs/Twist:geometry_msgs/Point:geometry_msgs/Pose [ 0%] Built target _gazebo_msgs_generate_messages_check_deps_ApplyJointEffort make -f gazebo_msgs/CMakeFiles/_gazebo_msgs_generate_messages_check_deps_GetJointProperties.dir/build.make gazebo_msgs/CMakeFiles/_gazebo_msgs_generate_messages_check_deps_GetJointProperties.dir/depend make[2]: Entering directory `/local/robotpkg/var/tmp/robotpkg/wip/prf-gazebo-ros-pkgs/work/gazebo_ros_pkgs-2.6.7/build' cd /local/robotpkg/var/tmp/robotpkg/wip/prf-gazebo-ros-pkgs/work/gazebo_ros_pkgs-2.6.7/build && /usr/bin/cmake -E cmake_depends "Unix Makefiles" /local/robotpkg/var/tmp/robotpkg/wip/prf-gazebo-ros-pkgs/work/gazebo_ros_pkgs-2.6.7 /local/robotpkg/var/tmp/robotpkg/wip/prf-gazebo-ros-pkgs/work/gazebo_ros_pkgs-2.6.7/gazebo_msgs /local/robotpkg/var/tmp/robotpkg/wip/prf-gazebo-ros-pkgs/work/gazebo_ros_pkgs-2.6.7/build /local/robotpkg/var/tmp/robotpkg/wip/prf-gazebo-ros-pkgs/work/gazebo_ros_pkgs-2.6.7/build/gazebo_msgs /local/robotpkg/var/tmp/robotpkg/wip/prf-gazebo-ros-pkgs/work/gazebo_ros_pkgs-2.6.7/build/gazebo_msgs/CMakeFiles/_gazebo_msgs_generate_messages_check_deps_GetJointProperties.dir/DependInfo.cmake --color= make[2]: Leaving directory `/local/robotpkg/var/tmp/robotpkg/wip/prf-gazebo-ros-pkgs/work/gazebo_ros_pkgs-2.6.7/build' /usr/bin/cmake -E cmake_progress_report /local/robotpkg/var/tmp/robotpkg/wip/prf-gazebo-ros-pkgs/work/gazebo_ros_pkgs-2.6.7/build/CMakeFiles [ 0%] Built target _gazebo_msgs_generate_messages_check_deps_JointRequest make -f gazebo_msgs/CMakeFiles/_gazebo_msgs_generate_messages_check_deps_SetModelConfiguration.dir/build.make gazebo_msgs/CMakeFiles/_gazebo_msgs_generate_messages_check_deps_SetModelConfiguration.dir/depend make[2]: Entering directory `/local/robotpkg/var/tmp/robotpkg/wip/prf-gazebo-ros-pkgs/work/gazebo_ros_pkgs-2.6.7/build' cd /local/robotpkg/var/tmp/robotpkg/wip/prf-gazebo-ros-pkgs/work/gazebo_ros_pkgs-2.6.7/build && /usr/bin/cmake -E cmake_depends "Unix Makefiles" /local/robotpkg/var/tmp/robotpkg/wip/prf-gazebo-ros-pkgs/work/gazebo_ros_pkgs-2.6.7 /local/robotpkg/var/tmp/robotpkg/wip/prf-gazebo-ros-pkgs/work/gazebo_ros_pkgs-2.6.7/gazebo_msgs /local/robotpkg/var/tmp/robotpkg/wip/prf-gazebo-ros-pkgs/work/gazebo_ros_pkgs-2.6.7/build /local/robotpkg/var/tmp/robotpkg/wip/prf-gazebo-ros-pkgs/work/gazebo_ros_pkgs-2.6.7/build/gazebo_msgs /local/robotpkg/var/tmp/robotpkg/wip/prf-gazebo-ros-pkgs/work/gazebo_ros_pkgs-2.6.7/build/gazebo_msgs/CMakeFiles/_gazebo_msgs_generate_messages_check_deps_SetModelConfiguration.dir/DependInfo.cmake --color= Scanning dependencies of target _gazebo_msgs_generate_messages_check_deps_GetJointProperties make[2]: Leaving directory `/local/robotpkg/var/tmp/robotpkg/wip/prf-gazebo-ros-pkgs/work/gazebo_ros_pkgs-2.6.7/build' make -f gazebo_msgs/CMakeFiles/_gazebo_msgs_generate_messages_check_deps_GetJointProperties.dir/build.make gazebo_msgs/CMakeFiles/_gazebo_msgs_generate_messages_check_deps_GetJointProperties.dir/build make[2]: Entering directory `/local/robotpkg/var/tmp/robotpkg/wip/prf-gazebo-ros-pkgs/work/gazebo_ros_pkgs-2.6.7/build' cd /local/robotpkg/var/tmp/robotpkg/wip/prf-gazebo-ros-pkgs/work/gazebo_ros_pkgs-2.6.7/build/gazebo_msgs && ../catkin_generated/env_cached.sh /usr/bin/python2.7 /opt/ros/indigo/share/genmsg/cmake//../../../lib/genmsg/genmsg_check_deps.py gazebo_msgs /local/robotpkg/var/tmp/robotpkg/wip/prf-gazebo-ros-pkgs/work/gazebo_ros_pkgs-2.6.7/gazebo_msgs/srv/GetJointProperties.srv make[2]: Leaving directory `/local/robotpkg/var/tmp/robotpkg/wip/prf-gazebo-ros-pkgs/work/gazebo_ros_pkgs-2.6.7/build' /usr/bin/cmake -E cmake_progress_report /local/robotpkg/var/tmp/robotpkg/wip/prf-gazebo-ros-pkgs/work/gazebo_ros_pkgs-2.6.7/build/CMakeFiles Scanning dependencies of target _gazebo_msgs_generate_messages_check_deps_SetModelConfiguration make[2]: Leaving directory `/local/robotpkg/var/tmp/robotpkg/wip/prf-gazebo-ros-pkgs/work/gazebo_ros_pkgs-2.6.7/build' make -f gazebo_msgs/CMakeFiles/_gazebo_msgs_generate_messages_check_deps_SetModelConfiguration.dir/build.make gazebo_msgs/CMakeFiles/_gazebo_msgs_generate_messages_check_deps_SetModelConfiguration.dir/build make[2]: Entering directory `/local/robotpkg/var/tmp/robotpkg/wip/prf-gazebo-ros-pkgs/work/gazebo_ros_pkgs-2.6.7/build' cd /local/robotpkg/var/tmp/robotpkg/wip/prf-gazebo-ros-pkgs/work/gazebo_ros_pkgs-2.6.7/build/gazebo_msgs && ../catkin_generated/env_cached.sh /usr/bin/python2.7 /opt/ros/indigo/share/genmsg/cmake//../../../lib/genmsg/genmsg_check_deps.py gazebo_msgs /local/robotpkg/var/tmp/robotpkg/wip/prf-gazebo-ros-pkgs/work/gazebo_ros_pkgs-2.6.7/gazebo_msgs/srv/SetModelConfiguration.srv [ 0%] Built target _gazebo_msgs_generate_messages_check_deps_ContactState make -f gazebo_msgs/CMakeFiles/_gazebo_msgs_generate_messages_check_deps_BodyRequest.dir/build.make gazebo_msgs/CMakeFiles/_gazebo_msgs_generate_messages_check_deps_BodyRequest.dir/depend make[2]: Entering directory `/local/robotpkg/var/tmp/robotpkg/wip/prf-gazebo-ros-pkgs/work/gazebo_ros_pkgs-2.6.7/build' cd /local/robotpkg/var/tmp/robotpkg/wip/prf-gazebo-ros-pkgs/work/gazebo_ros_pkgs-2.6.7/build && /usr/bin/cmake -E cmake_depends "Unix Makefiles" /local/robotpkg/var/tmp/robotpkg/wip/prf-gazebo-ros-pkgs/work/gazebo_ros_pkgs-2.6.7 /local/robotpkg/var/tmp/robotpkg/wip/prf-gazebo-ros-pkgs/work/gazebo_ros_pkgs-2.6.7/gazebo_msgs /local/robotpkg/var/tmp/robotpkg/wip/prf-gazebo-ros-pkgs/work/gazebo_ros_pkgs-2.6.7/build /local/robotpkg/var/tmp/robotpkg/wip/prf-gazebo-ros-pkgs/work/gazebo_ros_pkgs-2.6.7/build/gazebo_msgs /local/robotpkg/var/tmp/robotpkg/wip/prf-gazebo-ros-pkgs/work/gazebo_ros_pkgs-2.6.7/build/gazebo_msgs/CMakeFiles/_gazebo_msgs_generate_messages_check_deps_BodyRequest.dir/DependInfo.cmake --color= make[2]: Leaving directory `/local/robotpkg/var/tmp/robotpkg/wip/prf-gazebo-ros-pkgs/work/gazebo_ros_pkgs-2.6.7/build' /usr/bin/cmake -E cmake_progress_report /local/robotpkg/var/tmp/robotpkg/wip/prf-gazebo-ros-pkgs/work/gazebo_ros_pkgs-2.6.7/build/CMakeFiles Scanning dependencies of target _gazebo_msgs_generate_messages_check_deps_BodyRequest make[2]: Leaving directory `/local/robotpkg/var/tmp/robotpkg/wip/prf-gazebo-ros-pkgs/work/gazebo_ros_pkgs-2.6.7/build' make -f gazebo_msgs/CMakeFiles/_gazebo_msgs_generate_messages_check_deps_BodyRequest.dir/build.make gazebo_msgs/CMakeFiles/_gazebo_msgs_generate_messages_check_deps_BodyRequest.dir/build [ 0%] Built target _gazebo_msgs_generate_messages_check_deps_LinkState make -f gazebo_msgs/CMakeFiles/_gazebo_msgs_generate_messages_check_deps_GetModelState.dir/build.make gazebo_msgs/CMakeFiles/_gazebo_msgs_generate_messages_check_deps_GetModelState.dir/depend make[2]: Entering directory `/local/robotpkg/var/tmp/robotpkg/wip/prf-gazebo-ros-pkgs/work/gazebo_ros_pkgs-2.6.7/build' cd /local/robotpkg/var/tmp/robotpkg/wip/prf-gazebo-ros-pkgs/work/gazebo_ros_pkgs-2.6.7/build/gazebo_msgs && ../catkin_generated/env_cached.sh /usr/bin/python2.7 /opt/ros/indigo/share/genmsg/cmake//../../../lib/genmsg/genmsg_check_deps.py gazebo_msgs /local/robotpkg/var/tmp/robotpkg/wip/prf-gazebo-ros-pkgs/work/gazebo_ros_pkgs-2.6.7/gazebo_msgs/srv/BodyRequest.srv make[2]: Entering directory `/local/robotpkg/var/tmp/robotpkg/wip/prf-gazebo-ros-pkgs/work/gazebo_ros_pkgs-2.6.7/build' cd /local/robotpkg/var/tmp/robotpkg/wip/prf-gazebo-ros-pkgs/work/gazebo_ros_pkgs-2.6.7/build && /usr/bin/cmake -E cmake_depends "Unix Makefiles" /local/robotpkg/var/tmp/robotpkg/wip/prf-gazebo-ros-pkgs/work/gazebo_ros_pkgs-2.6.7 /local/robotpkg/var/tmp/robotpkg/wip/prf-gazebo-ros-pkgs/work/gazebo_ros_pkgs-2.6.7/gazebo_msgs /local/robotpkg/var/tmp/robotpkg/wip/prf-gazebo-ros-pkgs/work/gazebo_ros_pkgs-2.6.7/build /local/robotpkg/var/tmp/robotpkg/wip/prf-gazebo-ros-pkgs/work/gazebo_ros_pkgs-2.6.7/build/gazebo_msgs /local/robotpkg/var/tmp/robotpkg/wip/prf-gazebo-ros-pkgs/work/gazebo_ros_pkgs-2.6.7/build/gazebo_msgs/CMakeFiles/_gazebo_msgs_generate_messages_check_deps_GetModelState.dir/DependInfo.cmake --color= Scanning dependencies of target _gazebo_msgs_generate_messages_check_deps_GetModelState make[2]: Leaving directory `/local/robotpkg/var/tmp/robotpkg/wip/prf-gazebo-ros-pkgs/work/gazebo_ros_pkgs-2.6.7/build' make -f gazebo_msgs/CMakeFiles/_gazebo_msgs_generate_messages_check_deps_GetModelState.dir/build.make gazebo_msgs/CMakeFiles/_gazebo_msgs_generate_messages_check_deps_GetModelState.dir/build make[2]: Entering directory `/local/robotpkg/var/tmp/robotpkg/wip/prf-gazebo-ros-pkgs/work/gazebo_ros_pkgs-2.6.7/build' cd /local/robotpkg/var/tmp/robotpkg/wip/prf-gazebo-ros-pkgs/work/gazebo_ros_pkgs-2.6.7/build/gazebo_msgs && ../catkin_generated/env_cached.sh /usr/bin/python2.7 /opt/ros/indigo/share/genmsg/cmake//../../../lib/genmsg/genmsg_check_deps.py gazebo_msgs /local/robotpkg/var/tmp/robotpkg/wip/prf-gazebo-ros-pkgs/work/gazebo_ros_pkgs-2.6.7/gazebo_msgs/srv/GetModelState.srv geometry_msgs/Point:geometry_msgs/Vector3:std_msgs/Header:geometry_msgs/Quaternion:geometry_msgs/Pose:geometry_msgs/Twist make[2]: Leaving directory `/local/robotpkg/var/tmp/robotpkg/wip/prf-gazebo-ros-pkgs/work/gazebo_ros_pkgs-2.6.7/build' /usr/bin/cmake -E cmake_progress_report /local/robotpkg/var/tmp/robotpkg/wip/prf-gazebo-ros-pkgs/work/gazebo_ros_pkgs-2.6.7/build/CMakeFiles [ 0%] Built target _gazebo_msgs_generate_messages_check_deps_GetJointProperties make -f gazebo_msgs/CMakeFiles/_gazebo_msgs_generate_messages_check_deps_GetPhysicsProperties.dir/build.make gazebo_msgs/CMakeFiles/_gazebo_msgs_generate_messages_check_deps_GetPhysicsProperties.dir/depend make[2]: Entering directory `/local/robotpkg/var/tmp/robotpkg/wip/prf-gazebo-ros-pkgs/work/gazebo_ros_pkgs-2.6.7/build' cd /local/robotpkg/var/tmp/robotpkg/wip/prf-gazebo-ros-pkgs/work/gazebo_ros_pkgs-2.6.7/build && /usr/bin/cmake -E cmake_depends "Unix Makefiles" /local/robotpkg/var/tmp/robotpkg/wip/prf-gazebo-ros-pkgs/work/gazebo_ros_pkgs-2.6.7 /local/robotpkg/var/tmp/robotpkg/wip/prf-gazebo-ros-pkgs/work/gazebo_ros_pkgs-2.6.7/gazebo_msgs /local/robotpkg/var/tmp/robotpkg/wip/prf-gazebo-ros-pkgs/work/gazebo_ros_pkgs-2.6.7/build /local/robotpkg/var/tmp/robotpkg/wip/prf-gazebo-ros-pkgs/work/gazebo_ros_pkgs-2.6.7/build/gazebo_msgs /local/robotpkg/var/tmp/robotpkg/wip/prf-gazebo-ros-pkgs/work/gazebo_ros_pkgs-2.6.7/build/gazebo_msgs/CMakeFiles/_gazebo_msgs_generate_messages_check_deps_GetPhysicsProperties.dir/DependInfo.cmake --color= Scanning dependencies of target _gazebo_msgs_generate_messages_check_deps_GetPhysicsProperties make[2]: Leaving directory `/local/robotpkg/var/tmp/robotpkg/wip/prf-gazebo-ros-pkgs/work/gazebo_ros_pkgs-2.6.7/build' make -f gazebo_msgs/CMakeFiles/_gazebo_msgs_generate_messages_check_deps_GetPhysicsProperties.dir/build.make gazebo_msgs/CMakeFiles/_gazebo_msgs_generate_messages_check_deps_GetPhysicsProperties.dir/build make[2]: Entering directory `/local/robotpkg/var/tmp/robotpkg/wip/prf-gazebo-ros-pkgs/work/gazebo_ros_pkgs-2.6.7/build' cd /local/robotpkg/var/tmp/robotpkg/wip/prf-gazebo-ros-pkgs/work/gazebo_ros_pkgs-2.6.7/build/gazebo_msgs && ../catkin_generated/env_cached.sh /usr/bin/python2.7 /opt/ros/indigo/share/genmsg/cmake//../../../lib/genmsg/genmsg_check_deps.py gazebo_msgs /local/robotpkg/var/tmp/robotpkg/wip/prf-gazebo-ros-pkgs/work/gazebo_ros_pkgs-2.6.7/gazebo_msgs/srv/GetPhysicsProperties.srv geometry_msgs/Vector3:gazebo_msgs/ODEPhysics make[2]: Leaving directory `/local/robotpkg/var/tmp/robotpkg/wip/prf-gazebo-ros-pkgs/work/gazebo_ros_pkgs-2.6.7/build' /usr/bin/cmake -E cmake_progress_report /local/robotpkg/var/tmp/robotpkg/wip/prf-gazebo-ros-pkgs/work/gazebo_ros_pkgs-2.6.7/build/CMakeFiles [ 0%] Built target _gazebo_msgs_generate_messages_check_deps_SetModelConfiguration make -f gazebo_msgs/CMakeFiles/trajectory_msgs_generate_messages_lisp.dir/build.make gazebo_msgs/CMakeFiles/trajectory_msgs_generate_messages_lisp.dir/depend make[2]: Entering directory `/local/robotpkg/var/tmp/robotpkg/wip/prf-gazebo-ros-pkgs/work/gazebo_ros_pkgs-2.6.7/build' cd /local/robotpkg/var/tmp/robotpkg/wip/prf-gazebo-ros-pkgs/work/gazebo_ros_pkgs-2.6.7/build && /usr/bin/cmake -E cmake_depends "Unix Makefiles" /local/robotpkg/var/tmp/robotpkg/wip/prf-gazebo-ros-pkgs/work/gazebo_ros_pkgs-2.6.7 /local/robotpkg/var/tmp/robotpkg/wip/prf-gazebo-ros-pkgs/work/gazebo_ros_pkgs-2.6.7/gazebo_msgs /local/robotpkg/var/tmp/robotpkg/wip/prf-gazebo-ros-pkgs/work/gazebo_ros_pkgs-2.6.7/build /local/robotpkg/var/tmp/robotpkg/wip/prf-gazebo-ros-pkgs/work/gazebo_ros_pkgs-2.6.7/build/gazebo_msgs /local/robotpkg/var/tmp/robotpkg/wip/prf-gazebo-ros-pkgs/work/gazebo_ros_pkgs-2.6.7/build/gazebo_msgs/CMakeFiles/trajectory_msgs_generate_messages_lisp.dir/DependInfo.cmake --color= make[2]: Leaving directory `/local/robotpkg/var/tmp/robotpkg/wip/prf-gazebo-ros-pkgs/work/gazebo_ros_pkgs-2.6.7/build' /usr/bin/cmake -E cmake_progress_report /local/robotpkg/var/tmp/robotpkg/wip/prf-gazebo-ros-pkgs/work/gazebo_ros_pkgs-2.6.7/build/CMakeFiles [ 0%] Built target _gazebo_msgs_generate_messages_check_deps_BodyRequest make[2]: Leaving directory `/local/robotpkg/var/tmp/robotpkg/wip/prf-gazebo-ros-pkgs/work/gazebo_ros_pkgs-2.6.7/build' /usr/bin/cmake -E cmake_progress_report /local/robotpkg/var/tmp/robotpkg/wip/prf-gazebo-ros-pkgs/work/gazebo_ros_pkgs-2.6.7/build/CMakeFiles make -f gazebo_msgs/CMakeFiles/sensor_msgs_generate_messages_lisp.dir/build.make gazebo_msgs/CMakeFiles/sensor_msgs_generate_messages_lisp.dir/depend Scanning dependencies of target trajectory_msgs_generate_messages_lisp make[2]: Entering directory `/local/robotpkg/var/tmp/robotpkg/wip/prf-gazebo-ros-pkgs/work/gazebo_ros_pkgs-2.6.7/build' make[2]: Leaving directory `/local/robotpkg/var/tmp/robotpkg/wip/prf-gazebo-ros-pkgs/work/gazebo_ros_pkgs-2.6.7/build' make -f gazebo_msgs/CMakeFiles/trajectory_msgs_generate_messages_lisp.dir/build.make gazebo_msgs/CMakeFiles/trajectory_msgs_generate_messages_lisp.dir/build cd /local/robotpkg/var/tmp/robotpkg/wip/prf-gazebo-ros-pkgs/work/gazebo_ros_pkgs-2.6.7/build && /usr/bin/cmake -E cmake_depends "Unix Makefiles" /local/robotpkg/var/tmp/robotpkg/wip/prf-gazebo-ros-pkgs/work/gazebo_ros_pkgs-2.6.7 /local/robotpkg/var/tmp/robotpkg/wip/prf-gazebo-ros-pkgs/work/gazebo_ros_pkgs-2.6.7/gazebo_msgs /local/robotpkg/var/tmp/robotpkg/wip/prf-gazebo-ros-pkgs/work/gazebo_ros_pkgs-2.6.7/build /local/robotpkg/var/tmp/robotpkg/wip/prf-gazebo-ros-pkgs/work/gazebo_ros_pkgs-2.6.7/build/gazebo_msgs /local/robotpkg/var/tmp/robotpkg/wip/prf-gazebo-ros-pkgs/work/gazebo_ros_pkgs-2.6.7/build/gazebo_msgs/CMakeFiles/sensor_msgs_generate_messages_lisp.dir/DependInfo.cmake --color= [ 0%] make[2]: Entering directory `/local/robotpkg/var/tmp/robotpkg/wip/prf-gazebo-ros-pkgs/work/gazebo_ros_pkgs-2.6.7/build' make[2]: Nothing to be done for `gazebo_msgs/CMakeFiles/trajectory_msgs_generate_messages_lisp.dir/build'. make[2]: Leaving directory `/local/robotpkg/var/tmp/robotpkg/wip/prf-gazebo-ros-pkgs/work/gazebo_ros_pkgs-2.6.7/build' Scanning dependencies of target sensor_msgs_generate_messages_lisp Built target _gazebo_msgs_generate_messages_check_deps_GetModelState /usr/bin/cmake -E cmake_progress_report /local/robotpkg/var/tmp/robotpkg/wip/prf-gazebo-ros-pkgs/work/gazebo_ros_pkgs-2.6.7/build/CMakeFiles make -f gazebo_msgs/CMakeFiles/std_msgs_generate_messages_lisp.dir/build.make gazebo_msgs/CMakeFiles/std_msgs_generate_messages_lisp.dir/depend [ 0%] make[2]: Entering directory `/local/robotpkg/var/tmp/robotpkg/wip/prf-gazebo-ros-pkgs/work/gazebo_ros_pkgs-2.6.7/build' cd /local/robotpkg/var/tmp/robotpkg/wip/prf-gazebo-ros-pkgs/work/gazebo_ros_pkgs-2.6.7/build && /usr/bin/cmake -E cmake_depends "Unix Makefiles" /local/robotpkg/var/tmp/robotpkg/wip/prf-gazebo-ros-pkgs/work/gazebo_ros_pkgs-2.6.7 /local/robotpkg/var/tmp/robotpkg/wip/prf-gazebo-ros-pkgs/work/gazebo_ros_pkgs-2.6.7/gazebo_msgs /local/robotpkg/var/tmp/robotpkg/wip/prf-gazebo-ros-pkgs/work/gazebo_ros_pkgs-2.6.7/build /local/robotpkg/var/tmp/robotpkg/wip/prf-gazebo-ros-pkgs/work/gazebo_ros_pkgs-2.6.7/build/gazebo_msgs /local/robotpkg/var/tmp/robotpkg/wip/prf-gazebo-ros-pkgs/work/gazebo_ros_pkgs-2.6.7/build/gazebo_msgs/CMakeFiles/std_msgs_generate_messages_lisp.dir/DependInfo.cmake --color= make[2]: Leaving directory `/local/robotpkg/var/tmp/robotpkg/wip/prf-gazebo-ros-pkgs/work/gazebo_ros_pkgs-2.6.7/build' make -f gazebo_msgs/CMakeFiles/sensor_msgs_generate_messages_lisp.dir/build.make gazebo_msgs/CMakeFiles/sensor_msgs_generate_messages_lisp.dir/build Built target trajectory_msgs_generate_messages_lisp make -f gazebo_msgs/CMakeFiles/geometry_msgs_generate_messages_lisp.dir/build.make gazebo_msgs/CMakeFiles/geometry_msgs_generate_messages_lisp.dir/depend make[2]: Entering directory `/local/robotpkg/var/tmp/robotpkg/wip/prf-gazebo-ros-pkgs/work/gazebo_ros_pkgs-2.6.7/build' make[2]: Nothing to be done for `gazebo_msgs/CMakeFiles/sensor_msgs_generate_messages_lisp.dir/build'. make[2]: Leaving directory `/local/robotpkg/var/tmp/robotpkg/wip/prf-gazebo-ros-pkgs/work/gazebo_ros_pkgs-2.6.7/build' make[2]: Leaving directory `/local/robotpkg/var/tmp/robotpkg/wip/prf-gazebo-ros-pkgs/work/gazebo_ros_pkgs-2.6.7/build' /usr/bin/cmake -E cmake_progress_report /local/robotpkg/var/tmp/robotpkg/wip/prf-gazebo-ros-pkgs/work/gazebo_ros_pkgs-2.6.7/build/CMakeFiles make[2]: Entering directory `/local/robotpkg/var/tmp/robotpkg/wip/prf-gazebo-ros-pkgs/work/gazebo_ros_pkgs-2.6.7/build' cd /local/robotpkg/var/tmp/robotpkg/wip/prf-gazebo-ros-pkgs/work/gazebo_ros_pkgs-2.6.7/build && /usr/bin/cmake -E cmake_depends "Unix Makefiles" /local/robotpkg/var/tmp/robotpkg/wip/prf-gazebo-ros-pkgs/work/gazebo_ros_pkgs-2.6.7 /local/robotpkg/var/tmp/robotpkg/wip/prf-gazebo-ros-pkgs/work/gazebo_ros_pkgs-2.6.7/gazebo_msgs /local/robotpkg/var/tmp/robotpkg/wip/prf-gazebo-ros-pkgs/work/gazebo_ros_pkgs-2.6.7/build /local/robotpkg/var/tmp/robotpkg/wip/prf-gazebo-ros-pkgs/work/gazebo_ros_pkgs-2.6.7/build/gazebo_msgs /local/robotpkg/var/tmp/robotpkg/wip/prf-gazebo-ros-pkgs/work/gazebo_ros_pkgs-2.6.7/build/gazebo_msgs/CMakeFiles/geometry_msgs_generate_messages_lisp.dir/DependInfo.cmake --color= /usr/bin/cmake -E cmake_progress_report /local/robotpkg/var/tmp/robotpkg/wip/prf-gazebo-ros-pkgs/work/gazebo_ros_pkgs-2.6.7/build/CMakeFiles Scanning dependencies of target std_msgs_generate_messages_lisp [ 0%] make[2]: Leaving directory `/local/robotpkg/var/tmp/robotpkg/wip/prf-gazebo-ros-pkgs/work/gazebo_ros_pkgs-2.6.7/build' Scanning dependencies of target geometry_msgs_generate_messages_lisp make[2]: Leaving directory `/local/robotpkg/var/tmp/robotpkg/wip/prf-gazebo-ros-pkgs/work/gazebo_ros_pkgs-2.6.7/build' [ 0%] make -f gazebo_msgs/CMakeFiles/std_msgs_generate_messages_lisp.dir/build.make gazebo_msgs/CMakeFiles/std_msgs_generate_messages_lisp.dir/build Built target _gazebo_msgs_generate_messages_check_deps_GetPhysicsProperties make[2]: Entering directory `/local/robotpkg/var/tmp/robotpkg/wip/prf-gazebo-ros-pkgs/work/gazebo_ros_pkgs-2.6.7/build' make[2]: Nothing to be done for `gazebo_msgs/CMakeFiles/std_msgs_generate_messages_lisp.dir/build'. make[2]: Leaving directory `/local/robotpkg/var/tmp/robotpkg/wip/prf-gazebo-ros-pkgs/work/gazebo_ros_pkgs-2.6.7/build' make -f gazebo_msgs/CMakeFiles/geometry_msgs_generate_messages_lisp.dir/build.make gazebo_msgs/CMakeFiles/geometry_msgs_generate_messages_lisp.dir/build make[2]: Entering directory `/local/robotpkg/var/tmp/robotpkg/wip/prf-gazebo-ros-pkgs/work/gazebo_ros_pkgs-2.6.7/build' make[2]: Nothing to be done for `gazebo_msgs/CMakeFiles/geometry_msgs_generate_messages_lisp.dir/build'. /usr/bin/cmake -E cmake_progress_report /local/robotpkg/var/tmp/robotpkg/wip/prf-gazebo-ros-pkgs/work/gazebo_ros_pkgs-2.6.7/build/CMakeFiles make[2]: Leaving directory `/local/robotpkg/var/tmp/robotpkg/wip/prf-gazebo-ros-pkgs/work/gazebo_ros_pkgs-2.6.7/build' /usr/bin/cmake -E cmake_progress_report /local/robotpkg/var/tmp/robotpkg/wip/prf-gazebo-ros-pkgs/work/gazebo_ros_pkgs-2.6.7/build/CMakeFiles make -f gazebo_msgs/CMakeFiles/std_msgs_generate_messages_cpp.dir/build.make gazebo_msgs/CMakeFiles/std_msgs_generate_messages_cpp.dir/depend Built target sensor_msgs_generate_messages_lisp make -f gazebo_msgs/CMakeFiles/sensor_msgs_generate_messages_cpp.dir/build.make gazebo_msgs/CMakeFiles/sensor_msgs_generate_messages_cpp.dir/depend make[2]: Entering directory `/local/robotpkg/var/tmp/robotpkg/wip/prf-gazebo-ros-pkgs/work/gazebo_ros_pkgs-2.6.7/build' cd /local/robotpkg/var/tmp/robotpkg/wip/prf-gazebo-ros-pkgs/work/gazebo_ros_pkgs-2.6.7/build && /usr/bin/cmake -E cmake_depends "Unix Makefiles" /local/robotpkg/var/tmp/robotpkg/wip/prf-gazebo-ros-pkgs/work/gazebo_ros_pkgs-2.6.7 /local/robotpkg/var/tmp/robotpkg/wip/prf-gazebo-ros-pkgs/work/gazebo_ros_pkgs-2.6.7/gazebo_msgs /local/robotpkg/var/tmp/robotpkg/wip/prf-gazebo-ros-pkgs/work/gazebo_ros_pkgs-2.6.7/build /local/robotpkg/var/tmp/robotpkg/wip/prf-gazebo-ros-pkgs/work/gazebo_ros_pkgs-2.6.7/build/gazebo_msgs /local/robotpkg/var/tmp/robotpkg/wip/prf-gazebo-ros-pkgs/work/gazebo_ros_pkgs-2.6.7/build/gazebo_msgs/CMakeFiles/std_msgs_generate_messages_cpp.dir/DependInfo.cmake --color= make[2]: Entering directory `/local/robotpkg/var/tmp/robotpkg/wip/prf-gazebo-ros-pkgs/work/gazebo_ros_pkgs-2.6.7/build' cd /local/robotpkg/var/tmp/robotpkg/wip/prf-gazebo-ros-pkgs/work/gazebo_ros_pkgs-2.6.7/build && /usr/bin/cmake -E cmake_depends "Unix Makefiles" /local/robotpkg/var/tmp/robotpkg/wip/prf-gazebo-ros-pkgs/work/gazebo_ros_pkgs-2.6.7 /local/robotpkg/var/tmp/robotpkg/wip/prf-gazebo-ros-pkgs/work/gazebo_ros_pkgs-2.6.7/gazebo_msgs /local/robotpkg/var/tmp/robotpkg/wip/prf-gazebo-ros-pkgs/work/gazebo_ros_pkgs-2.6.7/build /local/robotpkg/var/tmp/robotpkg/wip/prf-gazebo-ros-pkgs/work/gazebo_ros_pkgs-2.6.7/build/gazebo_msgs /local/robotpkg/var/tmp/robotpkg/wip/prf-gazebo-ros-pkgs/work/gazebo_ros_pkgs-2.6.7/build/gazebo_msgs/CMakeFiles/sensor_msgs_generate_messages_cpp.dir/DependInfo.cmake --color= [ 0%] [ 0%] Built target std_msgs_generate_messages_lisp make -f gazebo_msgs/CMakeFiles/geometry_msgs_generate_messages_cpp.dir/build.make gazebo_msgs/CMakeFiles/geometry_msgs_generate_messages_cpp.dir/depend Built target geometry_msgs_generate_messages_lisp make -f gazebo_msgs/CMakeFiles/trajectory_msgs_generate_messages_cpp.dir/build.make gazebo_msgs/CMakeFiles/trajectory_msgs_generate_messages_cpp.dir/depend Scanning dependencies of target std_msgs_generate_messages_cpp make[2]: Entering directory `/local/robotpkg/var/tmp/robotpkg/wip/prf-gazebo-ros-pkgs/work/gazebo_ros_pkgs-2.6.7/build' cd /local/robotpkg/var/tmp/robotpkg/wip/prf-gazebo-ros-pkgs/work/gazebo_ros_pkgs-2.6.7/build && /usr/bin/cmake -E cmake_depends "Unix Makefiles" /local/robotpkg/var/tmp/robotpkg/wip/prf-gazebo-ros-pkgs/work/gazebo_ros_pkgs-2.6.7 /local/robotpkg/var/tmp/robotpkg/wip/prf-gazebo-ros-pkgs/work/gazebo_ros_pkgs-2.6.7/gazebo_msgs /local/robotpkg/var/tmp/robotpkg/wip/prf-gazebo-ros-pkgs/work/gazebo_ros_pkgs-2.6.7/build /local/robotpkg/var/tmp/robotpkg/wip/prf-gazebo-ros-pkgs/work/gazebo_ros_pkgs-2.6.7/build/gazebo_msgs /local/robotpkg/var/tmp/robotpkg/wip/prf-gazebo-ros-pkgs/work/gazebo_ros_pkgs-2.6.7/build/gazebo_msgs/CMakeFiles/geometry_msgs_generate_messages_cpp.dir/DependInfo.cmake --color= make[2]: Leaving directory `/local/robotpkg/var/tmp/robotpkg/wip/prf-gazebo-ros-pkgs/work/gazebo_ros_pkgs-2.6.7/build' make[2]: Entering directory `/local/robotpkg/var/tmp/robotpkg/wip/prf-gazebo-ros-pkgs/work/gazebo_ros_pkgs-2.6.7/build' cd /local/robotpkg/var/tmp/robotpkg/wip/prf-gazebo-ros-pkgs/work/gazebo_ros_pkgs-2.6.7/build && /usr/bin/cmake -E cmake_depends "Unix Makefiles" /local/robotpkg/var/tmp/robotpkg/wip/prf-gazebo-ros-pkgs/work/gazebo_ros_pkgs-2.6.7 /local/robotpkg/var/tmp/robotpkg/wip/prf-gazebo-ros-pkgs/work/gazebo_ros_pkgs-2.6.7/gazebo_msgs /local/robotpkg/var/tmp/robotpkg/wip/prf-gazebo-ros-pkgs/work/gazebo_ros_pkgs-2.6.7/build /local/robotpkg/var/tmp/robotpkg/wip/prf-gazebo-ros-pkgs/work/gazebo_ros_pkgs-2.6.7/build/gazebo_msgs /local/robotpkg/var/tmp/robotpkg/wip/prf-gazebo-ros-pkgs/work/gazebo_ros_pkgs-2.6.7/build/gazebo_msgs/CMakeFiles/trajectory_msgs_generate_messages_cpp.dir/DependInfo.cmake --color= make -f gazebo_msgs/CMakeFiles/std_msgs_generate_messages_cpp.dir/build.make gazebo_msgs/CMakeFiles/std_msgs_generate_messages_cpp.dir/build make[2]: Entering directory `/local/robotpkg/var/tmp/robotpkg/wip/prf-gazebo-ros-pkgs/work/gazebo_ros_pkgs-2.6.7/build' make[2]: Nothing to be done for `gazebo_msgs/CMakeFiles/std_msgs_generate_messages_cpp.dir/build'. make[2]: Leaving directory `/local/robotpkg/var/tmp/robotpkg/wip/prf-gazebo-ros-pkgs/work/gazebo_ros_pkgs-2.6.7/build' /usr/bin/cmake -E cmake_progress_report /local/robotpkg/var/tmp/robotpkg/wip/prf-gazebo-ros-pkgs/work/gazebo_ros_pkgs-2.6.7/build/CMakeFiles Scanning dependencies of target sensor_msgs_generate_messages_cpp Scanning dependencies of target geometry_msgs_generate_messages_cpp make[2]: Leaving directory `/local/robotpkg/var/tmp/robotpkg/wip/prf-gazebo-ros-pkgs/work/gazebo_ros_pkgs-2.6.7/build' Scanning dependencies of target trajectory_msgs_generate_messages_cpp make[2]: Leaving directory `/local/robotpkg/var/tmp/robotpkg/wip/prf-gazebo-ros-pkgs/work/gazebo_ros_pkgs-2.6.7/build' make[2]: Leaving directory `/local/robotpkg/var/tmp/robotpkg/wip/prf-gazebo-ros-pkgs/work/gazebo_ros_pkgs-2.6.7/build' [ 0%] make -f gazebo_msgs/CMakeFiles/sensor_msgs_generate_messages_cpp.dir/build.make gazebo_msgs/CMakeFiles/sensor_msgs_generate_messages_cpp.dir/build make -f gazebo_msgs/CMakeFiles/geometry_msgs_generate_messages_cpp.dir/build.make gazebo_msgs/CMakeFiles/geometry_msgs_generate_messages_cpp.dir/build make[2]: Entering directory `/local/robotpkg/var/tmp/robotpkg/wip/prf-gazebo-ros-pkgs/work/gazebo_ros_pkgs-2.6.7/build' make[2]: Nothing to be done for `gazebo_msgs/CMakeFiles/sensor_msgs_generate_messages_cpp.dir/build'. make[2]: Leaving directory `/local/robotpkg/var/tmp/robotpkg/wip/prf-gazebo-ros-pkgs/work/gazebo_ros_pkgs-2.6.7/build' make -f gazebo_msgs/CMakeFiles/trajectory_msgs_generate_messages_cpp.dir/build.make gazebo_msgs/CMakeFiles/trajectory_msgs_generate_messages_cpp.dir/build make[2]: Entering directory `/local/robotpkg/var/tmp/robotpkg/wip/prf-gazebo-ros-pkgs/work/gazebo_ros_pkgs-2.6.7/build' make[2]: Nothing to be done for `gazebo_msgs/CMakeFiles/geometry_msgs_generate_messages_cpp.dir/build'. make[2]: Leaving directory `/local/robotpkg/var/tmp/robotpkg/wip/prf-gazebo-ros-pkgs/work/gazebo_ros_pkgs-2.6.7/build' make[2]: Entering directory `/local/robotpkg/var/tmp/robotpkg/wip/prf-gazebo-ros-pkgs/work/gazebo_ros_pkgs-2.6.7/build' make[2]: Nothing to be done for `gazebo_msgs/CMakeFiles/trajectory_msgs_generate_messages_cpp.dir/build'. make[2]: Leaving directory `/local/robotpkg/var/tmp/robotpkg/wip/prf-gazebo-ros-pkgs/work/gazebo_ros_pkgs-2.6.7/build' /usr/bin/cmake -E cmake_progress_report /local/robotpkg/var/tmp/robotpkg/wip/prf-gazebo-ros-pkgs/work/gazebo_ros_pkgs-2.6.7/build/CMakeFiles Built target std_msgs_generate_messages_cpp /usr/bin/cmake -E cmake_progress_report /local/robotpkg/var/tmp/robotpkg/wip/prf-gazebo-ros-pkgs/work/gazebo_ros_pkgs-2.6.7/build/CMakeFiles /usr/bin/cmake -E cmake_progress_report /local/robotpkg/var/tmp/robotpkg/wip/prf-gazebo-ros-pkgs/work/gazebo_ros_pkgs-2.6.7/build/CMakeFiles make -f gazebo_ros/CMakeFiles/gazebo_ros_gencfg.dir/build.make gazebo_ros/CMakeFiles/gazebo_ros_gencfg.dir/depend make[2]: Entering directory `/local/robotpkg/var/tmp/robotpkg/wip/prf-gazebo-ros-pkgs/work/gazebo_ros_pkgs-2.6.7/build' cd /local/robotpkg/var/tmp/robotpkg/wip/prf-gazebo-ros-pkgs/work/gazebo_ros_pkgs-2.6.7/build && /usr/bin/cmake -E cmake_depends "Unix Makefiles" /local/robotpkg/var/tmp/robotpkg/wip/prf-gazebo-ros-pkgs/work/gazebo_ros_pkgs-2.6.7 /local/robotpkg/var/tmp/robotpkg/wip/prf-gazebo-ros-pkgs/work/gazebo_ros_pkgs-2.6.7/gazebo_ros /local/robotpkg/var/tmp/robotpkg/wip/prf-gazebo-ros-pkgs/work/gazebo_ros_pkgs-2.6.7/build /local/robotpkg/var/tmp/robotpkg/wip/prf-gazebo-ros-pkgs/work/gazebo_ros_pkgs-2.6.7/build/gazebo_ros /local/robotpkg/var/tmp/robotpkg/wip/prf-gazebo-ros-pkgs/work/gazebo_ros_pkgs-2.6.7/build/gazebo_ros/CMakeFiles/gazebo_ros_gencfg.dir/DependInfo.cmake --color= [ 0%] [ 0%] Built target geometry_msgs_generate_messages_cpp make -f gazebo_ros/CMakeFiles/roscpp_generate_messages_cpp.dir/build.make gazebo_ros/CMakeFiles/roscpp_generate_messages_cpp.dir/depend make[2]: Entering directory `/local/robotpkg/var/tmp/robotpkg/wip/prf-gazebo-ros-pkgs/work/gazebo_ros_pkgs-2.6.7/build' cd /local/robotpkg/var/tmp/robotpkg/wip/prf-gazebo-ros-pkgs/work/gazebo_ros_pkgs-2.6.7/build && /usr/bin/cmake -E cmake_depends "Unix Makefiles" /local/robotpkg/var/tmp/robotpkg/wip/prf-gazebo-ros-pkgs/work/gazebo_ros_pkgs-2.6.7 /local/robotpkg/var/tmp/robotpkg/wip/prf-gazebo-ros-pkgs/work/gazebo_ros_pkgs-2.6.7/gazebo_ros /local/robotpkg/var/tmp/robotpkg/wip/prf-gazebo-ros-pkgs/work/gazebo_ros_pkgs-2.6.7/build /local/robotpkg/var/tmp/robotpkg/wip/prf-gazebo-ros-pkgs/work/gazebo_ros_pkgs-2.6.7/build/gazebo_ros /local/robotpkg/var/tmp/robotpkg/wip/prf-gazebo-ros-pkgs/work/gazebo_ros_pkgs-2.6.7/build/gazebo_ros/CMakeFiles/roscpp_generate_messages_cpp.dir/DependInfo.cmake --color= Built target sensor_msgs_generate_messages_cpp make -f gazebo_ros/CMakeFiles/roscpp_generate_messages_py.dir/build.make gazebo_ros/CMakeFiles/roscpp_generate_messages_py.dir/depend [ 0%] make[2]: Entering directory `/local/robotpkg/var/tmp/robotpkg/wip/prf-gazebo-ros-pkgs/work/gazebo_ros_pkgs-2.6.7/build' cd /local/robotpkg/var/tmp/robotpkg/wip/prf-gazebo-ros-pkgs/work/gazebo_ros_pkgs-2.6.7/build && /usr/bin/cmake -E cmake_depends "Unix Makefiles" /local/robotpkg/var/tmp/robotpkg/wip/prf-gazebo-ros-pkgs/work/gazebo_ros_pkgs-2.6.7 /local/robotpkg/var/tmp/robotpkg/wip/prf-gazebo-ros-pkgs/work/gazebo_ros_pkgs-2.6.7/gazebo_ros /local/robotpkg/var/tmp/robotpkg/wip/prf-gazebo-ros-pkgs/work/gazebo_ros_pkgs-2.6.7/build /local/robotpkg/var/tmp/robotpkg/wip/prf-gazebo-ros-pkgs/work/gazebo_ros_pkgs-2.6.7/build/gazebo_ros /local/robotpkg/var/tmp/robotpkg/wip/prf-gazebo-ros-pkgs/work/gazebo_ros_pkgs-2.6.7/build/gazebo_ros/CMakeFiles/roscpp_generate_messages_py.dir/DependInfo.cmake --color= Scanning dependencies of target gazebo_ros_gencfg make[2]: Leaving directory `/local/robotpkg/var/tmp/robotpkg/wip/prf-gazebo-ros-pkgs/work/gazebo_ros_pkgs-2.6.7/build' make -f gazebo_ros/CMakeFiles/gazebo_ros_gencfg.dir/build.make gazebo_ros/CMakeFiles/gazebo_ros_gencfg.dir/build Built target trajectory_msgs_generate_messages_cpp make -f gazebo_msgs/CMakeFiles/std_srvs_generate_messages_lisp.dir/build.make gazebo_msgs/CMakeFiles/std_srvs_generate_messages_lisp.dir/depend make[2]: Entering directory `/local/robotpkg/var/tmp/robotpkg/wip/prf-gazebo-ros-pkgs/work/gazebo_ros_pkgs-2.6.7/build' cd /local/robotpkg/var/tmp/robotpkg/wip/prf-gazebo-ros-pkgs/work/gazebo_ros_pkgs-2.6.7/build && /usr/bin/cmake -E cmake_depends "Unix Makefiles" /local/robotpkg/var/tmp/robotpkg/wip/prf-gazebo-ros-pkgs/work/gazebo_ros_pkgs-2.6.7 /local/robotpkg/var/tmp/robotpkg/wip/prf-gazebo-ros-pkgs/work/gazebo_ros_pkgs-2.6.7/gazebo_msgs /local/robotpkg/var/tmp/robotpkg/wip/prf-gazebo-ros-pkgs/work/gazebo_ros_pkgs-2.6.7/build /local/robotpkg/var/tmp/robotpkg/wip/prf-gazebo-ros-pkgs/work/gazebo_ros_pkgs-2.6.7/build/gazebo_msgs /local/robotpkg/var/tmp/robotpkg/wip/prf-gazebo-ros-pkgs/work/gazebo_ros_pkgs-2.6.7/build/gazebo_msgs/CMakeFiles/std_srvs_generate_messages_lisp.dir/DependInfo.cmake --color= Scanning dependencies of target roscpp_generate_messages_cpp make[2]: Leaving directory `/local/robotpkg/var/tmp/robotpkg/wip/prf-gazebo-ros-pkgs/work/gazebo_ros_pkgs-2.6.7/build' make -f gazebo_ros/CMakeFiles/roscpp_generate_messages_cpp.dir/build.make gazebo_ros/CMakeFiles/roscpp_generate_messages_cpp.dir/build make[2]: Entering directory `/local/robotpkg/var/tmp/robotpkg/wip/prf-gazebo-ros-pkgs/work/gazebo_ros_pkgs-2.6.7/build' make[2]: Nothing to be done for `gazebo_ros/CMakeFiles/roscpp_generate_messages_cpp.dir/build'. make[2]: Leaving directory `/local/robotpkg/var/tmp/robotpkg/wip/prf-gazebo-ros-pkgs/work/gazebo_ros_pkgs-2.6.7/build' /usr/bin/cmake -E cmake_progress_report /local/robotpkg/var/tmp/robotpkg/wip/prf-gazebo-ros-pkgs/work/gazebo_ros_pkgs-2.6.7/build/CMakeFiles Scanning dependencies of target roscpp_generate_messages_py Scanning dependencies of target std_srvs_generate_messages_lisp [ 0%] make[2]: Leaving directory `/local/robotpkg/var/tmp/robotpkg/wip/prf-gazebo-ros-pkgs/work/gazebo_ros_pkgs-2.6.7/build' make[2]: Leaving directory `/local/robotpkg/var/tmp/robotpkg/wip/prf-gazebo-ros-pkgs/work/gazebo_ros_pkgs-2.6.7/build' make[2]: Entering directory `/local/robotpkg/var/tmp/robotpkg/wip/prf-gazebo-ros-pkgs/work/gazebo_ros_pkgs-2.6.7/build' /usr/bin/cmake -E cmake_progress_report /local/robotpkg/var/tmp/robotpkg/wip/prf-gazebo-ros-pkgs/work/gazebo_ros_pkgs-2.6.7/build/CMakeFiles 81 Built target roscpp_generate_messages_cpp make -f gazebo_ros/CMakeFiles/roscpp_generate_messages_py.dir/build.make gazebo_ros/CMakeFiles/roscpp_generate_messages_py.dir/build make[2]: Entering directory `/local/robotpkg/var/tmp/robotpkg/wip/prf-gazebo-ros-pkgs/work/gazebo_ros_pkgs-2.6.7/build' make[2]: Nothing to be done for `gazebo_ros/CMakeFiles/roscpp_generate_messages_py.dir/build'. make[2]: Leaving directory `/local/robotpkg/var/tmp/robotpkg/wip/prf-gazebo-ros-pkgs/work/gazebo_ros_pkgs-2.6.7/build' make -f gazebo_msgs/CMakeFiles/std_srvs_generate_messages_lisp.dir/build.make gazebo_msgs/CMakeFiles/std_srvs_generate_messages_lisp.dir/build [ 1%] make[2]: Entering directory `/local/robotpkg/var/tmp/robotpkg/wip/prf-gazebo-ros-pkgs/work/gazebo_ros_pkgs-2.6.7/build' make[2]: Nothing to be done for `gazebo_msgs/CMakeFiles/std_srvs_generate_messages_lisp.dir/build'. make[2]: Leaving directory `/local/robotpkg/var/tmp/robotpkg/wip/prf-gazebo-ros-pkgs/work/gazebo_ros_pkgs-2.6.7/build' /usr/bin/cmake -E cmake_progress_report /local/robotpkg/var/tmp/robotpkg/wip/prf-gazebo-ros-pkgs/work/gazebo_ros_pkgs-2.6.7/build/CMakeFiles [ 1%] /usr/bin/cmake -E cmake_progress_report /local/robotpkg/var/tmp/robotpkg/wip/prf-gazebo-ros-pkgs/work/gazebo_ros_pkgs-2.6.7/build/CMakeFiles Generating dynamic reconfigure files from cfg/Physics.cfg: /local/robotpkg/var/tmp/robotpkg/wip/prf-gazebo-ros-pkgs/work/stage/include/gazebo_ros/PhysicsConfig.h /local/robotpkg/var/tmp/robotpkg/wip/prf-gazebo-ros-pkgs/work/stage/lib/python2.7/site-packages/gazebo_ros/cfg/PhysicsConfig.py cd /local/robotpkg/var/tmp/robotpkg/wip/prf-gazebo-ros-pkgs/work/gazebo_ros_pkgs-2.6.7/build/gazebo_ros && ../catkin_generated/env_cached.sh /local/robotpkg/var/tmp/robotpkg/wip/prf-gazebo-ros-pkgs/work/gazebo_ros_pkgs-2.6.7/build/gazebo_ros/setup_custom_pythonpath.sh /local/robotpkg/var/tmp/robotpkg/wip/prf-gazebo-ros-pkgs/work/gazebo_ros_pkgs-2.6.7/gazebo_ros/cfg/Physics.cfg /opt/ros/indigo/share/dynamic_reconfigure/cmake/.. /local/robotpkg/var/tmp/robotpkg/wip/prf-gazebo-ros-pkgs/work/stage/share/gazebo_ros /local/robotpkg/var/tmp/robotpkg/wip/prf-gazebo-ros-pkgs/work/stage/include/gazebo_ros /local/robotpkg/var/tmp/robotpkg/wip/prf-gazebo-ros-pkgs/work/stage/lib/python2.7/site-packages/gazebo_ros make -f gazebo_msgs/CMakeFiles/std_srvs_generate_messages_py.dir/build.make gazebo_msgs/CMakeFiles/std_srvs_generate_messages_py.dir/depend [ 1%] Built target roscpp_generate_messages_py make[2]: Entering directory `/local/robotpkg/var/tmp/robotpkg/wip/prf-gazebo-ros-pkgs/work/gazebo_ros_pkgs-2.6.7/build' cd /local/robotpkg/var/tmp/robotpkg/wip/prf-gazebo-ros-pkgs/work/gazebo_ros_pkgs-2.6.7/build && /usr/bin/cmake -E cmake_depends "Unix Makefiles" /local/robotpkg/var/tmp/robotpkg/wip/prf-gazebo-ros-pkgs/work/gazebo_ros_pkgs-2.6.7 /local/robotpkg/var/tmp/robotpkg/wip/prf-gazebo-ros-pkgs/work/gazebo_ros_pkgs-2.6.7/gazebo_msgs /local/robotpkg/var/tmp/robotpkg/wip/prf-gazebo-ros-pkgs/work/gazebo_ros_pkgs-2.6.7/build /local/robotpkg/var/tmp/robotpkg/wip/prf-gazebo-ros-pkgs/work/gazebo_ros_pkgs-2.6.7/build/gazebo_msgs /local/robotpkg/var/tmp/robotpkg/wip/prf-gazebo-ros-pkgs/work/gazebo_ros_pkgs-2.6.7/build/gazebo_msgs/CMakeFiles/std_srvs_generate_messages_py.dir/DependInfo.cmake --color= Built target std_srvs_generate_messages_lisp make -f gazebo_msgs/CMakeFiles/std_srvs_generate_messages_cpp.dir/build.make gazebo_msgs/CMakeFiles/std_srvs_generate_messages_cpp.dir/depend make -f gazebo_ros/CMakeFiles/roscpp_generate_messages_lisp.dir/build.make gazebo_ros/CMakeFiles/roscpp_generate_messages_lisp.dir/depend make[2]: Entering directory `/local/robotpkg/var/tmp/robotpkg/wip/prf-gazebo-ros-pkgs/work/gazebo_ros_pkgs-2.6.7/build' cd /local/robotpkg/var/tmp/robotpkg/wip/prf-gazebo-ros-pkgs/work/gazebo_ros_pkgs-2.6.7/build && /usr/bin/cmake -E cmake_depends "Unix Makefiles" /local/robotpkg/var/tmp/robotpkg/wip/prf-gazebo-ros-pkgs/work/gazebo_ros_pkgs-2.6.7 /local/robotpkg/var/tmp/robotpkg/wip/prf-gazebo-ros-pkgs/work/gazebo_ros_pkgs-2.6.7/gazebo_msgs /local/robotpkg/var/tmp/robotpkg/wip/prf-gazebo-ros-pkgs/work/gazebo_ros_pkgs-2.6.7/build /local/robotpkg/var/tmp/robotpkg/wip/prf-gazebo-ros-pkgs/work/gazebo_ros_pkgs-2.6.7/build/gazebo_msgs /local/robotpkg/var/tmp/robotpkg/wip/prf-gazebo-ros-pkgs/work/gazebo_ros_pkgs-2.6.7/build/gazebo_msgs/CMakeFiles/std_srvs_generate_messages_cpp.dir/DependInfo.cmake --color= make[2]: Entering directory `/local/robotpkg/var/tmp/robotpkg/wip/prf-gazebo-ros-pkgs/work/gazebo_ros_pkgs-2.6.7/build' cd /local/robotpkg/var/tmp/robotpkg/wip/prf-gazebo-ros-pkgs/work/gazebo_ros_pkgs-2.6.7/build && /usr/bin/cmake -E cmake_depends "Unix Makefiles" /local/robotpkg/var/tmp/robotpkg/wip/prf-gazebo-ros-pkgs/work/gazebo_ros_pkgs-2.6.7 /local/robotpkg/var/tmp/robotpkg/wip/prf-gazebo-ros-pkgs/work/gazebo_ros_pkgs-2.6.7/gazebo_ros /local/robotpkg/var/tmp/robotpkg/wip/prf-gazebo-ros-pkgs/work/gazebo_ros_pkgs-2.6.7/build /local/robotpkg/var/tmp/robotpkg/wip/prf-gazebo-ros-pkgs/work/gazebo_ros_pkgs-2.6.7/build/gazebo_ros /local/robotpkg/var/tmp/robotpkg/wip/prf-gazebo-ros-pkgs/work/gazebo_ros_pkgs-2.6.7/build/gazebo_ros/CMakeFiles/roscpp_generate_messages_lisp.dir/DependInfo.cmake --color= Scanning dependencies of target roscpp_generate_messages_lisp make[2]: Leaving directory `/local/robotpkg/var/tmp/robotpkg/wip/prf-gazebo-ros-pkgs/work/gazebo_ros_pkgs-2.6.7/build' make -f gazebo_ros/CMakeFiles/roscpp_generate_messages_lisp.dir/build.make gazebo_ros/CMakeFiles/roscpp_generate_messages_lisp.dir/build make[2]: Entering directory `/local/robotpkg/var/tmp/robotpkg/wip/prf-gazebo-ros-pkgs/work/gazebo_ros_pkgs-2.6.7/build' make[2]: Nothing to be done for `gazebo_ros/CMakeFiles/roscpp_generate_messages_lisp.dir/build'. make[2]: Leaving directory `/local/robotpkg/var/tmp/robotpkg/wip/prf-gazebo-ros-pkgs/work/gazebo_ros_pkgs-2.6.7/build' /usr/bin/cmake -E cmake_progress_report /local/robotpkg/var/tmp/robotpkg/wip/prf-gazebo-ros-pkgs/work/gazebo_ros_pkgs-2.6.7/build/CMakeFiles Scanning dependencies of target std_srvs_generate_messages_cpp [ 1%] Built target roscpp_generate_messages_lisp make -f gazebo_ros/CMakeFiles/tf_generate_messages_lisp.dir/build.make gazebo_ros/CMakeFiles/tf_generate_messages_lisp.dir/depend make[2]: Leaving directory `/local/robotpkg/var/tmp/robotpkg/wip/prf-gazebo-ros-pkgs/work/gazebo_ros_pkgs-2.6.7/build' make -f gazebo_msgs/CMakeFiles/std_srvs_generate_messages_cpp.dir/build.make gazebo_msgs/CMakeFiles/std_srvs_generate_messages_cpp.dir/build Scanning dependencies of target std_srvs_generate_messages_py make[2]: Entering directory `/local/robotpkg/var/tmp/robotpkg/wip/prf-gazebo-ros-pkgs/work/gazebo_ros_pkgs-2.6.7/build' cd /local/robotpkg/var/tmp/robotpkg/wip/prf-gazebo-ros-pkgs/work/gazebo_ros_pkgs-2.6.7/build && /usr/bin/cmake -E cmake_depends "Unix Makefiles" /local/robotpkg/var/tmp/robotpkg/wip/prf-gazebo-ros-pkgs/work/gazebo_ros_pkgs-2.6.7 /local/robotpkg/var/tmp/robotpkg/wip/prf-gazebo-ros-pkgs/work/gazebo_ros_pkgs-2.6.7/gazebo_ros /local/robotpkg/var/tmp/robotpkg/wip/prf-gazebo-ros-pkgs/work/gazebo_ros_pkgs-2.6.7/build /local/robotpkg/var/tmp/robotpkg/wip/prf-gazebo-ros-pkgs/work/gazebo_ros_pkgs-2.6.7/build/gazebo_ros /local/robotpkg/var/tmp/robotpkg/wip/prf-gazebo-ros-pkgs/work/gazebo_ros_pkgs-2.6.7/build/gazebo_ros/CMakeFiles/tf_generate_messages_lisp.dir/DependInfo.cmake --color= make[2]: Leaving directory `/local/robotpkg/var/tmp/robotpkg/wip/prf-gazebo-ros-pkgs/work/gazebo_ros_pkgs-2.6.7/build' make -f gazebo_msgs/CMakeFiles/std_srvs_generate_messages_py.dir/build.make gazebo_msgs/CMakeFiles/std_srvs_generate_messages_py.dir/build make[2]: Entering directory `/local/robotpkg/var/tmp/robotpkg/wip/prf-gazebo-ros-pkgs/work/gazebo_ros_pkgs-2.6.7/build' make[2]: Nothing to be done for `gazebo_msgs/CMakeFiles/std_srvs_generate_messages_cpp.dir/build'. make[2]: Leaving directory `/local/robotpkg/var/tmp/robotpkg/wip/prf-gazebo-ros-pkgs/work/gazebo_ros_pkgs-2.6.7/build' make[2]: Entering directory `/local/robotpkg/var/tmp/robotpkg/wip/prf-gazebo-ros-pkgs/work/gazebo_ros_pkgs-2.6.7/build' make[2]: Nothing to be done for `gazebo_msgs/CMakeFiles/std_srvs_generate_messages_py.dir/build'. make[2]: Leaving directory `/local/robotpkg/var/tmp/robotpkg/wip/prf-gazebo-ros-pkgs/work/gazebo_ros_pkgs-2.6.7/build' /usr/bin/cmake -E cmake_progress_report /local/robotpkg/var/tmp/robotpkg/wip/prf-gazebo-ros-pkgs/work/gazebo_ros_pkgs-2.6.7/build/CMakeFiles [ 1%] /usr/bin/cmake -E cmake_progress_report /local/robotpkg/var/tmp/robotpkg/wip/prf-gazebo-ros-pkgs/work/gazebo_ros_pkgs-2.6.7/build/CMakeFiles Built target std_srvs_generate_messages_cpp make -f gazebo_ros/CMakeFiles/tf_generate_messages_cpp.dir/build.make gazebo_ros/CMakeFiles/tf_generate_messages_cpp.dir/depend Scanning dependencies of target tf_generate_messages_lisp [ 1%] make[2]: Entering directory `/local/robotpkg/var/tmp/robotpkg/wip/prf-gazebo-ros-pkgs/work/gazebo_ros_pkgs-2.6.7/build' Built target std_srvs_generate_messages_py make -f gazebo_ros/CMakeFiles/tf_generate_messages_py.dir/build.make gazebo_ros/CMakeFiles/tf_generate_messages_py.dir/depend cd /local/robotpkg/var/tmp/robotpkg/wip/prf-gazebo-ros-pkgs/work/gazebo_ros_pkgs-2.6.7/build && /usr/bin/cmake -E cmake_depends "Unix Makefiles" /local/robotpkg/var/tmp/robotpkg/wip/prf-gazebo-ros-pkgs/work/gazebo_ros_pkgs-2.6.7 /local/robotpkg/var/tmp/robotpkg/wip/prf-gazebo-ros-pkgs/work/gazebo_ros_pkgs-2.6.7/gazebo_ros /local/robotpkg/var/tmp/robotpkg/wip/prf-gazebo-ros-pkgs/work/gazebo_ros_pkgs-2.6.7/build /local/robotpkg/var/tmp/robotpkg/wip/prf-gazebo-ros-pkgs/work/gazebo_ros_pkgs-2.6.7/build/gazebo_ros /local/robotpkg/var/tmp/robotpkg/wip/prf-gazebo-ros-pkgs/work/gazebo_ros_pkgs-2.6.7/build/gazebo_ros/CMakeFiles/tf_generate_messages_cpp.dir/DependInfo.cmake --color= make[2]: Leaving directory `/local/robotpkg/var/tmp/robotpkg/wip/prf-gazebo-ros-pkgs/work/gazebo_ros_pkgs-2.6.7/build' make[2]: Entering directory `/local/robotpkg/var/tmp/robotpkg/wip/prf-gazebo-ros-pkgs/work/gazebo_ros_pkgs-2.6.7/build' cd /local/robotpkg/var/tmp/robotpkg/wip/prf-gazebo-ros-pkgs/work/gazebo_ros_pkgs-2.6.7/build && /usr/bin/cmake -E cmake_depends "Unix Makefiles" /local/robotpkg/var/tmp/robotpkg/wip/prf-gazebo-ros-pkgs/work/gazebo_ros_pkgs-2.6.7 /local/robotpkg/var/tmp/robotpkg/wip/prf-gazebo-ros-pkgs/work/gazebo_ros_pkgs-2.6.7/gazebo_ros /local/robotpkg/var/tmp/robotpkg/wip/prf-gazebo-ros-pkgs/work/gazebo_ros_pkgs-2.6.7/build /local/robotpkg/var/tmp/robotpkg/wip/prf-gazebo-ros-pkgs/work/gazebo_ros_pkgs-2.6.7/build/gazebo_ros /local/robotpkg/var/tmp/robotpkg/wip/prf-gazebo-ros-pkgs/work/gazebo_ros_pkgs-2.6.7/build/gazebo_ros/CMakeFiles/tf_generate_messages_py.dir/DependInfo.cmake --color= make -f gazebo_ros/CMakeFiles/tf_generate_messages_lisp.dir/build.make gazebo_ros/CMakeFiles/tf_generate_messages_lisp.dir/build make[2]: Entering directory `/local/robotpkg/var/tmp/robotpkg/wip/prf-gazebo-ros-pkgs/work/gazebo_ros_pkgs-2.6.7/build' make[2]: Nothing to be done for `gazebo_ros/CMakeFiles/tf_generate_messages_lisp.dir/build'. make[2]: Leaving directory `/local/robotpkg/var/tmp/robotpkg/wip/prf-gazebo-ros-pkgs/work/gazebo_ros_pkgs-2.6.7/build' /usr/bin/cmake -E cmake_progress_report /local/robotpkg/var/tmp/robotpkg/wip/prf-gazebo-ros-pkgs/work/gazebo_ros_pkgs-2.6.7/build/CMakeFiles Scanning dependencies of target tf_generate_messages_py make[2]: Leaving directory `/local/robotpkg/var/tmp/robotpkg/wip/prf-gazebo-ros-pkgs/work/gazebo_ros_pkgs-2.6.7/build' make -f gazebo_ros/CMakeFiles/tf_generate_messages_py.dir/build.make gazebo_ros/CMakeFiles/tf_generate_messages_py.dir/build make[2]: Entering directory `/local/robotpkg/var/tmp/robotpkg/wip/prf-gazebo-ros-pkgs/work/gazebo_ros_pkgs-2.6.7/build' make[2]: Nothing to be done for `gazebo_ros/CMakeFiles/tf_generate_messages_py.dir/build'. make[2]: Leaving directory `/local/robotpkg/var/tmp/robotpkg/wip/prf-gazebo-ros-pkgs/work/gazebo_ros_pkgs-2.6.7/build' /usr/bin/cmake -E cmake_progress_report /local/robotpkg/var/tmp/robotpkg/wip/prf-gazebo-ros-pkgs/work/gazebo_ros_pkgs-2.6.7/build/CMakeFiles [ 1%] Built target tf_generate_messages_lisp make -f gazebo_ros/CMakeFiles/rosgraph_msgs_generate_messages_py.dir/build.make gazebo_ros/CMakeFiles/rosgraph_msgs_generate_messages_py.dir/depend Scanning dependencies of target tf_generate_messages_cpp make[2]: Entering directory `/local/robotpkg/var/tmp/robotpkg/wip/prf-gazebo-ros-pkgs/work/gazebo_ros_pkgs-2.6.7/build' cd /local/robotpkg/var/tmp/robotpkg/wip/prf-gazebo-ros-pkgs/work/gazebo_ros_pkgs-2.6.7/build && /usr/bin/cmake -E cmake_depends "Unix Makefiles" /local/robotpkg/var/tmp/robotpkg/wip/prf-gazebo-ros-pkgs/work/gazebo_ros_pkgs-2.6.7 /local/robotpkg/var/tmp/robotpkg/wip/prf-gazebo-ros-pkgs/work/gazebo_ros_pkgs-2.6.7/gazebo_ros /local/robotpkg/var/tmp/robotpkg/wip/prf-gazebo-ros-pkgs/work/gazebo_ros_pkgs-2.6.7/build /local/robotpkg/var/tmp/robotpkg/wip/prf-gazebo-ros-pkgs/work/gazebo_ros_pkgs-2.6.7/build/gazebo_ros /local/robotpkg/var/tmp/robotpkg/wip/prf-gazebo-ros-pkgs/work/gazebo_ros_pkgs-2.6.7/build/gazebo_ros/CMakeFiles/rosgraph_msgs_generate_messages_py.dir/DependInfo.cmake --color= make[2]: Leaving directory `/local/robotpkg/var/tmp/robotpkg/wip/prf-gazebo-ros-pkgs/work/gazebo_ros_pkgs-2.6.7/build' [ 1%] make -f gazebo_ros/CMakeFiles/tf_generate_messages_cpp.dir/build.make gazebo_ros/CMakeFiles/tf_generate_messages_cpp.dir/build Scanning dependencies of target rosgraph_msgs_generate_messages_py make[2]: Leaving directory `/local/robotpkg/var/tmp/robotpkg/wip/prf-gazebo-ros-pkgs/work/gazebo_ros_pkgs-2.6.7/build' make -f gazebo_ros/CMakeFiles/rosgraph_msgs_generate_messages_py.dir/build.make gazebo_ros/CMakeFiles/rosgraph_msgs_generate_messages_py.dir/build Built target tf_generate_messages_py make -f gazebo_ros/CMakeFiles/actionlib_generate_messages_py.dir/build.make gazebo_ros/CMakeFiles/actionlib_generate_messages_py.dir/depend make[2]: Entering directory `/local/robotpkg/var/tmp/robotpkg/wip/prf-gazebo-ros-pkgs/work/gazebo_ros_pkgs-2.6.7/build' make[2]: Nothing to be done for `gazebo_ros/CMakeFiles/rosgraph_msgs_generate_messages_py.dir/build'. make[2]: Leaving directory `/local/robotpkg/var/tmp/robotpkg/wip/prf-gazebo-ros-pkgs/work/gazebo_ros_pkgs-2.6.7/build' /usr/bin/cmake -E cmake_progress_report /local/robotpkg/var/tmp/robotpkg/wip/prf-gazebo-ros-pkgs/work/gazebo_ros_pkgs-2.6.7/build/CMakeFiles make[2]: Entering directory `/local/robotpkg/var/tmp/robotpkg/wip/prf-gazebo-ros-pkgs/work/gazebo_ros_pkgs-2.6.7/build' cd /local/robotpkg/var/tmp/robotpkg/wip/prf-gazebo-ros-pkgs/work/gazebo_ros_pkgs-2.6.7/build && /usr/bin/cmake -E cmake_depends "Unix Makefiles" /local/robotpkg/var/tmp/robotpkg/wip/prf-gazebo-ros-pkgs/work/gazebo_ros_pkgs-2.6.7 /local/robotpkg/var/tmp/robotpkg/wip/prf-gazebo-ros-pkgs/work/gazebo_ros_pkgs-2.6.7/gazebo_ros /local/robotpkg/var/tmp/robotpkg/wip/prf-gazebo-ros-pkgs/work/gazebo_ros_pkgs-2.6.7/build /local/robotpkg/var/tmp/robotpkg/wip/prf-gazebo-ros-pkgs/work/gazebo_ros_pkgs-2.6.7/build/gazebo_ros /local/robotpkg/var/tmp/robotpkg/wip/prf-gazebo-ros-pkgs/work/gazebo_ros_pkgs-2.6.7/build/gazebo_ros/CMakeFiles/actionlib_generate_messages_py.dir/DependInfo.cmake --color= make[2]: Entering directory `/local/robotpkg/var/tmp/robotpkg/wip/prf-gazebo-ros-pkgs/work/gazebo_ros_pkgs-2.6.7/build' make[2]: Nothing to be done for `gazebo_ros/CMakeFiles/tf_generate_messages_cpp.dir/build'. make[2]: Leaving directory `/local/robotpkg/var/tmp/robotpkg/wip/prf-gazebo-ros-pkgs/work/gazebo_ros_pkgs-2.6.7/build' /usr/bin/cmake -E cmake_progress_report /local/robotpkg/var/tmp/robotpkg/wip/prf-gazebo-ros-pkgs/work/gazebo_ros_pkgs-2.6.7/build/CMakeFiles [ 1%] Built target rosgraph_msgs_generate_messages_py make -f gazebo_ros/CMakeFiles/rosgraph_msgs_generate_messages_cpp.dir/build.make gazebo_ros/CMakeFiles/rosgraph_msgs_generate_messages_cpp.dir/depend make[2]: Entering directory `/local/robotpkg/var/tmp/robotpkg/wip/prf-gazebo-ros-pkgs/work/gazebo_ros_pkgs-2.6.7/build' cd /local/robotpkg/var/tmp/robotpkg/wip/prf-gazebo-ros-pkgs/work/gazebo_ros_pkgs-2.6.7/build && /usr/bin/cmake -E cmake_depends "Unix Makefiles" /local/robotpkg/var/tmp/robotpkg/wip/prf-gazebo-ros-pkgs/work/gazebo_ros_pkgs-2.6.7 /local/robotpkg/var/tmp/robotpkg/wip/prf-gazebo-ros-pkgs/work/gazebo_ros_pkgs-2.6.7/gazebo_ros /local/robotpkg/var/tmp/robotpkg/wip/prf-gazebo-ros-pkgs/work/gazebo_ros_pkgs-2.6.7/build /local/robotpkg/var/tmp/robotpkg/wip/prf-gazebo-ros-pkgs/work/gazebo_ros_pkgs-2.6.7/build/gazebo_ros /local/robotpkg/var/tmp/robotpkg/wip/prf-gazebo-ros-pkgs/work/gazebo_ros_pkgs-2.6.7/build/gazebo_ros/CMakeFiles/rosgraph_msgs_generate_messages_cpp.dir/DependInfo.cmake --color= [ 1%] Scanning dependencies of target actionlib_generate_messages_py make[2]: Leaving directory `/local/robotpkg/var/tmp/robotpkg/wip/prf-gazebo-ros-pkgs/work/gazebo_ros_pkgs-2.6.7/build' make -f gazebo_ros/CMakeFiles/actionlib_generate_messages_py.dir/build.make gazebo_ros/CMakeFiles/actionlib_generate_messages_py.dir/build Built target tf_generate_messages_cpp make -f gazebo_ros/CMakeFiles/dynamic_reconfigure_generate_messages_lisp.dir/build.make gazebo_ros/CMakeFiles/dynamic_reconfigure_generate_messages_lisp.dir/depend Scanning dependencies of target rosgraph_msgs_generate_messages_cpp make[2]: Leaving directory `/local/robotpkg/var/tmp/robotpkg/wip/prf-gazebo-ros-pkgs/work/gazebo_ros_pkgs-2.6.7/build' make -f gazebo_ros/CMakeFiles/rosgraph_msgs_generate_messages_cpp.dir/build.make gazebo_ros/CMakeFiles/rosgraph_msgs_generate_messages_cpp.dir/build make[2]: Entering directory `/local/robotpkg/var/tmp/robotpkg/wip/prf-gazebo-ros-pkgs/work/gazebo_ros_pkgs-2.6.7/build' make[2]: Nothing to be done for `gazebo_ros/CMakeFiles/actionlib_generate_messages_py.dir/build'. make[2]: Leaving directory `/local/robotpkg/var/tmp/robotpkg/wip/prf-gazebo-ros-pkgs/work/gazebo_ros_pkgs-2.6.7/build' make[2]: Entering directory `/local/robotpkg/var/tmp/robotpkg/wip/prf-gazebo-ros-pkgs/work/gazebo_ros_pkgs-2.6.7/build' make[2]: Nothing to be done for `gazebo_ros/CMakeFiles/rosgraph_msgs_generate_messages_cpp.dir/build'. make[2]: Leaving directory `/local/robotpkg/var/tmp/robotpkg/wip/prf-gazebo-ros-pkgs/work/gazebo_ros_pkgs-2.6.7/build' /usr/bin/cmake -E cmake_progress_report /local/robotpkg/var/tmp/robotpkg/wip/prf-gazebo-ros-pkgs/work/gazebo_ros_pkgs-2.6.7/build/CMakeFiles make[2]: Entering directory `/local/robotpkg/var/tmp/robotpkg/wip/prf-gazebo-ros-pkgs/work/gazebo_ros_pkgs-2.6.7/build' cd /local/robotpkg/var/tmp/robotpkg/wip/prf-gazebo-ros-pkgs/work/gazebo_ros_pkgs-2.6.7/build && /usr/bin/cmake -E cmake_depends "Unix Makefiles" /local/robotpkg/var/tmp/robotpkg/wip/prf-gazebo-ros-pkgs/work/gazebo_ros_pkgs-2.6.7 /local/robotpkg/var/tmp/robotpkg/wip/prf-gazebo-ros-pkgs/work/gazebo_ros_pkgs-2.6.7/gazebo_ros /local/robotpkg/var/tmp/robotpkg/wip/prf-gazebo-ros-pkgs/work/gazebo_ros_pkgs-2.6.7/build /local/robotpkg/var/tmp/robotpkg/wip/prf-gazebo-ros-pkgs/work/gazebo_ros_pkgs-2.6.7/build/gazebo_ros /local/robotpkg/var/tmp/robotpkg/wip/prf-gazebo-ros-pkgs/work/gazebo_ros_pkgs-2.6.7/build/gazebo_ros/CMakeFiles/dynamic_reconfigure_generate_messages_lisp.dir/DependInfo.cmake --color= /usr/bin/cmake -E cmake_progress_report /local/robotpkg/var/tmp/robotpkg/wip/prf-gazebo-ros-pkgs/work/gazebo_ros_pkgs-2.6.7/build/CMakeFiles [ 1%] Built target actionlib_generate_messages_py make -f gazebo_ros/CMakeFiles/rosgraph_msgs_generate_messages_lisp.dir/build.make gazebo_ros/CMakeFiles/rosgraph_msgs_generate_messages_lisp.dir/depend make[2]: Entering directory `/local/robotpkg/var/tmp/robotpkg/wip/prf-gazebo-ros-pkgs/work/gazebo_ros_pkgs-2.6.7/build' cd /local/robotpkg/var/tmp/robotpkg/wip/prf-gazebo-ros-pkgs/work/gazebo_ros_pkgs-2.6.7/build && /usr/bin/cmake -E cmake_depends "Unix Makefiles" /local/robotpkg/var/tmp/robotpkg/wip/prf-gazebo-ros-pkgs/work/gazebo_ros_pkgs-2.6.7 /local/robotpkg/var/tmp/robotpkg/wip/prf-gazebo-ros-pkgs/work/gazebo_ros_pkgs-2.6.7/gazebo_ros /local/robotpkg/var/tmp/robotpkg/wip/prf-gazebo-ros-pkgs/work/gazebo_ros_pkgs-2.6.7/build /local/robotpkg/var/tmp/robotpkg/wip/prf-gazebo-ros-pkgs/work/gazebo_ros_pkgs-2.6.7/build/gazebo_ros /local/robotpkg/var/tmp/robotpkg/wip/prf-gazebo-ros-pkgs/work/gazebo_ros_pkgs-2.6.7/build/gazebo_ros/CMakeFiles/rosgraph_msgs_generate_messages_lisp.dir/DependInfo.cmake --color= [ 1%] Built target rosgraph_msgs_generate_messages_cpp make -f gazebo_ros/CMakeFiles/actionlib_generate_messages_lisp.dir/build.make gazebo_ros/CMakeFiles/actionlib_generate_messages_lisp.dir/depend Scanning dependencies of target dynamic_reconfigure_generate_messages_lisp make[2]: Leaving directory `/local/robotpkg/var/tmp/robotpkg/wip/prf-gazebo-ros-pkgs/work/gazebo_ros_pkgs-2.6.7/build' make -f gazebo_ros/CMakeFiles/dynamic_reconfigure_generate_messages_lisp.dir/build.make gazebo_ros/CMakeFiles/dynamic_reconfigure_generate_messages_lisp.dir/build make[2]: Entering directory `/local/robotpkg/var/tmp/robotpkg/wip/prf-gazebo-ros-pkgs/work/gazebo_ros_pkgs-2.6.7/build' cd /local/robotpkg/var/tmp/robotpkg/wip/prf-gazebo-ros-pkgs/work/gazebo_ros_pkgs-2.6.7/build && /usr/bin/cmake -E cmake_depends "Unix Makefiles" /local/robotpkg/var/tmp/robotpkg/wip/prf-gazebo-ros-pkgs/work/gazebo_ros_pkgs-2.6.7 /local/robotpkg/var/tmp/robotpkg/wip/prf-gazebo-ros-pkgs/work/gazebo_ros_pkgs-2.6.7/gazebo_ros /local/robotpkg/var/tmp/robotpkg/wip/prf-gazebo-ros-pkgs/work/gazebo_ros_pkgs-2.6.7/build /local/robotpkg/var/tmp/robotpkg/wip/prf-gazebo-ros-pkgs/work/gazebo_ros_pkgs-2.6.7/build/gazebo_ros /local/robotpkg/var/tmp/robotpkg/wip/prf-gazebo-ros-pkgs/work/gazebo_ros_pkgs-2.6.7/build/gazebo_ros/CMakeFiles/actionlib_generate_messages_lisp.dir/DependInfo.cmake --color= Scanning dependencies of target rosgraph_msgs_generate_messages_lisp Scanning dependencies of target actionlib_generate_messages_lisp make[2]: Entering directory `/local/robotpkg/var/tmp/robotpkg/wip/prf-gazebo-ros-pkgs/work/gazebo_ros_pkgs-2.6.7/build' make[2]: Leaving directory `/local/robotpkg/var/tmp/robotpkg/wip/prf-gazebo-ros-pkgs/work/gazebo_ros_pkgs-2.6.7/build' make[2]: Leaving directory `/local/robotpkg/var/tmp/robotpkg/wip/prf-gazebo-ros-pkgs/work/gazebo_ros_pkgs-2.6.7/build' make -f gazebo_ros/CMakeFiles/rosgraph_msgs_generate_messages_lisp.dir/build.make gazebo_ros/CMakeFiles/rosgraph_msgs_generate_messages_lisp.dir/build make -f gazebo_ros/CMakeFiles/actionlib_generate_messages_lisp.dir/build.make gazebo_ros/CMakeFiles/actionlib_generate_messages_lisp.dir/build make[2]: Nothing to be done for `gazebo_ros/CMakeFiles/dynamic_reconfigure_generate_messages_lisp.dir/build'. make[2]: Leaving directory `/local/robotpkg/var/tmp/robotpkg/wip/prf-gazebo-ros-pkgs/work/gazebo_ros_pkgs-2.6.7/build' make[2]: Entering directory `/local/robotpkg/var/tmp/robotpkg/wip/prf-gazebo-ros-pkgs/work/gazebo_ros_pkgs-2.6.7/build' make[2]: Nothing to be done for `gazebo_ros/CMakeFiles/rosgraph_msgs_generate_messages_lisp.dir/build'. make[2]: Leaving directory `/local/robotpkg/var/tmp/robotpkg/wip/prf-gazebo-ros-pkgs/work/gazebo_ros_pkgs-2.6.7/build' make[2]: Entering directory `/local/robotpkg/var/tmp/robotpkg/wip/prf-gazebo-ros-pkgs/work/gazebo_ros_pkgs-2.6.7/build' make[2]: Nothing to be done for `gazebo_ros/CMakeFiles/actionlib_generate_messages_lisp.dir/build'. make[2]: Leaving directory `/local/robotpkg/var/tmp/robotpkg/wip/prf-gazebo-ros-pkgs/work/gazebo_ros_pkgs-2.6.7/build' /usr/bin/cmake -E cmake_progress_report /local/robotpkg/var/tmp/robotpkg/wip/prf-gazebo-ros-pkgs/work/gazebo_ros_pkgs-2.6.7/build/CMakeFiles [ 1%] /usr/bin/cmake -E cmake_progress_report /local/robotpkg/var/tmp/robotpkg/wip/prf-gazebo-ros-pkgs/work/gazebo_ros_pkgs-2.6.7/build/CMakeFiles /usr/bin/cmake -E cmake_progress_report /local/robotpkg/var/tmp/robotpkg/wip/prf-gazebo-ros-pkgs/work/gazebo_ros_pkgs-2.6.7/build/CMakeFiles [ 1%] [ 1%] Built target dynamic_reconfigure_generate_messages_lisp Built target rosgraph_msgs_generate_messages_lisp Built target actionlib_generate_messages_lisp make -f gazebo_ros/CMakeFiles/actionlib_generate_messages_cpp.dir/build.make gazebo_ros/CMakeFiles/actionlib_generate_messages_cpp.dir/depend make[2]: Entering directory `/local/robotpkg/var/tmp/robotpkg/wip/prf-gazebo-ros-pkgs/work/gazebo_ros_pkgs-2.6.7/build' cd /local/robotpkg/var/tmp/robotpkg/wip/prf-gazebo-ros-pkgs/work/gazebo_ros_pkgs-2.6.7/build && /usr/bin/cmake -E cmake_depends "Unix Makefiles" /local/robotpkg/var/tmp/robotpkg/wip/prf-gazebo-ros-pkgs/work/gazebo_ros_pkgs-2.6.7 /local/robotpkg/var/tmp/robotpkg/wip/prf-gazebo-ros-pkgs/work/gazebo_ros_pkgs-2.6.7/gazebo_ros /local/robotpkg/var/tmp/robotpkg/wip/prf-gazebo-ros-pkgs/work/gazebo_ros_pkgs-2.6.7/build /local/robotpkg/var/tmp/robotpkg/wip/prf-gazebo-ros-pkgs/work/gazebo_ros_pkgs-2.6.7/build/gazebo_ros /local/robotpkg/var/tmp/robotpkg/wip/prf-gazebo-ros-pkgs/work/gazebo_ros_pkgs-2.6.7/build/gazebo_ros/CMakeFiles/actionlib_generate_messages_cpp.dir/DependInfo.cmake --color= make -f gazebo_ros/CMakeFiles/dynamic_reconfigure_gencfg.dir/build.make gazebo_ros/CMakeFiles/dynamic_reconfigure_gencfg.dir/depend make[2]: Entering directory `/local/robotpkg/var/tmp/robotpkg/wip/prf-gazebo-ros-pkgs/work/gazebo_ros_pkgs-2.6.7/build' cd /local/robotpkg/var/tmp/robotpkg/wip/prf-gazebo-ros-pkgs/work/gazebo_ros_pkgs-2.6.7/build && /usr/bin/cmake -E cmake_depends "Unix Makefiles" /local/robotpkg/var/tmp/robotpkg/wip/prf-gazebo-ros-pkgs/work/gazebo_ros_pkgs-2.6.7 /local/robotpkg/var/tmp/robotpkg/wip/prf-gazebo-ros-pkgs/work/gazebo_ros_pkgs-2.6.7/gazebo_ros /local/robotpkg/var/tmp/robotpkg/wip/prf-gazebo-ros-pkgs/work/gazebo_ros_pkgs-2.6.7/build /local/robotpkg/var/tmp/robotpkg/wip/prf-gazebo-ros-pkgs/work/gazebo_ros_pkgs-2.6.7/build/gazebo_ros /local/robotpkg/var/tmp/robotpkg/wip/prf-gazebo-ros-pkgs/work/gazebo_ros_pkgs-2.6.7/build/gazebo_ros/CMakeFiles/dynamic_reconfigure_gencfg.dir/DependInfo.cmake --color= make -f gazebo_ros/CMakeFiles/actionlib_msgs_generate_messages_cpp.dir/build.make gazebo_ros/CMakeFiles/actionlib_msgs_generate_messages_cpp.dir/depend make[2]: Entering directory `/local/robotpkg/var/tmp/robotpkg/wip/prf-gazebo-ros-pkgs/work/gazebo_ros_pkgs-2.6.7/build' cd /local/robotpkg/var/tmp/robotpkg/wip/prf-gazebo-ros-pkgs/work/gazebo_ros_pkgs-2.6.7/build && /usr/bin/cmake -E cmake_depends "Unix Makefiles" /local/robotpkg/var/tmp/robotpkg/wip/prf-gazebo-ros-pkgs/work/gazebo_ros_pkgs-2.6.7 /local/robotpkg/var/tmp/robotpkg/wip/prf-gazebo-ros-pkgs/work/gazebo_ros_pkgs-2.6.7/gazebo_ros /local/robotpkg/var/tmp/robotpkg/wip/prf-gazebo-ros-pkgs/work/gazebo_ros_pkgs-2.6.7/build /local/robotpkg/var/tmp/robotpkg/wip/prf-gazebo-ros-pkgs/work/gazebo_ros_pkgs-2.6.7/build/gazebo_ros /local/robotpkg/var/tmp/robotpkg/wip/prf-gazebo-ros-pkgs/work/gazebo_ros_pkgs-2.6.7/build/gazebo_ros/CMakeFiles/actionlib_msgs_generate_messages_cpp.dir/DependInfo.cmake --color= Scanning dependencies of target dynamic_reconfigure_gencfg make[2]: Leaving directory `/local/robotpkg/var/tmp/robotpkg/wip/prf-gazebo-ros-pkgs/work/gazebo_ros_pkgs-2.6.7/build' make -f gazebo_ros/CMakeFiles/dynamic_reconfigure_gencfg.dir/build.make gazebo_ros/CMakeFiles/dynamic_reconfigure_gencfg.dir/build Scanning dependencies of target actionlib_generate_messages_cpp Scanning dependencies of target actionlib_msgs_generate_messages_cpp make[2]: Leaving directory `/local/robotpkg/var/tmp/robotpkg/wip/prf-gazebo-ros-pkgs/work/gazebo_ros_pkgs-2.6.7/build' make[2]: Leaving directory `/local/robotpkg/var/tmp/robotpkg/wip/prf-gazebo-ros-pkgs/work/gazebo_ros_pkgs-2.6.7/build' make -f gazebo_ros/CMakeFiles/actionlib_generate_messages_cpp.dir/build.make gazebo_ros/CMakeFiles/actionlib_generate_messages_cpp.dir/build make[2]: Entering directory `/local/robotpkg/var/tmp/robotpkg/wip/prf-gazebo-ros-pkgs/work/gazebo_ros_pkgs-2.6.7/build' make[2]: Nothing to be done for `gazebo_ros/CMakeFiles/dynamic_reconfigure_gencfg.dir/build'. make[2]: Leaving directory `/local/robotpkg/var/tmp/robotpkg/wip/prf-gazebo-ros-pkgs/work/gazebo_ros_pkgs-2.6.7/build' make -f gazebo_ros/CMakeFiles/actionlib_msgs_generate_messages_cpp.dir/build.make gazebo_ros/CMakeFiles/actionlib_msgs_generate_messages_cpp.dir/build make[2]: Entering directory `/local/robotpkg/var/tmp/robotpkg/wip/prf-gazebo-ros-pkgs/work/gazebo_ros_pkgs-2.6.7/build' make[2]: Nothing to be done for `gazebo_ros/CMakeFiles/actionlib_generate_messages_cpp.dir/build'. make[2]: Leaving directory `/local/robotpkg/var/tmp/robotpkg/wip/prf-gazebo-ros-pkgs/work/gazebo_ros_pkgs-2.6.7/build' /usr/bin/cmake -E cmake_progress_report /local/robotpkg/var/tmp/robotpkg/wip/prf-gazebo-ros-pkgs/work/gazebo_ros_pkgs-2.6.7/build/CMakeFiles make[2]: Entering directory `/local/robotpkg/var/tmp/robotpkg/wip/prf-gazebo-ros-pkgs/work/gazebo_ros_pkgs-2.6.7/build' make[2]: Nothing to be done for `gazebo_ros/CMakeFiles/actionlib_msgs_generate_messages_cpp.dir/build'. make[2]: Leaving directory `/local/robotpkg/var/tmp/robotpkg/wip/prf-gazebo-ros-pkgs/work/gazebo_ros_pkgs-2.6.7/build' /usr/bin/cmake -E cmake_progress_report /local/robotpkg/var/tmp/robotpkg/wip/prf-gazebo-ros-pkgs/work/gazebo_ros_pkgs-2.6.7/build/CMakeFiles /usr/bin/cmake -E cmake_progress_report /local/robotpkg/var/tmp/robotpkg/wip/prf-gazebo-ros-pkgs/work/gazebo_ros_pkgs-2.6.7/build/CMakeFiles [ 1%] [ 1%] [ 1%] Built target dynamic_reconfigure_gencfg Built target actionlib_generate_messages_cpp make -f gazebo_ros/CMakeFiles/actionlib_msgs_generate_messages_lisp.dir/build.make gazebo_ros/CMakeFiles/actionlib_msgs_generate_messages_lisp.dir/depend make -f gazebo_ros/CMakeFiles/actionlib_msgs_generate_messages_py.dir/build.make gazebo_ros/CMakeFiles/actionlib_msgs_generate_messages_py.dir/depend make[2]: Entering directory `/local/robotpkg/var/tmp/robotpkg/wip/prf-gazebo-ros-pkgs/work/gazebo_ros_pkgs-2.6.7/build' cd /local/robotpkg/var/tmp/robotpkg/wip/prf-gazebo-ros-pkgs/work/gazebo_ros_pkgs-2.6.7/build && /usr/bin/cmake -E cmake_depends "Unix Makefiles" /local/robotpkg/var/tmp/robotpkg/wip/prf-gazebo-ros-pkgs/work/gazebo_ros_pkgs-2.6.7 /local/robotpkg/var/tmp/robotpkg/wip/prf-gazebo-ros-pkgs/work/gazebo_ros_pkgs-2.6.7/gazebo_ros /local/robotpkg/var/tmp/robotpkg/wip/prf-gazebo-ros-pkgs/work/gazebo_ros_pkgs-2.6.7/build /local/robotpkg/var/tmp/robotpkg/wip/prf-gazebo-ros-pkgs/work/gazebo_ros_pkgs-2.6.7/build/gazebo_ros /local/robotpkg/var/tmp/robotpkg/wip/prf-gazebo-ros-pkgs/work/gazebo_ros_pkgs-2.6.7/build/gazebo_ros/CMakeFiles/actionlib_msgs_generate_messages_lisp.dir/DependInfo.cmake --color= Built target actionlib_msgs_generate_messages_cpp make -f gazebo_ros/CMakeFiles/dynamic_reconfigure_generate_messages_py.dir/build.make gazebo_ros/CMakeFiles/dynamic_reconfigure_generate_messages_py.dir/depend make[2]: Entering directory `/local/robotpkg/var/tmp/robotpkg/wip/prf-gazebo-ros-pkgs/work/gazebo_ros_pkgs-2.6.7/build' cd /local/robotpkg/var/tmp/robotpkg/wip/prf-gazebo-ros-pkgs/work/gazebo_ros_pkgs-2.6.7/build && /usr/bin/cmake -E cmake_depends "Unix Makefiles" /local/robotpkg/var/tmp/robotpkg/wip/prf-gazebo-ros-pkgs/work/gazebo_ros_pkgs-2.6.7 /local/robotpkg/var/tmp/robotpkg/wip/prf-gazebo-ros-pkgs/work/gazebo_ros_pkgs-2.6.7/gazebo_ros /local/robotpkg/var/tmp/robotpkg/wip/prf-gazebo-ros-pkgs/work/gazebo_ros_pkgs-2.6.7/build /local/robotpkg/var/tmp/robotpkg/wip/prf-gazebo-ros-pkgs/work/gazebo_ros_pkgs-2.6.7/build/gazebo_ros /local/robotpkg/var/tmp/robotpkg/wip/prf-gazebo-ros-pkgs/work/gazebo_ros_pkgs-2.6.7/build/gazebo_ros/CMakeFiles/actionlib_msgs_generate_messages_py.dir/DependInfo.cmake --color= make[2]: Entering directory `/local/robotpkg/var/tmp/robotpkg/wip/prf-gazebo-ros-pkgs/work/gazebo_ros_pkgs-2.6.7/build' cd /local/robotpkg/var/tmp/robotpkg/wip/prf-gazebo-ros-pkgs/work/gazebo_ros_pkgs-2.6.7/build && /usr/bin/cmake -E cmake_depends "Unix Makefiles" /local/robotpkg/var/tmp/robotpkg/wip/prf-gazebo-ros-pkgs/work/gazebo_ros_pkgs-2.6.7 /local/robotpkg/var/tmp/robotpkg/wip/prf-gazebo-ros-pkgs/work/gazebo_ros_pkgs-2.6.7/gazebo_ros /local/robotpkg/var/tmp/robotpkg/wip/prf-gazebo-ros-pkgs/work/gazebo_ros_pkgs-2.6.7/build /local/robotpkg/var/tmp/robotpkg/wip/prf-gazebo-ros-pkgs/work/gazebo_ros_pkgs-2.6.7/build/gazebo_ros /local/robotpkg/var/tmp/robotpkg/wip/prf-gazebo-ros-pkgs/work/gazebo_ros_pkgs-2.6.7/build/gazebo_ros/CMakeFiles/dynamic_reconfigure_generate_messages_py.dir/DependInfo.cmake --color= Scanning dependencies of target actionlib_msgs_generate_messages_lisp make[2]: Leaving directory `/local/robotpkg/var/tmp/robotpkg/wip/prf-gazebo-ros-pkgs/work/gazebo_ros_pkgs-2.6.7/build' make -f gazebo_ros/CMakeFiles/actionlib_msgs_generate_messages_lisp.dir/build.make gazebo_ros/CMakeFiles/actionlib_msgs_generate_messages_lisp.dir/build Scanning dependencies of target actionlib_msgs_generate_messages_py make[2]: Leaving directory `/local/robotpkg/var/tmp/robotpkg/wip/prf-gazebo-ros-pkgs/work/gazebo_ros_pkgs-2.6.7/build' make -f gazebo_ros/CMakeFiles/actionlib_msgs_generate_messages_py.dir/build.make gazebo_ros/CMakeFiles/actionlib_msgs_generate_messages_py.dir/build make[2]: Entering directory `/local/robotpkg/var/tmp/robotpkg/wip/prf-gazebo-ros-pkgs/work/gazebo_ros_pkgs-2.6.7/build' make[2]: Nothing to be done for `gazebo_ros/CMakeFiles/actionlib_msgs_generate_messages_lisp.dir/build'. make[2]: Leaving directory `/local/robotpkg/var/tmp/robotpkg/wip/prf-gazebo-ros-pkgs/work/gazebo_ros_pkgs-2.6.7/build' make[2]: Entering directory `/local/robotpkg/var/tmp/robotpkg/wip/prf-gazebo-ros-pkgs/work/gazebo_ros_pkgs-2.6.7/build' make[2]: Nothing to be done for `gazebo_ros/CMakeFiles/actionlib_msgs_generate_messages_py.dir/build'. make[2]: Leaving directory `/local/robotpkg/var/tmp/robotpkg/wip/prf-gazebo-ros-pkgs/work/gazebo_ros_pkgs-2.6.7/build' /usr/bin/cmake -E cmake_progress_report /local/robotpkg/var/tmp/robotpkg/wip/prf-gazebo-ros-pkgs/work/gazebo_ros_pkgs-2.6.7/build/CMakeFiles /usr/bin/cmake -E cmake_progress_report /local/robotpkg/var/tmp/robotpkg/wip/prf-gazebo-ros-pkgs/work/gazebo_ros_pkgs-2.6.7/build/CMakeFiles Scanning dependencies of target dynamic_reconfigure_generate_messages_py make[2]: Leaving directory `/local/robotpkg/var/tmp/robotpkg/wip/prf-gazebo-ros-pkgs/work/gazebo_ros_pkgs-2.6.7/build' make -f gazebo_ros/CMakeFiles/dynamic_reconfigure_generate_messages_py.dir/build.make gazebo_ros/CMakeFiles/dynamic_reconfigure_generate_messages_py.dir/build [ 1%] make[2]: Entering directory `/local/robotpkg/var/tmp/robotpkg/wip/prf-gazebo-ros-pkgs/work/gazebo_ros_pkgs-2.6.7/build' make[2]: Nothing to be done for `gazebo_ros/CMakeFiles/dynamic_reconfigure_generate_messages_py.dir/build'. make[2]: Leaving directory `/local/robotpkg/var/tmp/robotpkg/wip/prf-gazebo-ros-pkgs/work/gazebo_ros_pkgs-2.6.7/build' /usr/bin/cmake -E cmake_progress_report /local/robotpkg/var/tmp/robotpkg/wip/prf-gazebo-ros-pkgs/work/gazebo_ros_pkgs-2.6.7/build/CMakeFiles Built target actionlib_msgs_generate_messages_lisp [ 1%] make -f gazebo_ros/CMakeFiles/tf2_msgs_generate_messages_cpp.dir/build.make gazebo_ros/CMakeFiles/tf2_msgs_generate_messages_cpp.dir/depend make[2]: Entering directory `/local/robotpkg/var/tmp/robotpkg/wip/prf-gazebo-ros-pkgs/work/gazebo_ros_pkgs-2.6.7/build' cd /local/robotpkg/var/tmp/robotpkg/wip/prf-gazebo-ros-pkgs/work/gazebo_ros_pkgs-2.6.7/build && /usr/bin/cmake -E cmake_depends "Unix Makefiles" /local/robotpkg/var/tmp/robotpkg/wip/prf-gazebo-ros-pkgs/work/gazebo_ros_pkgs-2.6.7 /local/robotpkg/var/tmp/robotpkg/wip/prf-gazebo-ros-pkgs/work/gazebo_ros_pkgs-2.6.7/gazebo_ros /local/robotpkg/var/tmp/robotpkg/wip/prf-gazebo-ros-pkgs/work/gazebo_ros_pkgs-2.6.7/build /local/robotpkg/var/tmp/robotpkg/wip/prf-gazebo-ros-pkgs/work/gazebo_ros_pkgs-2.6.7/build/gazebo_ros /local/robotpkg/var/tmp/robotpkg/wip/prf-gazebo-ros-pkgs/work/gazebo_ros_pkgs-2.6.7/build/gazebo_ros/CMakeFiles/tf2_msgs_generate_messages_cpp.dir/DependInfo.cmake --color= Built target actionlib_msgs_generate_messages_py make -f gazebo_ros/CMakeFiles/tf2_msgs_generate_messages_lisp.dir/build.make gazebo_ros/CMakeFiles/tf2_msgs_generate_messages_lisp.dir/depend [ 1%] Built target dynamic_reconfigure_generate_messages_py make -f gazebo_ros/CMakeFiles/tf2_msgs_generate_messages_py.dir/build.make gazebo_ros/CMakeFiles/tf2_msgs_generate_messages_py.dir/depend make[2]: Entering directory `/local/robotpkg/var/tmp/robotpkg/wip/prf-gazebo-ros-pkgs/work/gazebo_ros_pkgs-2.6.7/build' cd /local/robotpkg/var/tmp/robotpkg/wip/prf-gazebo-ros-pkgs/work/gazebo_ros_pkgs-2.6.7/build && /usr/bin/cmake -E cmake_depends "Unix Makefiles" /local/robotpkg/var/tmp/robotpkg/wip/prf-gazebo-ros-pkgs/work/gazebo_ros_pkgs-2.6.7 /local/robotpkg/var/tmp/robotpkg/wip/prf-gazebo-ros-pkgs/work/gazebo_ros_pkgs-2.6.7/gazebo_ros /local/robotpkg/var/tmp/robotpkg/wip/prf-gazebo-ros-pkgs/work/gazebo_ros_pkgs-2.6.7/build /local/robotpkg/var/tmp/robotpkg/wip/prf-gazebo-ros-pkgs/work/gazebo_ros_pkgs-2.6.7/build/gazebo_ros /local/robotpkg/var/tmp/robotpkg/wip/prf-gazebo-ros-pkgs/work/gazebo_ros_pkgs-2.6.7/build/gazebo_ros/CMakeFiles/tf2_msgs_generate_messages_lisp.dir/DependInfo.cmake --color= make[2]: Entering directory `/local/robotpkg/var/tmp/robotpkg/wip/prf-gazebo-ros-pkgs/work/gazebo_ros_pkgs-2.6.7/build' cd /local/robotpkg/var/tmp/robotpkg/wip/prf-gazebo-ros-pkgs/work/gazebo_ros_pkgs-2.6.7/build && /usr/bin/cmake -E cmake_depends "Unix Makefiles" /local/robotpkg/var/tmp/robotpkg/wip/prf-gazebo-ros-pkgs/work/gazebo_ros_pkgs-2.6.7 /local/robotpkg/var/tmp/robotpkg/wip/prf-gazebo-ros-pkgs/work/gazebo_ros_pkgs-2.6.7/gazebo_ros /local/robotpkg/var/tmp/robotpkg/wip/prf-gazebo-ros-pkgs/work/gazebo_ros_pkgs-2.6.7/build /local/robotpkg/var/tmp/robotpkg/wip/prf-gazebo-ros-pkgs/work/gazebo_ros_pkgs-2.6.7/build/gazebo_ros /local/robotpkg/var/tmp/robotpkg/wip/prf-gazebo-ros-pkgs/work/gazebo_ros_pkgs-2.6.7/build/gazebo_ros/CMakeFiles/tf2_msgs_generate_messages_py.dir/DependInfo.cmake --color= Generating reconfiguration files for Physics in gazebo_ros Wrote header file in /local/robotpkg/var/tmp/robotpkg/wip/prf-gazebo-ros-pkgs/work/stage/include/gazebo_ros/PhysicsConfig.h Scanning dependencies of target tf2_msgs_generate_messages_cpp Scanning dependencies of target tf2_msgs_generate_messages_lisp make[2]: Leaving directory `/local/robotpkg/var/tmp/robotpkg/wip/prf-gazebo-ros-pkgs/work/gazebo_ros_pkgs-2.6.7/build' make -f gazebo_ros/CMakeFiles/tf2_msgs_generate_messages_lisp.dir/build.make gazebo_ros/CMakeFiles/tf2_msgs_generate_messages_lisp.dir/build make[2]: Leaving directory `/local/robotpkg/var/tmp/robotpkg/wip/prf-gazebo-ros-pkgs/work/gazebo_ros_pkgs-2.6.7/build' Scanning dependencies of target tf2_msgs_generate_messages_py make[2]: Entering directory `/local/robotpkg/var/tmp/robotpkg/wip/prf-gazebo-ros-pkgs/work/gazebo_ros_pkgs-2.6.7/build' make[2]: Nothing to be done for `gazebo_ros/CMakeFiles/tf2_msgs_generate_messages_lisp.dir/build'. make[2]: Leaving directory `/local/robotpkg/var/tmp/robotpkg/wip/prf-gazebo-ros-pkgs/work/gazebo_ros_pkgs-2.6.7/build' make[2]: Leaving directory `/local/robotpkg/var/tmp/robotpkg/wip/prf-gazebo-ros-pkgs/work/gazebo_ros_pkgs-2.6.7/build' make -f gazebo_ros/CMakeFiles/tf2_msgs_generate_messages_cpp.dir/build.make gazebo_ros/CMakeFiles/tf2_msgs_generate_messages_cpp.dir/build make -f gazebo_ros/CMakeFiles/tf2_msgs_generate_messages_py.dir/build.make gazebo_ros/CMakeFiles/tf2_msgs_generate_messages_py.dir/build make[2]: Leaving directory `/local/robotpkg/var/tmp/robotpkg/wip/prf-gazebo-ros-pkgs/work/gazebo_ros_pkgs-2.6.7/build' make[2]: Entering directory `/local/robotpkg/var/tmp/robotpkg/wip/prf-gazebo-ros-pkgs/work/gazebo_ros_pkgs-2.6.7/build' make[2]: Nothing to be done for `gazebo_ros/CMakeFiles/tf2_msgs_generate_messages_cpp.dir/build'. make[2]: Leaving directory `/local/robotpkg/var/tmp/robotpkg/wip/prf-gazebo-ros-pkgs/work/gazebo_ros_pkgs-2.6.7/build' /usr/bin/cmake -E cmake_progress_report /local/robotpkg/var/tmp/robotpkg/wip/prf-gazebo-ros-pkgs/work/gazebo_ros_pkgs-2.6.7/build/CMakeFiles 81 /usr/bin/cmake -E cmake_progress_report /local/robotpkg/var/tmp/robotpkg/wip/prf-gazebo-ros-pkgs/work/gazebo_ros_pkgs-2.6.7/build/CMakeFiles make[2]: Entering directory `/local/robotpkg/var/tmp/robotpkg/wip/prf-gazebo-ros-pkgs/work/gazebo_ros_pkgs-2.6.7/build' make[2]: Nothing to be done for `gazebo_ros/CMakeFiles/tf2_msgs_generate_messages_py.dir/build'. make[2]: Leaving directory `/local/robotpkg/var/tmp/robotpkg/wip/prf-gazebo-ros-pkgs/work/gazebo_ros_pkgs-2.6.7/build' [ 1%] /usr/bin/cmake -E cmake_progress_report /local/robotpkg/var/tmp/robotpkg/wip/prf-gazebo-ros-pkgs/work/gazebo_ros_pkgs-2.6.7/build/CMakeFiles /usr/bin/cmake -E cmake_progress_report /local/robotpkg/var/tmp/robotpkg/wip/prf-gazebo-ros-pkgs/work/gazebo_ros_pkgs-2.6.7/build/CMakeFiles [ 1%] Built target gazebo_ros_gencfg make -f gazebo_ros/CMakeFiles/dynamic_reconfigure_generate_messages_cpp.dir/build.make gazebo_ros/CMakeFiles/dynamic_reconfigure_generate_messages_cpp.dir/depend [ 1%] Built target tf2_msgs_generate_messages_lisp make[2]: Entering directory `/local/robotpkg/var/tmp/robotpkg/wip/prf-gazebo-ros-pkgs/work/gazebo_ros_pkgs-2.6.7/build' cd /local/robotpkg/var/tmp/robotpkg/wip/prf-gazebo-ros-pkgs/work/gazebo_ros_pkgs-2.6.7/build && /usr/bin/cmake -E cmake_depends "Unix Makefiles" /local/robotpkg/var/tmp/robotpkg/wip/prf-gazebo-ros-pkgs/work/gazebo_ros_pkgs-2.6.7 /local/robotpkg/var/tmp/robotpkg/wip/prf-gazebo-ros-pkgs/work/gazebo_ros_pkgs-2.6.7/gazebo_ros /local/robotpkg/var/tmp/robotpkg/wip/prf-gazebo-ros-pkgs/work/gazebo_ros_pkgs-2.6.7/build /local/robotpkg/var/tmp/robotpkg/wip/prf-gazebo-ros-pkgs/work/gazebo_ros_pkgs-2.6.7/build/gazebo_ros /local/robotpkg/var/tmp/robotpkg/wip/prf-gazebo-ros-pkgs/work/gazebo_ros_pkgs-2.6.7/build/gazebo_ros/CMakeFiles/dynamic_reconfigure_generate_messages_cpp.dir/DependInfo.cmake --color= make -f gazebo_plugins/CMakeFiles/MultiCameraPlugin.dir/build.make gazebo_plugins/CMakeFiles/MultiCameraPlugin.dir/depend Built target tf2_msgs_generate_messages_cpp make -f gazebo_plugins/CMakeFiles/polled_camera_generate_messages_cpp.dir/build.make gazebo_plugins/CMakeFiles/polled_camera_generate_messages_cpp.dir/depend make[2]: Entering directory `/local/robotpkg/var/tmp/robotpkg/wip/prf-gazebo-ros-pkgs/work/gazebo_ros_pkgs-2.6.7/build' cd /local/robotpkg/var/tmp/robotpkg/wip/prf-gazebo-ros-pkgs/work/gazebo_ros_pkgs-2.6.7/build && /usr/bin/cmake -E cmake_depends "Unix Makefiles" /local/robotpkg/var/tmp/robotpkg/wip/prf-gazebo-ros-pkgs/work/gazebo_ros_pkgs-2.6.7 /local/robotpkg/var/tmp/robotpkg/wip/prf-gazebo-ros-pkgs/work/gazebo_ros_pkgs-2.6.7/gazebo_plugins /local/robotpkg/var/tmp/robotpkg/wip/prf-gazebo-ros-pkgs/work/gazebo_ros_pkgs-2.6.7/build /local/robotpkg/var/tmp/robotpkg/wip/prf-gazebo-ros-pkgs/work/gazebo_ros_pkgs-2.6.7/build/gazebo_plugins /local/robotpkg/var/tmp/robotpkg/wip/prf-gazebo-ros-pkgs/work/gazebo_ros_pkgs-2.6.7/build/gazebo_plugins/CMakeFiles/polled_camera_generate_messages_cpp.dir/DependInfo.cmake --color= make[2]: Entering directory `/local/robotpkg/var/tmp/robotpkg/wip/prf-gazebo-ros-pkgs/work/gazebo_ros_pkgs-2.6.7/build' cd /local/robotpkg/var/tmp/robotpkg/wip/prf-gazebo-ros-pkgs/work/gazebo_ros_pkgs-2.6.7/build && /usr/bin/cmake -E cmake_depends "Unix Makefiles" /local/robotpkg/var/tmp/robotpkg/wip/prf-gazebo-ros-pkgs/work/gazebo_ros_pkgs-2.6.7 /local/robotpkg/var/tmp/robotpkg/wip/prf-gazebo-ros-pkgs/work/gazebo_ros_pkgs-2.6.7/gazebo_plugins /local/robotpkg/var/tmp/robotpkg/wip/prf-gazebo-ros-pkgs/work/gazebo_ros_pkgs-2.6.7/build /local/robotpkg/var/tmp/robotpkg/wip/prf-gazebo-ros-pkgs/work/gazebo_ros_pkgs-2.6.7/build/gazebo_plugins /local/robotpkg/var/tmp/robotpkg/wip/prf-gazebo-ros-pkgs/work/gazebo_ros_pkgs-2.6.7/build/gazebo_plugins/CMakeFiles/MultiCameraPlugin.dir/DependInfo.cmake --color= Scanning dependencies of target dynamic_reconfigure_generate_messages_cpp make[2]: Leaving directory `/local/robotpkg/var/tmp/robotpkg/wip/prf-gazebo-ros-pkgs/work/gazebo_ros_pkgs-2.6.7/build' make -f gazebo_ros/CMakeFiles/dynamic_reconfigure_generate_messages_cpp.dir/build.make gazebo_ros/CMakeFiles/dynamic_reconfigure_generate_messages_cpp.dir/build make[2]: Entering directory `/local/robotpkg/var/tmp/robotpkg/wip/prf-gazebo-ros-pkgs/work/gazebo_ros_pkgs-2.6.7/build' make[2]: Nothing to be done for `gazebo_ros/CMakeFiles/dynamic_reconfigure_generate_messages_cpp.dir/build'. make[2]: Leaving directory `/local/robotpkg/var/tmp/robotpkg/wip/prf-gazebo-ros-pkgs/work/gazebo_ros_pkgs-2.6.7/build' /usr/bin/cmake -E cmake_progress_report /local/robotpkg/var/tmp/robotpkg/wip/prf-gazebo-ros-pkgs/work/gazebo_ros_pkgs-2.6.7/build/CMakeFiles [ 1%] Scanning dependencies of target polled_camera_generate_messages_cpp [ 1%] make[2]: Leaving directory `/local/robotpkg/var/tmp/robotpkg/wip/prf-gazebo-ros-pkgs/work/gazebo_ros_pkgs-2.6.7/build' make -f gazebo_plugins/CMakeFiles/polled_camera_generate_messages_cpp.dir/build.make gazebo_plugins/CMakeFiles/polled_camera_generate_messages_cpp.dir/build Built target tf2_msgs_generate_messages_py make[2]: Entering directory `/local/robotpkg/var/tmp/robotpkg/wip/prf-gazebo-ros-pkgs/work/gazebo_ros_pkgs-2.6.7/build' Built target dynamic_reconfigure_generate_messages_cpp make[2]: Nothing to be done for `gazebo_plugins/CMakeFiles/polled_camera_generate_messages_cpp.dir/build'. make -f gazebo_dev/CMakeFiles/_catkin_empty_exported_target.dir/build.make gazebo_dev/CMakeFiles/_catkin_empty_exported_target.dir/depend make[2]: Leaving directory `/local/robotpkg/var/tmp/robotpkg/wip/prf-gazebo-ros-pkgs/work/gazebo_ros_pkgs-2.6.7/build' /usr/bin/cmake -E cmake_progress_report /local/robotpkg/var/tmp/robotpkg/wip/prf-gazebo-ros-pkgs/work/gazebo_ros_pkgs-2.6.7/build/CMakeFiles make -f gazebo_plugins/CMakeFiles/nav_msgs_generate_messages_py.dir/build.make gazebo_plugins/CMakeFiles/nav_msgs_generate_messages_py.dir/depend make[2]: Entering directory `/local/robotpkg/var/tmp/robotpkg/wip/prf-gazebo-ros-pkgs/work/gazebo_ros_pkgs-2.6.7/build' cd /local/robotpkg/var/tmp/robotpkg/wip/prf-gazebo-ros-pkgs/work/gazebo_ros_pkgs-2.6.7/build && /usr/bin/cmake -E cmake_depends "Unix Makefiles" /local/robotpkg/var/tmp/robotpkg/wip/prf-gazebo-ros-pkgs/work/gazebo_ros_pkgs-2.6.7 /local/robotpkg/var/tmp/robotpkg/wip/prf-gazebo-ros-pkgs/work/gazebo_ros_pkgs-2.6.7/gazebo_dev /local/robotpkg/var/tmp/robotpkg/wip/prf-gazebo-ros-pkgs/work/gazebo_ros_pkgs-2.6.7/build /local/robotpkg/var/tmp/robotpkg/wip/prf-gazebo-ros-pkgs/work/gazebo_ros_pkgs-2.6.7/build/gazebo_dev /local/robotpkg/var/tmp/robotpkg/wip/prf-gazebo-ros-pkgs/work/gazebo_ros_pkgs-2.6.7/build/gazebo_dev/CMakeFiles/_catkin_empty_exported_target.dir/DependInfo.cmake --color= make[2]: Entering directory `/local/robotpkg/var/tmp/robotpkg/wip/prf-gazebo-ros-pkgs/work/gazebo_ros_pkgs-2.6.7/build' cd /local/robotpkg/var/tmp/robotpkg/wip/prf-gazebo-ros-pkgs/work/gazebo_ros_pkgs-2.6.7/build && /usr/bin/cmake -E cmake_depends "Unix Makefiles" /local/robotpkg/var/tmp/robotpkg/wip/prf-gazebo-ros-pkgs/work/gazebo_ros_pkgs-2.6.7 /local/robotpkg/var/tmp/robotpkg/wip/prf-gazebo-ros-pkgs/work/gazebo_ros_pkgs-2.6.7/gazebo_plugins /local/robotpkg/var/tmp/robotpkg/wip/prf-gazebo-ros-pkgs/work/gazebo_ros_pkgs-2.6.7/build /local/robotpkg/var/tmp/robotpkg/wip/prf-gazebo-ros-pkgs/work/gazebo_ros_pkgs-2.6.7/build/gazebo_plugins /local/robotpkg/var/tmp/robotpkg/wip/prf-gazebo-ros-pkgs/work/gazebo_ros_pkgs-2.6.7/build/gazebo_plugins/CMakeFiles/nav_msgs_generate_messages_py.dir/DependInfo.cmake --color= [ 1%] Built target polled_camera_generate_messages_cpp make -f gazebo_plugins/CMakeFiles/nodelet_generate_messages_lisp.dir/build.make gazebo_plugins/CMakeFiles/nodelet_generate_messages_lisp.dir/depend Scanning dependencies of target _catkin_empty_exported_target make[2]: Leaving directory `/local/robotpkg/var/tmp/robotpkg/wip/prf-gazebo-ros-pkgs/work/gazebo_ros_pkgs-2.6.7/build' make -f gazebo_dev/CMakeFiles/_catkin_empty_exported_target.dir/build.make gazebo_dev/CMakeFiles/_catkin_empty_exported_target.dir/build make[2]: Entering directory `/local/robotpkg/var/tmp/robotpkg/wip/prf-gazebo-ros-pkgs/work/gazebo_ros_pkgs-2.6.7/build' cd /local/robotpkg/var/tmp/robotpkg/wip/prf-gazebo-ros-pkgs/work/gazebo_ros_pkgs-2.6.7/build && /usr/bin/cmake -E cmake_depends "Unix Makefiles" /local/robotpkg/var/tmp/robotpkg/wip/prf-gazebo-ros-pkgs/work/gazebo_ros_pkgs-2.6.7 /local/robotpkg/var/tmp/robotpkg/wip/prf-gazebo-ros-pkgs/work/gazebo_ros_pkgs-2.6.7/gazebo_plugins /local/robotpkg/var/tmp/robotpkg/wip/prf-gazebo-ros-pkgs/work/gazebo_ros_pkgs-2.6.7/build /local/robotpkg/var/tmp/robotpkg/wip/prf-gazebo-ros-pkgs/work/gazebo_ros_pkgs-2.6.7/build/gazebo_plugins /local/robotpkg/var/tmp/robotpkg/wip/prf-gazebo-ros-pkgs/work/gazebo_ros_pkgs-2.6.7/build/gazebo_plugins/CMakeFiles/nodelet_generate_messages_lisp.dir/DependInfo.cmake --color= make[2]: Entering directory `/local/robotpkg/var/tmp/robotpkg/wip/prf-gazebo-ros-pkgs/work/gazebo_ros_pkgs-2.6.7/build' make[2]: Nothing to be done for `gazebo_dev/CMakeFiles/_catkin_empty_exported_target.dir/build'. make[2]: Leaving directory `/local/robotpkg/var/tmp/robotpkg/wip/prf-gazebo-ros-pkgs/work/gazebo_ros_pkgs-2.6.7/build' /usr/bin/cmake -E cmake_progress_report /local/robotpkg/var/tmp/robotpkg/wip/prf-gazebo-ros-pkgs/work/gazebo_ros_pkgs-2.6.7/build/CMakeFiles Scanning dependencies of target nav_msgs_generate_messages_py make[2]: Leaving directory `/local/robotpkg/var/tmp/robotpkg/wip/prf-gazebo-ros-pkgs/work/gazebo_ros_pkgs-2.6.7/build' make -f gazebo_plugins/CMakeFiles/nav_msgs_generate_messages_py.dir/build.make gazebo_plugins/CMakeFiles/nav_msgs_generate_messages_py.dir/build [ 1%] Scanning dependencies of target nodelet_generate_messages_lisp Built target _catkin_empty_exported_target make -f gazebo_plugins/CMakeFiles/nodelet_generate_messages_py.dir/build.make gazebo_plugins/CMakeFiles/nodelet_generate_messages_py.dir/depend make[2]: Leaving directory `/local/robotpkg/var/tmp/robotpkg/wip/prf-gazebo-ros-pkgs/work/gazebo_ros_pkgs-2.6.7/build' make -f gazebo_plugins/CMakeFiles/nodelet_generate_messages_lisp.dir/build.make gazebo_plugins/CMakeFiles/nodelet_generate_messages_lisp.dir/build make[2]: Entering directory `/local/robotpkg/var/tmp/robotpkg/wip/prf-gazebo-ros-pkgs/work/gazebo_ros_pkgs-2.6.7/build' make[2]: Nothing to be done for `gazebo_plugins/CMakeFiles/nav_msgs_generate_messages_py.dir/build'. make[2]: Leaving directory `/local/robotpkg/var/tmp/robotpkg/wip/prf-gazebo-ros-pkgs/work/gazebo_ros_pkgs-2.6.7/build' /usr/bin/cmake -E cmake_progress_report /local/robotpkg/var/tmp/robotpkg/wip/prf-gazebo-ros-pkgs/work/gazebo_ros_pkgs-2.6.7/build/CMakeFiles make[2]: Entering directory `/local/robotpkg/var/tmp/robotpkg/wip/prf-gazebo-ros-pkgs/work/gazebo_ros_pkgs-2.6.7/build' make[2]: Nothing to be done for `gazebo_plugins/CMakeFiles/nodelet_generate_messages_lisp.dir/build'. make[2]: Leaving directory `/local/robotpkg/var/tmp/robotpkg/wip/prf-gazebo-ros-pkgs/work/gazebo_ros_pkgs-2.6.7/build' /usr/bin/cmake -E cmake_progress_report /local/robotpkg/var/tmp/robotpkg/wip/prf-gazebo-ros-pkgs/work/gazebo_ros_pkgs-2.6.7/build/CMakeFiles make[2]: Entering directory `/local/robotpkg/var/tmp/robotpkg/wip/prf-gazebo-ros-pkgs/work/gazebo_ros_pkgs-2.6.7/build' cd /local/robotpkg/var/tmp/robotpkg/wip/prf-gazebo-ros-pkgs/work/gazebo_ros_pkgs-2.6.7/build && /usr/bin/cmake -E cmake_depends "Unix Makefiles" /local/robotpkg/var/tmp/robotpkg/wip/prf-gazebo-ros-pkgs/work/gazebo_ros_pkgs-2.6.7 /local/robotpkg/var/tmp/robotpkg/wip/prf-gazebo-ros-pkgs/work/gazebo_ros_pkgs-2.6.7/gazebo_plugins /local/robotpkg/var/tmp/robotpkg/wip/prf-gazebo-ros-pkgs/work/gazebo_ros_pkgs-2.6.7/build /local/robotpkg/var/tmp/robotpkg/wip/prf-gazebo-ros-pkgs/work/gazebo_ros_pkgs-2.6.7/build/gazebo_plugins /local/robotpkg/var/tmp/robotpkg/wip/prf-gazebo-ros-pkgs/work/gazebo_ros_pkgs-2.6.7/build/gazebo_plugins/CMakeFiles/nodelet_generate_messages_py.dir/DependInfo.cmake --color= [ 1%] Built target nav_msgs_generate_messages_py make -f gazebo_plugins/CMakeFiles/bond_generate_messages_py.dir/build.make gazebo_plugins/CMakeFiles/bond_generate_messages_py.dir/depend make[2]: Entering directory `/local/robotpkg/var/tmp/robotpkg/wip/prf-gazebo-ros-pkgs/work/gazebo_ros_pkgs-2.6.7/build' cd /local/robotpkg/var/tmp/robotpkg/wip/prf-gazebo-ros-pkgs/work/gazebo_ros_pkgs-2.6.7/build && /usr/bin/cmake -E cmake_depends "Unix Makefiles" /local/robotpkg/var/tmp/robotpkg/wip/prf-gazebo-ros-pkgs/work/gazebo_ros_pkgs-2.6.7 /local/robotpkg/var/tmp/robotpkg/wip/prf-gazebo-ros-pkgs/work/gazebo_ros_pkgs-2.6.7/gazebo_plugins /local/robotpkg/var/tmp/robotpkg/wip/prf-gazebo-ros-pkgs/work/gazebo_ros_pkgs-2.6.7/build /local/robotpkg/var/tmp/robotpkg/wip/prf-gazebo-ros-pkgs/work/gazebo_ros_pkgs-2.6.7/build/gazebo_plugins /local/robotpkg/var/tmp/robotpkg/wip/prf-gazebo-ros-pkgs/work/gazebo_ros_pkgs-2.6.7/build/gazebo_plugins/CMakeFiles/bond_generate_messages_py.dir/DependInfo.cmake --color= [ 1%] Built target nodelet_generate_messages_lisp Scanning dependencies of target nodelet_generate_messages_py make[2]: Leaving directory `/local/robotpkg/var/tmp/robotpkg/wip/prf-gazebo-ros-pkgs/work/gazebo_ros_pkgs-2.6.7/build' make -f gazebo_plugins/CMakeFiles/nodelet_generate_messages_py.dir/build.make gazebo_plugins/CMakeFiles/nodelet_generate_messages_py.dir/build Scanning dependencies of target bond_generate_messages_py make[2]: Leaving directory `/local/robotpkg/var/tmp/robotpkg/wip/prf-gazebo-ros-pkgs/work/gazebo_ros_pkgs-2.6.7/build' make[2]: Entering directory `/local/robotpkg/var/tmp/robotpkg/wip/prf-gazebo-ros-pkgs/work/gazebo_ros_pkgs-2.6.7/build' make[2]: Nothing to be done for `gazebo_plugins/CMakeFiles/nodelet_generate_messages_py.dir/build'. make[2]: Leaving directory `/local/robotpkg/var/tmp/robotpkg/wip/prf-gazebo-ros-pkgs/work/gazebo_ros_pkgs-2.6.7/build' make -f gazebo_plugins/CMakeFiles/bond_generate_messages_py.dir/build.make gazebo_plugins/CMakeFiles/bond_generate_messages_py.dir/build /usr/bin/cmake -E cmake_progress_report /local/robotpkg/var/tmp/robotpkg/wip/prf-gazebo-ros-pkgs/work/gazebo_ros_pkgs-2.6.7/build/CMakeFiles make[2]: Entering directory `/local/robotpkg/var/tmp/robotpkg/wip/prf-gazebo-ros-pkgs/work/gazebo_ros_pkgs-2.6.7/build' make[2]: Nothing to be done for `gazebo_plugins/CMakeFiles/bond_generate_messages_py.dir/build'. make[2]: Leaving directory `/local/robotpkg/var/tmp/robotpkg/wip/prf-gazebo-ros-pkgs/work/gazebo_ros_pkgs-2.6.7/build' make -f gazebo_plugins/CMakeFiles/nav_msgs_generate_messages_lisp.dir/build.make gazebo_plugins/CMakeFiles/nav_msgs_generate_messages_lisp.dir/depend make[2]: Entering directory `/local/robotpkg/var/tmp/robotpkg/wip/prf-gazebo-ros-pkgs/work/gazebo_ros_pkgs-2.6.7/build' cd /local/robotpkg/var/tmp/robotpkg/wip/prf-gazebo-ros-pkgs/work/gazebo_ros_pkgs-2.6.7/build && /usr/bin/cmake -E cmake_depends "Unix Makefiles" /local/robotpkg/var/tmp/robotpkg/wip/prf-gazebo-ros-pkgs/work/gazebo_ros_pkgs-2.6.7 /local/robotpkg/var/tmp/robotpkg/wip/prf-gazebo-ros-pkgs/work/gazebo_ros_pkgs-2.6.7/gazebo_plugins /local/robotpkg/var/tmp/robotpkg/wip/prf-gazebo-ros-pkgs/work/gazebo_ros_pkgs-2.6.7/build /local/robotpkg/var/tmp/robotpkg/wip/prf-gazebo-ros-pkgs/work/gazebo_ros_pkgs-2.6.7/build/gazebo_plugins /local/robotpkg/var/tmp/robotpkg/wip/prf-gazebo-ros-pkgs/work/gazebo_ros_pkgs-2.6.7/build/gazebo_plugins/CMakeFiles/nav_msgs_generate_messages_lisp.dir/DependInfo.cmake --color= /usr/bin/cmake -E cmake_progress_report /local/robotpkg/var/tmp/robotpkg/wip/prf-gazebo-ros-pkgs/work/gazebo_ros_pkgs-2.6.7/build/CMakeFiles [ 1%] Built target bond_generate_messages_py make -f gazebo_plugins/CMakeFiles/nav_msgs_generate_messages_cpp.dir/build.make gazebo_plugins/CMakeFiles/nav_msgs_generate_messages_cpp.dir/depend Scanning dependencies of target nav_msgs_generate_messages_lisp make[2]: Leaving directory `/local/robotpkg/var/tmp/robotpkg/wip/prf-gazebo-ros-pkgs/work/gazebo_ros_pkgs-2.6.7/build' make -f gazebo_plugins/CMakeFiles/nav_msgs_generate_messages_lisp.dir/build.make gazebo_plugins/CMakeFiles/nav_msgs_generate_messages_lisp.dir/build make[2]: Entering directory `/local/robotpkg/var/tmp/robotpkg/wip/prf-gazebo-ros-pkgs/work/gazebo_ros_pkgs-2.6.7/build' cd /local/robotpkg/var/tmp/robotpkg/wip/prf-gazebo-ros-pkgs/work/gazebo_ros_pkgs-2.6.7/build && /usr/bin/cmake -E cmake_depends "Unix Makefiles" /local/robotpkg/var/tmp/robotpkg/wip/prf-gazebo-ros-pkgs/work/gazebo_ros_pkgs-2.6.7 /local/robotpkg/var/tmp/robotpkg/wip/prf-gazebo-ros-pkgs/work/gazebo_ros_pkgs-2.6.7/gazebo_plugins /local/robotpkg/var/tmp/robotpkg/wip/prf-gazebo-ros-pkgs/work/gazebo_ros_pkgs-2.6.7/build /local/robotpkg/var/tmp/robotpkg/wip/prf-gazebo-ros-pkgs/work/gazebo_ros_pkgs-2.6.7/build/gazebo_plugins /local/robotpkg/var/tmp/robotpkg/wip/prf-gazebo-ros-pkgs/work/gazebo_ros_pkgs-2.6.7/build/gazebo_plugins/CMakeFiles/nav_msgs_generate_messages_cpp.dir/DependInfo.cmake --color= [ 1%] make[2]: Entering directory `/local/robotpkg/var/tmp/robotpkg/wip/prf-gazebo-ros-pkgs/work/gazebo_ros_pkgs-2.6.7/build' make[2]: Nothing to be done for `gazebo_plugins/CMakeFiles/nav_msgs_generate_messages_lisp.dir/build'. make[2]: Leaving directory `/local/robotpkg/var/tmp/robotpkg/wip/prf-gazebo-ros-pkgs/work/gazebo_ros_pkgs-2.6.7/build' /usr/bin/cmake -E cmake_progress_report /local/robotpkg/var/tmp/robotpkg/wip/prf-gazebo-ros-pkgs/work/gazebo_ros_pkgs-2.6.7/build/CMakeFiles Built target nodelet_generate_messages_py make -f gazebo_plugins/CMakeFiles/bond_generate_messages_cpp.dir/build.make gazebo_plugins/CMakeFiles/bond_generate_messages_cpp.dir/depend Scanning dependencies of target nav_msgs_generate_messages_cpp make[2]: Entering directory `/local/robotpkg/var/tmp/robotpkg/wip/prf-gazebo-ros-pkgs/work/gazebo_ros_pkgs-2.6.7/build' make[2]: Leaving directory `/local/robotpkg/var/tmp/robotpkg/wip/prf-gazebo-ros-pkgs/work/gazebo_ros_pkgs-2.6.7/build' make -f gazebo_plugins/CMakeFiles/nav_msgs_generate_messages_cpp.dir/build.make gazebo_plugins/CMakeFiles/nav_msgs_generate_messages_cpp.dir/build cd /local/robotpkg/var/tmp/robotpkg/wip/prf-gazebo-ros-pkgs/work/gazebo_ros_pkgs-2.6.7/build && /usr/bin/cmake -E cmake_depends "Unix Makefiles" /local/robotpkg/var/tmp/robotpkg/wip/prf-gazebo-ros-pkgs/work/gazebo_ros_pkgs-2.6.7 /local/robotpkg/var/tmp/robotpkg/wip/prf-gazebo-ros-pkgs/work/gazebo_ros_pkgs-2.6.7/gazebo_plugins /local/robotpkg/var/tmp/robotpkg/wip/prf-gazebo-ros-pkgs/work/gazebo_ros_pkgs-2.6.7/build /local/robotpkg/var/tmp/robotpkg/wip/prf-gazebo-ros-pkgs/work/gazebo_ros_pkgs-2.6.7/build/gazebo_plugins /local/robotpkg/var/tmp/robotpkg/wip/prf-gazebo-ros-pkgs/work/gazebo_ros_pkgs-2.6.7/build/gazebo_plugins/CMakeFiles/bond_generate_messages_cpp.dir/DependInfo.cmake --color= make[2]: Entering directory `/local/robotpkg/var/tmp/robotpkg/wip/prf-gazebo-ros-pkgs/work/gazebo_ros_pkgs-2.6.7/build' make[2]: Nothing to be done for `gazebo_plugins/CMakeFiles/nav_msgs_generate_messages_cpp.dir/build'. make[2]: Leaving directory `/local/robotpkg/var/tmp/robotpkg/wip/prf-gazebo-ros-pkgs/work/gazebo_ros_pkgs-2.6.7/build' /usr/bin/cmake -E cmake_progress_report /local/robotpkg/var/tmp/robotpkg/wip/prf-gazebo-ros-pkgs/work/gazebo_ros_pkgs-2.6.7/build/CMakeFiles [ 1%] [ 1%] Scanning dependencies of target bond_generate_messages_cpp make[2]: Leaving directory `/local/robotpkg/var/tmp/robotpkg/wip/prf-gazebo-ros-pkgs/work/gazebo_ros_pkgs-2.6.7/build' Built target nav_msgs_generate_messages_lisp Built target nav_msgs_generate_messages_cpp make -f gazebo_plugins/CMakeFiles/bond_generate_messages_cpp.dir/build.make gazebo_plugins/CMakeFiles/bond_generate_messages_cpp.dir/build make -f gazebo_plugins/CMakeFiles/bond_generate_messages_lisp.dir/build.make gazebo_plugins/CMakeFiles/bond_generate_messages_lisp.dir/depend make[2]: Entering directory `/local/robotpkg/var/tmp/robotpkg/wip/prf-gazebo-ros-pkgs/work/gazebo_ros_pkgs-2.6.7/build' cd /local/robotpkg/var/tmp/robotpkg/wip/prf-gazebo-ros-pkgs/work/gazebo_ros_pkgs-2.6.7/build && /usr/bin/cmake -E cmake_depends "Unix Makefiles" /local/robotpkg/var/tmp/robotpkg/wip/prf-gazebo-ros-pkgs/work/gazebo_ros_pkgs-2.6.7 /local/robotpkg/var/tmp/robotpkg/wip/prf-gazebo-ros-pkgs/work/gazebo_ros_pkgs-2.6.7/gazebo_plugins /local/robotpkg/var/tmp/robotpkg/wip/prf-gazebo-ros-pkgs/work/gazebo_ros_pkgs-2.6.7/build /local/robotpkg/var/tmp/robotpkg/wip/prf-gazebo-ros-pkgs/work/gazebo_ros_pkgs-2.6.7/build/gazebo_plugins /local/robotpkg/var/tmp/robotpkg/wip/prf-gazebo-ros-pkgs/work/gazebo_ros_pkgs-2.6.7/build/gazebo_plugins/CMakeFiles/bond_generate_messages_lisp.dir/DependInfo.cmake --color= make -f gazebo_plugins/CMakeFiles/nodelet_generate_messages_cpp.dir/build.make gazebo_plugins/CMakeFiles/nodelet_generate_messages_cpp.dir/depend make[2]: Entering directory `/local/robotpkg/var/tmp/robotpkg/wip/prf-gazebo-ros-pkgs/work/gazebo_ros_pkgs-2.6.7/build' make[2]: Nothing to be done for `gazebo_plugins/CMakeFiles/bond_generate_messages_cpp.dir/build'. make[2]: Leaving directory `/local/robotpkg/var/tmp/robotpkg/wip/prf-gazebo-ros-pkgs/work/gazebo_ros_pkgs-2.6.7/build' /usr/bin/cmake -E cmake_progress_report /local/robotpkg/var/tmp/robotpkg/wip/prf-gazebo-ros-pkgs/work/gazebo_ros_pkgs-2.6.7/build/CMakeFiles make[2]: Entering directory `/local/robotpkg/var/tmp/robotpkg/wip/prf-gazebo-ros-pkgs/work/gazebo_ros_pkgs-2.6.7/build' cd /local/robotpkg/var/tmp/robotpkg/wip/prf-gazebo-ros-pkgs/work/gazebo_ros_pkgs-2.6.7/build && /usr/bin/cmake -E cmake_depends "Unix Makefiles" /local/robotpkg/var/tmp/robotpkg/wip/prf-gazebo-ros-pkgs/work/gazebo_ros_pkgs-2.6.7 /local/robotpkg/var/tmp/robotpkg/wip/prf-gazebo-ros-pkgs/work/gazebo_ros_pkgs-2.6.7/gazebo_plugins /local/robotpkg/var/tmp/robotpkg/wip/prf-gazebo-ros-pkgs/work/gazebo_ros_pkgs-2.6.7/build /local/robotpkg/var/tmp/robotpkg/wip/prf-gazebo-ros-pkgs/work/gazebo_ros_pkgs-2.6.7/build/gazebo_plugins /local/robotpkg/var/tmp/robotpkg/wip/prf-gazebo-ros-pkgs/work/gazebo_ros_pkgs-2.6.7/build/gazebo_plugins/CMakeFiles/nodelet_generate_messages_cpp.dir/DependInfo.cmake --color= Scanning dependencies of target bond_generate_messages_lisp make[2]: Leaving directory `/local/robotpkg/var/tmp/robotpkg/wip/prf-gazebo-ros-pkgs/work/gazebo_ros_pkgs-2.6.7/build' make -f gazebo_plugins/CMakeFiles/bond_generate_messages_lisp.dir/build.make gazebo_plugins/CMakeFiles/bond_generate_messages_lisp.dir/build [ 1%] make[2]: Entering directory `/local/robotpkg/var/tmp/robotpkg/wip/prf-gazebo-ros-pkgs/work/gazebo_ros_pkgs-2.6.7/build' make[2]: Nothing to be done for `gazebo_plugins/CMakeFiles/bond_generate_messages_lisp.dir/build'. make[2]: Leaving directory `/local/robotpkg/var/tmp/robotpkg/wip/prf-gazebo-ros-pkgs/work/gazebo_ros_pkgs-2.6.7/build' /usr/bin/cmake -E cmake_progress_report /local/robotpkg/var/tmp/robotpkg/wip/prf-gazebo-ros-pkgs/work/gazebo_ros_pkgs-2.6.7/build/CMakeFiles Scanning dependencies of target nodelet_generate_messages_cpp make[2]: Leaving directory `/local/robotpkg/var/tmp/robotpkg/wip/prf-gazebo-ros-pkgs/work/gazebo_ros_pkgs-2.6.7/build' make -f gazebo_plugins/CMakeFiles/nodelet_generate_messages_cpp.dir/build.make gazebo_plugins/CMakeFiles/nodelet_generate_messages_cpp.dir/build make[2]: Entering directory `/local/robotpkg/var/tmp/robotpkg/wip/prf-gazebo-ros-pkgs/work/gazebo_ros_pkgs-2.6.7/build' make[2]: Nothing to be done for `gazebo_plugins/CMakeFiles/nodelet_generate_messages_cpp.dir/build'. make[2]: Leaving directory `/local/robotpkg/var/tmp/robotpkg/wip/prf-gazebo-ros-pkgs/work/gazebo_ros_pkgs-2.6.7/build' /usr/bin/cmake -E cmake_progress_report /local/robotpkg/var/tmp/robotpkg/wip/prf-gazebo-ros-pkgs/work/gazebo_ros_pkgs-2.6.7/build/CMakeFiles [ 1%] [ 1%] Built target bond_generate_messages_lisp make -f gazebo_plugins/CMakeFiles/polled_camera_generate_messages_lisp.dir/build.make gazebo_plugins/CMakeFiles/polled_camera_generate_messages_lisp.dir/depend Built target nodelet_generate_messages_cpp Built target bond_generate_messages_cpp make -f gazebo_plugins/CMakeFiles/polled_camera_generate_messages_py.dir/build.make gazebo_plugins/CMakeFiles/polled_camera_generate_messages_py.dir/depend make[2]: Entering directory `/local/robotpkg/var/tmp/robotpkg/wip/prf-gazebo-ros-pkgs/work/gazebo_ros_pkgs-2.6.7/build' cd /local/robotpkg/var/tmp/robotpkg/wip/prf-gazebo-ros-pkgs/work/gazebo_ros_pkgs-2.6.7/build && /usr/bin/cmake -E cmake_depends "Unix Makefiles" /local/robotpkg/var/tmp/robotpkg/wip/prf-gazebo-ros-pkgs/work/gazebo_ros_pkgs-2.6.7 /local/robotpkg/var/tmp/robotpkg/wip/prf-gazebo-ros-pkgs/work/gazebo_ros_pkgs-2.6.7/gazebo_plugins /local/robotpkg/var/tmp/robotpkg/wip/prf-gazebo-ros-pkgs/work/gazebo_ros_pkgs-2.6.7/build /local/robotpkg/var/tmp/robotpkg/wip/prf-gazebo-ros-pkgs/work/gazebo_ros_pkgs-2.6.7/build/gazebo_plugins /local/robotpkg/var/tmp/robotpkg/wip/prf-gazebo-ros-pkgs/work/gazebo_ros_pkgs-2.6.7/build/gazebo_plugins/CMakeFiles/polled_camera_generate_messages_lisp.dir/DependInfo.cmake --color= make -f gazebo_plugins/CMakeFiles/diagnostic_msgs_generate_messages_cpp.dir/build.make gazebo_plugins/CMakeFiles/diagnostic_msgs_generate_messages_cpp.dir/depend make[2]: Entering directory `/local/robotpkg/var/tmp/robotpkg/wip/prf-gazebo-ros-pkgs/work/gazebo_ros_pkgs-2.6.7/build' cd /local/robotpkg/var/tmp/robotpkg/wip/prf-gazebo-ros-pkgs/work/gazebo_ros_pkgs-2.6.7/build && /usr/bin/cmake -E cmake_depends "Unix Makefiles" /local/robotpkg/var/tmp/robotpkg/wip/prf-gazebo-ros-pkgs/work/gazebo_ros_pkgs-2.6.7 /local/robotpkg/var/tmp/robotpkg/wip/prf-gazebo-ros-pkgs/work/gazebo_ros_pkgs-2.6.7/gazebo_plugins /local/robotpkg/var/tmp/robotpkg/wip/prf-gazebo-ros-pkgs/work/gazebo_ros_pkgs-2.6.7/build /local/robotpkg/var/tmp/robotpkg/wip/prf-gazebo-ros-pkgs/work/gazebo_ros_pkgs-2.6.7/build/gazebo_plugins /local/robotpkg/var/tmp/robotpkg/wip/prf-gazebo-ros-pkgs/work/gazebo_ros_pkgs-2.6.7/build/gazebo_plugins/CMakeFiles/polled_camera_generate_messages_py.dir/DependInfo.cmake --color= make[2]: Entering directory `/local/robotpkg/var/tmp/robotpkg/wip/prf-gazebo-ros-pkgs/work/gazebo_ros_pkgs-2.6.7/build' cd /local/robotpkg/var/tmp/robotpkg/wip/prf-gazebo-ros-pkgs/work/gazebo_ros_pkgs-2.6.7/build && /usr/bin/cmake -E cmake_depends "Unix Makefiles" /local/robotpkg/var/tmp/robotpkg/wip/prf-gazebo-ros-pkgs/work/gazebo_ros_pkgs-2.6.7 /local/robotpkg/var/tmp/robotpkg/wip/prf-gazebo-ros-pkgs/work/gazebo_ros_pkgs-2.6.7/gazebo_plugins /local/robotpkg/var/tmp/robotpkg/wip/prf-gazebo-ros-pkgs/work/gazebo_ros_pkgs-2.6.7/build /local/robotpkg/var/tmp/robotpkg/wip/prf-gazebo-ros-pkgs/work/gazebo_ros_pkgs-2.6.7/build/gazebo_plugins /local/robotpkg/var/tmp/robotpkg/wip/prf-gazebo-ros-pkgs/work/gazebo_ros_pkgs-2.6.7/build/gazebo_plugins/CMakeFiles/diagnostic_msgs_generate_messages_cpp.dir/DependInfo.cmake --color= Scanning dependencies of target polled_camera_generate_messages_lisp Scanning dependencies of target polled_camera_generate_messages_py make[2]: Leaving directory `/local/robotpkg/var/tmp/robotpkg/wip/prf-gazebo-ros-pkgs/work/gazebo_ros_pkgs-2.6.7/build' make[2]: Leaving directory `/local/robotpkg/var/tmp/robotpkg/wip/prf-gazebo-ros-pkgs/work/gazebo_ros_pkgs-2.6.7/build' make -f gazebo_plugins/CMakeFiles/polled_camera_generate_messages_lisp.dir/build.make gazebo_plugins/CMakeFiles/polled_camera_generate_messages_lisp.dir/build make -f gazebo_plugins/CMakeFiles/polled_camera_generate_messages_py.dir/build.make gazebo_plugins/CMakeFiles/polled_camera_generate_messages_py.dir/build make[2]: Entering directory `/local/robotpkg/var/tmp/robotpkg/wip/prf-gazebo-ros-pkgs/work/gazebo_ros_pkgs-2.6.7/build' make[2]: Nothing to be done for `gazebo_plugins/CMakeFiles/polled_camera_generate_messages_py.dir/build'. make[2]: Leaving directory `/local/robotpkg/var/tmp/robotpkg/wip/prf-gazebo-ros-pkgs/work/gazebo_ros_pkgs-2.6.7/build' /usr/bin/cmake -E cmake_progress_report /local/robotpkg/var/tmp/robotpkg/wip/prf-gazebo-ros-pkgs/work/gazebo_ros_pkgs-2.6.7/build/CMakeFiles make[2]: Entering directory `/local/robotpkg/var/tmp/robotpkg/wip/prf-gazebo-ros-pkgs/work/gazebo_ros_pkgs-2.6.7/build' make[2]: Nothing to be done for `gazebo_plugins/CMakeFiles/polled_camera_generate_messages_lisp.dir/build'. make[2]: Leaving directory `/local/robotpkg/var/tmp/robotpkg/wip/prf-gazebo-ros-pkgs/work/gazebo_ros_pkgs-2.6.7/build' /usr/bin/cmake -E cmake_progress_report /local/robotpkg/var/tmp/robotpkg/wip/prf-gazebo-ros-pkgs/work/gazebo_ros_pkgs-2.6.7/build/CMakeFiles [ 1%] Scanning dependencies of target diagnostic_msgs_generate_messages_cpp Built target polled_camera_generate_messages_py make[2]: Leaving directory `/local/robotpkg/var/tmp/robotpkg/wip/prf-gazebo-ros-pkgs/work/gazebo_ros_pkgs-2.6.7/build' make -f gazebo_plugins/CMakeFiles/diagnostic_msgs_generate_messages_cpp.dir/build.make gazebo_plugins/CMakeFiles/diagnostic_msgs_generate_messages_cpp.dir/build [ 1%] make[2]: Entering directory `/local/robotpkg/var/tmp/robotpkg/wip/prf-gazebo-ros-pkgs/work/gazebo_ros_pkgs-2.6.7/build' make[2]: Nothing to be done for `gazebo_plugins/CMakeFiles/diagnostic_msgs_generate_messages_cpp.dir/build'. make[2]: Leaving directory `/local/robotpkg/var/tmp/robotpkg/wip/prf-gazebo-ros-pkgs/work/gazebo_ros_pkgs-2.6.7/build' Built target polled_camera_generate_messages_lisp /usr/bin/cmake -E cmake_progress_report /local/robotpkg/var/tmp/robotpkg/wip/prf-gazebo-ros-pkgs/work/gazebo_ros_pkgs-2.6.7/build/CMakeFiles make -f gazebo_plugins/CMakeFiles/diagnostic_msgs_generate_messages_lisp.dir/build.make gazebo_plugins/CMakeFiles/diagnostic_msgs_generate_messages_lisp.dir/depend make -f gazebo_plugins/CMakeFiles/diagnostic_msgs_generate_messages_py.dir/build.make gazebo_plugins/CMakeFiles/diagnostic_msgs_generate_messages_py.dir/depend make[2]: Entering directory `/local/robotpkg/var/tmp/robotpkg/wip/prf-gazebo-ros-pkgs/work/gazebo_ros_pkgs-2.6.7/build' cd /local/robotpkg/var/tmp/robotpkg/wip/prf-gazebo-ros-pkgs/work/gazebo_ros_pkgs-2.6.7/build && /usr/bin/cmake -E cmake_depends "Unix Makefiles" /local/robotpkg/var/tmp/robotpkg/wip/prf-gazebo-ros-pkgs/work/gazebo_ros_pkgs-2.6.7 /local/robotpkg/var/tmp/robotpkg/wip/prf-gazebo-ros-pkgs/work/gazebo_ros_pkgs-2.6.7/gazebo_plugins /local/robotpkg/var/tmp/robotpkg/wip/prf-gazebo-ros-pkgs/work/gazebo_ros_pkgs-2.6.7/build /local/robotpkg/var/tmp/robotpkg/wip/prf-gazebo-ros-pkgs/work/gazebo_ros_pkgs-2.6.7/build/gazebo_plugins /local/robotpkg/var/tmp/robotpkg/wip/prf-gazebo-ros-pkgs/work/gazebo_ros_pkgs-2.6.7/build/gazebo_plugins/CMakeFiles/diagnostic_msgs_generate_messages_lisp.dir/DependInfo.cmake --color= make[2]: Entering directory `/local/robotpkg/var/tmp/robotpkg/wip/prf-gazebo-ros-pkgs/work/gazebo_ros_pkgs-2.6.7/build' cd /local/robotpkg/var/tmp/robotpkg/wip/prf-gazebo-ros-pkgs/work/gazebo_ros_pkgs-2.6.7/build && /usr/bin/cmake -E cmake_depends "Unix Makefiles" /local/robotpkg/var/tmp/robotpkg/wip/prf-gazebo-ros-pkgs/work/gazebo_ros_pkgs-2.6.7 /local/robotpkg/var/tmp/robotpkg/wip/prf-gazebo-ros-pkgs/work/gazebo_ros_pkgs-2.6.7/gazebo_plugins /local/robotpkg/var/tmp/robotpkg/wip/prf-gazebo-ros-pkgs/work/gazebo_ros_pkgs-2.6.7/build /local/robotpkg/var/tmp/robotpkg/wip/prf-gazebo-ros-pkgs/work/gazebo_ros_pkgs-2.6.7/build/gazebo_plugins /local/robotpkg/var/tmp/robotpkg/wip/prf-gazebo-ros-pkgs/work/gazebo_ros_pkgs-2.6.7/build/gazebo_plugins/CMakeFiles/diagnostic_msgs_generate_messages_py.dir/DependInfo.cmake --color= [ 1%] Scanning dependencies of target diagnostic_msgs_generate_messages_py make[2]: Leaving directory `/local/robotpkg/var/tmp/robotpkg/wip/prf-gazebo-ros-pkgs/work/gazebo_ros_pkgs-2.6.7/build' Built target diagnostic_msgs_generate_messages_cpp Scanning dependencies of target diagnostic_msgs_generate_messages_lisp make -f gazebo_plugins/CMakeFiles/diagnostic_msgs_generate_messages_py.dir/build.make gazebo_plugins/CMakeFiles/diagnostic_msgs_generate_messages_py.dir/build make[2]: Leaving directory `/local/robotpkg/var/tmp/robotpkg/wip/prf-gazebo-ros-pkgs/work/gazebo_ros_pkgs-2.6.7/build' make -f gazebo_plugins/CMakeFiles/diagnostic_msgs_generate_messages_lisp.dir/build.make gazebo_plugins/CMakeFiles/diagnostic_msgs_generate_messages_lisp.dir/build make[2]: Entering directory `/local/robotpkg/var/tmp/robotpkg/wip/prf-gazebo-ros-pkgs/work/gazebo_ros_pkgs-2.6.7/build' make[2]: Nothing to be done for `gazebo_plugins/CMakeFiles/diagnostic_msgs_generate_messages_py.dir/build'. make[2]: Leaving directory `/local/robotpkg/var/tmp/robotpkg/wip/prf-gazebo-ros-pkgs/work/gazebo_ros_pkgs-2.6.7/build' make[2]: Entering directory `/local/robotpkg/var/tmp/robotpkg/wip/prf-gazebo-ros-pkgs/work/gazebo_ros_pkgs-2.6.7/build' make[2]: Nothing to be done for `gazebo_plugins/CMakeFiles/diagnostic_msgs_generate_messages_lisp.dir/build'. make[2]: Leaving directory `/local/robotpkg/var/tmp/robotpkg/wip/prf-gazebo-ros-pkgs/work/gazebo_ros_pkgs-2.6.7/build' /usr/bin/cmake -E cmake_progress_report /local/robotpkg/var/tmp/robotpkg/wip/prf-gazebo-ros-pkgs/work/gazebo_ros_pkgs-2.6.7/build/CMakeFiles /usr/bin/cmake -E cmake_progress_report /local/robotpkg/var/tmp/robotpkg/wip/prf-gazebo-ros-pkgs/work/gazebo_ros_pkgs-2.6.7/build/CMakeFiles make -f gazebo_plugins/CMakeFiles/gazebo_ros_block_laser.dir/build.make gazebo_plugins/CMakeFiles/gazebo_ros_block_laser.dir/depend [ 1%] [ 1%] make[2]: Entering directory `/local/robotpkg/var/tmp/robotpkg/wip/prf-gazebo-ros-pkgs/work/gazebo_ros_pkgs-2.6.7/build' cd /local/robotpkg/var/tmp/robotpkg/wip/prf-gazebo-ros-pkgs/work/gazebo_ros_pkgs-2.6.7/build && /usr/bin/cmake -E cmake_depends "Unix Makefiles" /local/robotpkg/var/tmp/robotpkg/wip/prf-gazebo-ros-pkgs/work/gazebo_ros_pkgs-2.6.7 /local/robotpkg/var/tmp/robotpkg/wip/prf-gazebo-ros-pkgs/work/gazebo_ros_pkgs-2.6.7/gazebo_plugins /local/robotpkg/var/tmp/robotpkg/wip/prf-gazebo-ros-pkgs/work/gazebo_ros_pkgs-2.6.7/build /local/robotpkg/var/tmp/robotpkg/wip/prf-gazebo-ros-pkgs/work/gazebo_ros_pkgs-2.6.7/build/gazebo_plugins /local/robotpkg/var/tmp/robotpkg/wip/prf-gazebo-ros-pkgs/work/gazebo_ros_pkgs-2.6.7/build/gazebo_plugins/CMakeFiles/gazebo_ros_block_laser.dir/DependInfo.cmake --color= Built target diagnostic_msgs_generate_messages_py make -f gazebo_plugins/CMakeFiles/gazebo_ros_utils.dir/build.make gazebo_plugins/CMakeFiles/gazebo_ros_utils.dir/depend Built target diagnostic_msgs_generate_messages_lisp make[2]: Entering directory `/local/robotpkg/var/tmp/robotpkg/wip/prf-gazebo-ros-pkgs/work/gazebo_ros_pkgs-2.6.7/build' cd /local/robotpkg/var/tmp/robotpkg/wip/prf-gazebo-ros-pkgs/work/gazebo_ros_pkgs-2.6.7/build && /usr/bin/cmake -E cmake_depends "Unix Makefiles" /local/robotpkg/var/tmp/robotpkg/wip/prf-gazebo-ros-pkgs/work/gazebo_ros_pkgs-2.6.7 /local/robotpkg/var/tmp/robotpkg/wip/prf-gazebo-ros-pkgs/work/gazebo_ros_pkgs-2.6.7/gazebo_plugins /local/robotpkg/var/tmp/robotpkg/wip/prf-gazebo-ros-pkgs/work/gazebo_ros_pkgs-2.6.7/build /local/robotpkg/var/tmp/robotpkg/wip/prf-gazebo-ros-pkgs/work/gazebo_ros_pkgs-2.6.7/build/gazebo_plugins /local/robotpkg/var/tmp/robotpkg/wip/prf-gazebo-ros-pkgs/work/gazebo_ros_pkgs-2.6.7/build/gazebo_plugins/CMakeFiles/gazebo_ros_utils.dir/DependInfo.cmake --color= make -f gazebo_plugins/CMakeFiles/gazebo_ros_f3d.dir/build.make gazebo_plugins/CMakeFiles/gazebo_ros_f3d.dir/depend make[2]: Entering directory `/local/robotpkg/var/tmp/robotpkg/wip/prf-gazebo-ros-pkgs/work/gazebo_ros_pkgs-2.6.7/build' cd /local/robotpkg/var/tmp/robotpkg/wip/prf-gazebo-ros-pkgs/work/gazebo_ros_pkgs-2.6.7/build && /usr/bin/cmake -E cmake_depends "Unix Makefiles" /local/robotpkg/var/tmp/robotpkg/wip/prf-gazebo-ros-pkgs/work/gazebo_ros_pkgs-2.6.7 /local/robotpkg/var/tmp/robotpkg/wip/prf-gazebo-ros-pkgs/work/gazebo_ros_pkgs-2.6.7/gazebo_plugins /local/robotpkg/var/tmp/robotpkg/wip/prf-gazebo-ros-pkgs/work/gazebo_ros_pkgs-2.6.7/build /local/robotpkg/var/tmp/robotpkg/wip/prf-gazebo-ros-pkgs/work/gazebo_ros_pkgs-2.6.7/build/gazebo_plugins /local/robotpkg/var/tmp/robotpkg/wip/prf-gazebo-ros-pkgs/work/gazebo_ros_pkgs-2.6.7/build/gazebo_plugins/CMakeFiles/gazebo_ros_f3d.dir/DependInfo.cmake --color= Scanning dependencies of target MultiCameraPlugin make[2]: Leaving directory `/local/robotpkg/var/tmp/robotpkg/wip/prf-gazebo-ros-pkgs/work/gazebo_ros_pkgs-2.6.7/build' make -f gazebo_plugins/CMakeFiles/MultiCameraPlugin.dir/build.make gazebo_plugins/CMakeFiles/MultiCameraPlugin.dir/build make[2]: Entering directory `/local/robotpkg/var/tmp/robotpkg/wip/prf-gazebo-ros-pkgs/work/gazebo_ros_pkgs-2.6.7/build' /usr/bin/cmake -E cmake_progress_report /local/robotpkg/var/tmp/robotpkg/wip/prf-gazebo-ros-pkgs/work/gazebo_ros_pkgs-2.6.7/build/CMakeFiles Scanning dependencies of target gazebo_ros_utils Scanning dependencies of target gazebo_ros_block_laser make[2]: Leaving directory `/local/robotpkg/var/tmp/robotpkg/wip/prf-gazebo-ros-pkgs/work/gazebo_ros_pkgs-2.6.7/build' make -f gazebo_plugins/CMakeFiles/gazebo_ros_utils.dir/build.make gazebo_plugins/CMakeFiles/gazebo_ros_utils.dir/build make[2]: Leaving directory `/local/robotpkg/var/tmp/robotpkg/wip/prf-gazebo-ros-pkgs/work/gazebo_ros_pkgs-2.6.7/build' make -f gazebo_plugins/CMakeFiles/gazebo_ros_block_laser.dir/build.make gazebo_plugins/CMakeFiles/gazebo_ros_block_laser.dir/build [ 1%] make[2]: Entering directory `/local/robotpkg/var/tmp/robotpkg/wip/prf-gazebo-ros-pkgs/work/gazebo_ros_pkgs-2.6.7/build' /usr/bin/cmake -E cmake_progress_report /local/robotpkg/var/tmp/robotpkg/wip/prf-gazebo-ros-pkgs/work/gazebo_ros_pkgs-2.6.7/build/CMakeFiles 94 make[2]: Entering directory `/local/robotpkg/var/tmp/robotpkg/wip/prf-gazebo-ros-pkgs/work/gazebo_ros_pkgs-2.6.7/build' /usr/bin/cmake -E cmake_progress_report /local/robotpkg/var/tmp/robotpkg/wip/prf-gazebo-ros-pkgs/work/gazebo_ros_pkgs-2.6.7/build/CMakeFiles 74 Scanning dependencies of target gazebo_ros_f3d make[2]: Leaving directory `/local/robotpkg/var/tmp/robotpkg/wip/prf-gazebo-ros-pkgs/work/gazebo_ros_pkgs-2.6.7/build' make -f gazebo_plugins/CMakeFiles/gazebo_ros_f3d.dir/build.make gazebo_plugins/CMakeFiles/gazebo_ros_f3d.dir/build [ 2%] Building CXX object gazebo_plugins/CMakeFiles/MultiCameraPlugin.dir/src/MultiCameraPlugin.cpp.o make[2]: Entering directory `/local/robotpkg/var/tmp/robotpkg/wip/prf-gazebo-ros-pkgs/work/gazebo_ros_pkgs-2.6.7/build' /usr/bin/cmake -E cmake_progress_report /local/robotpkg/var/tmp/robotpkg/wip/prf-gazebo-ros-pkgs/work/gazebo_ros_pkgs-2.6.7/build/CMakeFiles 79 [ 3%] cd /local/robotpkg/var/tmp/robotpkg/wip/prf-gazebo-ros-pkgs/work/gazebo_ros_pkgs-2.6.7/build/gazebo_plugins && /usr/bin/g++ -DMultiCameraPlugin_EXPORTS -DROSCONSOLE_BACKEND_LOG4CXX -DROS_BUILD_SHARED_LIBS=1 -DROS_PACKAGE_NAME="gazebo_plugins" -pipe -O3 -DNDEBUG -fPIC -I/local/robotpkg/var/tmp/robotpkg/wip/prf-gazebo-ros-pkgs/work/stage/include -I/local/robotpkg/var/tmp/robotpkg/wip/prf-gazebo-ros-pkgs/work/gazebo_ros_pkgs-2.6.7/gazebo_plugins/include -I/opt/ros/indigo/include -I/usr/include/gazebo-2.2 -I/usr/include/sdformat-1.4 -I/usr/include/opencv -I/usr/include/OGRE -I/usr/include/OGRE/Terrain -I/usr/include/OGRE/Paging -fPIC -o CMakeFiles/MultiCameraPlugin.dir/src/MultiCameraPlugin.cpp.o -c /local/robotpkg/var/tmp/robotpkg/wip/prf-gazebo-ros-pkgs/work/gazebo_ros_pkgs-2.6.7/gazebo_plugins/src/MultiCameraPlugin.cpp Building CXX object gazebo_plugins/CMakeFiles/gazebo_ros_utils.dir/src/gazebo_ros_utils.cpp.o cd /local/robotpkg/var/tmp/robotpkg/wip/prf-gazebo-ros-pkgs/work/gazebo_ros_pkgs-2.6.7/build/gazebo_plugins && /usr/bin/g++ -DROSCONSOLE_BACKEND_LOG4CXX -DROS_BUILD_SHARED_LIBS=1 -DROS_PACKAGE_NAME="gazebo_plugins" -Dgazebo_ros_utils_EXPORTS -pipe -O3 -DNDEBUG -fPIC -I/local/robotpkg/var/tmp/robotpkg/wip/prf-gazebo-ros-pkgs/work/stage/include -I/local/robotpkg/var/tmp/robotpkg/wip/prf-gazebo-ros-pkgs/work/gazebo_ros_pkgs-2.6.7/gazebo_plugins/include -I/opt/ros/indigo/include -I/usr/include/gazebo-2.2 -I/usr/include/sdformat-1.4 -I/usr/include/opencv -I/usr/include/OGRE -I/usr/include/OGRE/Terrain -I/usr/include/OGRE/Paging -fPIC -o CMakeFiles/gazebo_ros_utils.dir/src/gazebo_ros_utils.cpp.o -c /local/robotpkg/var/tmp/robotpkg/wip/prf-gazebo-ros-pkgs/work/gazebo_ros_pkgs-2.6.7/gazebo_plugins/src/gazebo_ros_utils.cpp [ 4%] Building CXX object gazebo_plugins/CMakeFiles/gazebo_ros_block_laser.dir/src/gazebo_ros_block_laser.cpp.o cd /local/robotpkg/var/tmp/robotpkg/wip/prf-gazebo-ros-pkgs/work/gazebo_ros_pkgs-2.6.7/build/gazebo_plugins && /usr/bin/g++ -DROSCONSOLE_BACKEND_LOG4CXX -DROS_BUILD_SHARED_LIBS=1 -DROS_PACKAGE_NAME="gazebo_plugins" -Dgazebo_ros_block_laser_EXPORTS -pipe -O3 -DNDEBUG -fPIC -I/local/robotpkg/var/tmp/robotpkg/wip/prf-gazebo-ros-pkgs/work/stage/include -I/local/robotpkg/var/tmp/robotpkg/wip/prf-gazebo-ros-pkgs/work/gazebo_ros_pkgs-2.6.7/gazebo_plugins/include -I/opt/ros/indigo/include -I/usr/include/gazebo-2.2 -I/usr/include/sdformat-1.4 -I/usr/include/opencv -I/usr/include/OGRE -I/usr/include/OGRE/Terrain -I/usr/include/OGRE/Paging -fPIC -o CMakeFiles/gazebo_ros_block_laser.dir/src/gazebo_ros_block_laser.cpp.o -c /local/robotpkg/var/tmp/robotpkg/wip/prf-gazebo-ros-pkgs/work/gazebo_ros_pkgs-2.6.7/gazebo_plugins/src/gazebo_ros_block_laser.cpp Building CXX object gazebo_plugins/CMakeFiles/gazebo_ros_f3d.dir/src/gazebo_ros_f3d.cpp.o cd /local/robotpkg/var/tmp/robotpkg/wip/prf-gazebo-ros-pkgs/work/gazebo_ros_pkgs-2.6.7/build/gazebo_plugins && /usr/bin/g++ -DROSCONSOLE_BACKEND_LOG4CXX -DROS_BUILD_SHARED_LIBS=1 -DROS_PACKAGE_NAME="gazebo_plugins" -Dgazebo_ros_f3d_EXPORTS -pipe -O3 -DNDEBUG -fPIC -I/local/robotpkg/var/tmp/robotpkg/wip/prf-gazebo-ros-pkgs/work/stage/include -I/local/robotpkg/var/tmp/robotpkg/wip/prf-gazebo-ros-pkgs/work/gazebo_ros_pkgs-2.6.7/gazebo_plugins/include -I/opt/ros/indigo/include -I/usr/include/gazebo-2.2 -I/usr/include/sdformat-1.4 -I/usr/include/opencv -I/usr/include/OGRE -I/usr/include/OGRE/Terrain -I/usr/include/OGRE/Paging -fPIC -o CMakeFiles/gazebo_ros_f3d.dir/src/gazebo_ros_f3d.cpp.o -c /local/robotpkg/var/tmp/robotpkg/wip/prf-gazebo-ros-pkgs/work/gazebo_ros_pkgs-2.6.7/gazebo_plugins/src/gazebo_ros_f3d.cpp In file included from /local/robotpkg/var/tmp/robotpkg/wip/prf-gazebo-ros-pkgs/work/gazebo_ros_pkgs-2.6.7/gazebo_plugins/src/gazebo_ros_utils.cpp:35:0: /local/robotpkg/var/tmp/robotpkg/wip/prf-gazebo-ros-pkgs/work/gazebo_ros_pkgs-2.6.7/gazebo_plugins/include/gazebo_plugins/gazebo_ros_utils.h: In function 'std::string gazebo::GetModelName(const SensorPtr&)': /local/robotpkg/var/tmp/robotpkg/wip/prf-gazebo-ros-pkgs/work/gazebo_ros_pkgs-2.6.7/gazebo_plugins/include/gazebo_plugins/gazebo_ros_utils.h:61:38: error: 'class gazebo::sensors::Sensor' has no member named 'ScopedName' std::string scopedName = parent->ScopedName(); ^ /local/robotpkg/var/tmp/robotpkg/wip/prf-gazebo-ros-pkgs/work/gazebo_ros_pkgs-2.6.7/gazebo_plugins/src/gazebo_ros_f3d.cpp: In member function 'virtual void gazebo::GazeboRosF3D::UpdateChild()': /local/robotpkg/var/tmp/robotpkg/wip/prf-gazebo-ros-pkgs/work/gazebo_ros_pkgs-2.6.7/gazebo_plugins/src/gazebo_ros_f3d.cpp:152:3: error: 'ignition' has not been declared ignition::math::Vector3d torque; ^ /local/robotpkg/var/tmp/robotpkg/wip/prf-gazebo-ros-pkgs/work/gazebo_ros_pkgs-2.6.7/gazebo_plugins/src/gazebo_ros_f3d.cpp:152:28: error: expected ';' before 'torque' ignition::math::Vector3d torque; ^ /local/robotpkg/var/tmp/robotpkg/wip/prf-gazebo-ros-pkgs/work/gazebo_ros_pkgs-2.6.7/gazebo_plugins/src/gazebo_ros_f3d.cpp:153:3: error: 'ignition' has not been declared ignition::math::Vector3d force; ^ /local/robotpkg/var/tmp/robotpkg/wip/prf-gazebo-ros-pkgs/work/gazebo_ros_pkgs-2.6.7/gazebo_plugins/src/gazebo_ros_f3d.cpp:153:28: error: expected ';' before 'force' ignition::math::Vector3d force; ^ /local/robotpkg/var/tmp/robotpkg/wip/prf-gazebo-ros-pkgs/work/gazebo_ros_pkgs-2.6.7/gazebo_plugins/src/gazebo_ros_f3d.cpp:160:3: error: 'force' was not declared in this scope force = this->link_->GetWorldForce().Ign(); ^ /local/robotpkg/var/tmp/robotpkg/wip/prf-gazebo-ros-pkgs/work/gazebo_ros_pkgs-2.6.7/gazebo_plugins/src/gazebo_ros_f3d.cpp:160:40: error: 'class gazebo::math::Vector3' has no member named 'Ign' force = this->link_->GetWorldForce().Ign(); ^ /local/robotpkg/var/tmp/robotpkg/wip/prf-gazebo-ros-pkgs/work/gazebo_ros_pkgs-2.6.7/gazebo_plugins/src/gazebo_ros_f3d.cpp:161:3: error: 'torque' was not declared in this scope torque = this->link_->GetWorldTorque().Ign(); ^ /local/robotpkg/var/tmp/robotpkg/wip/prf-gazebo-ros-pkgs/work/gazebo_ros_pkgs-2.6.7/gazebo_plugins/src/gazebo_ros_f3d.cpp:161:42: error: 'class gazebo::math::Vector3' has no member named 'Ign' torque = this->link_->GetWorldTorque().Ign(); ^ make[2]: *** [gazebo_plugins/CMakeFiles/gazebo_ros_f3d.dir/src/gazebo_ros_f3d.cpp.o] Error 1 make[2]: Leaving directory `/local/robotpkg/var/tmp/robotpkg/wip/prf-gazebo-ros-pkgs/work/gazebo_ros_pkgs-2.6.7/build' make[1]: *** [gazebo_plugins/CMakeFiles/gazebo_ros_f3d.dir/all] Error 2 make[1]: *** Waiting for unfinished jobs.... make[2]: *** [gazebo_plugins/CMakeFiles/gazebo_ros_utils.dir/src/gazebo_ros_utils.cpp.o] Error 1 make[2]: Leaving directory `/local/robotpkg/var/tmp/robotpkg/wip/prf-gazebo-ros-pkgs/work/gazebo_ros_pkgs-2.6.7/build' make[1]: *** [gazebo_plugins/CMakeFiles/gazebo_ros_utils.dir/all] Error 2 In file included from /local/robotpkg/var/tmp/robotpkg/wip/prf-gazebo-ros-pkgs/work/gazebo_ros_pkgs-2.6.7/gazebo_plugins/src/MultiCameraPlugin.cpp:20:0: /local/robotpkg/var/tmp/robotpkg/wip/prf-gazebo-ros-pkgs/work/gazebo_ros_pkgs-2.6.7/gazebo_plugins/include/gazebo_plugins/gazebo_ros_utils.h: In function 'std::string gazebo::GetModelName(const SensorPtr&)': /local/robotpkg/var/tmp/robotpkg/wip/prf-gazebo-ros-pkgs/work/gazebo_ros_pkgs-2.6.7/gazebo_plugins/include/gazebo_plugins/gazebo_ros_utils.h:61:38: error: 'class gazebo::sensors::Sensor' has no member named 'ScopedName' std::string scopedName = parent->ScopedName(); ^ In file included from /local/robotpkg/var/tmp/robotpkg/wip/prf-gazebo-ros-pkgs/work/gazebo_ros_pkgs-2.6.7/gazebo_plugins/src/MultiCameraPlugin.cpp:20:0: /local/robotpkg/var/tmp/robotpkg/wip/prf-gazebo-ros-pkgs/work/gazebo_ros_pkgs-2.6.7/gazebo_plugins/src/MultiCameraPlugin.cpp: In member function 'virtual void gazebo::MultiCameraPlugin::Load(gazebo::sensors::SensorPtr, sdf::ElementPtr)': /local/robotpkg/var/tmp/robotpkg/wip/prf-gazebo-ros-pkgs/work/gazebo_ros_pkgs-2.6.7/gazebo_plugins/include/gazebo_plugins/gazebo_ros_utils.h:46:62: error: 'std::dynamic_pointer_cast' has not been declared #define GAZEBO_SENSORS_USING_DYNAMIC_POINTER_CAST using std::dynamic_pointer_cast ^ /local/robotpkg/var/tmp/robotpkg/wip/prf-gazebo-ros-pkgs/work/gazebo_ros_pkgs-2.6.7/gazebo_plugins/src/MultiCameraPlugin.cpp:44:3: note: in expansion of macro 'GAZEBO_SENSORS_USING_DYNAMIC_POINTER_CAST' GAZEBO_SENSORS_USING_DYNAMIC_POINTER_CAST; ^ /local/robotpkg/var/tmp/robotpkg/wip/prf-gazebo-ros-pkgs/work/gazebo_ros_pkgs-2.6.7/gazebo_plugins/src/MultiCameraPlugin.cpp:46:5: error: 'dynamic_pointer_cast' was not declared in this scope dynamic_pointer_cast(_sensor); ^ /local/robotpkg/var/tmp/robotpkg/wip/prf-gazebo-ros-pkgs/work/gazebo_ros_pkgs-2.6.7/gazebo_plugins/src/MultiCameraPlugin.cpp:46:5: note: suggested alternative: In file included from /usr/include/boost/smart_ptr/weak_ptr.hpp:18:0, from /usr/include/boost/smart_ptr/enable_shared_from_this.hpp:16, from /usr/include/boost/enable_shared_from_this.hpp:16, from /usr/include/gazebo-2.2/gazebo/sensors/Sensor.hh:25, from /usr/include/gazebo-2.2/gazebo/sensors/DepthCameraSensor.hh:27, from /local/robotpkg/var/tmp/robotpkg/wip/prf-gazebo-ros-pkgs/work/gazebo_ros_pkgs-2.6.7/gazebo_plugins/src/MultiCameraPlugin.cpp:17: /usr/include/boost/smart_ptr/shared_ptr.hpp:808:42: note: 'boost::dynamic_pointer_cast' template shared_ptr dynamic_pointer_cast( shared_ptr const & r ) BOOST_NOEXCEPT ^ /local/robotpkg/var/tmp/robotpkg/wip/prf-gazebo-ros-pkgs/work/gazebo_ros_pkgs-2.6.7/gazebo_plugins/src/MultiCameraPlugin.cpp:46:52: error: expected primary-expression before '>' token dynamic_pointer_cast(_sensor); ^ /local/robotpkg/var/tmp/robotpkg/wip/prf-gazebo-ros-pkgs/work/gazebo_ros_pkgs-2.6.7/gazebo_plugins/src/MultiCameraPlugin.cpp:51:56: error: expected primary-expression before '>' token if (dynamic_pointer_cast(_sensor)) ^ /local/robotpkg/var/tmp/robotpkg/wip/prf-gazebo-ros-pkgs/work/gazebo_ros_pkgs-2.6.7/gazebo_plugins/src/MultiCameraPlugin.cpp:53:51: error: expected primary-expression before '>' token if (dynamic_pointer_cast(_sensor)) ^ /local/robotpkg/var/tmp/robotpkg/wip/prf-gazebo-ros-pkgs/work/gazebo_ros_pkgs-2.6.7/gazebo_plugins/src/MultiCameraPlugin.cpp:63:52: error: 'class gazebo::sensors::MultiCameraSensor' has no member named 'CameraCount' for (unsigned int i = 0; i < this->parentSensor->CameraCount(); ++i) ^ /local/robotpkg/var/tmp/robotpkg/wip/prf-gazebo-ros-pkgs/work/gazebo_ros_pkgs-2.6.7/gazebo_plugins/src/MultiCameraPlugin.cpp:65:48: error: 'class gazebo::sensors::MultiCameraSensor' has no member named 'Camera' this->camera.push_back(this->parentSensor->Camera(i)); ^ /local/robotpkg/var/tmp/robotpkg/wip/prf-gazebo-ros-pkgs/work/gazebo_ros_pkgs-2.6.7/gazebo_plugins/src/MultiCameraPlugin.cpp:68:44: error: 'class gazebo::rendering::Camera' has no member named 'ImageWidth' this->width.push_back(this->camera[i]->ImageWidth()); ^ /local/robotpkg/var/tmp/robotpkg/wip/prf-gazebo-ros-pkgs/work/gazebo_ros_pkgs-2.6.7/gazebo_plugins/src/MultiCameraPlugin.cpp:69:45: error: 'class gazebo::rendering::Camera' has no member named 'ImageHeight' this->height.push_back(this->camera[i]->ImageHeight()); ^ /local/robotpkg/var/tmp/robotpkg/wip/prf-gazebo-ros-pkgs/work/gazebo_ros_pkgs-2.6.7/gazebo_plugins/src/MultiCameraPlugin.cpp:70:44: error: 'class gazebo::rendering::Camera' has no member named 'ImageDepth' this->depth.push_back(this->camera[i]->ImageDepth()); ^ /local/robotpkg/var/tmp/robotpkg/wip/prf-gazebo-ros-pkgs/work/gazebo_ros_pkgs-2.6.7/gazebo_plugins/src/MultiCameraPlugin.cpp:71:45: error: 'class gazebo::rendering::Camera' has no member named 'ImageFormat' this->format.push_back(this->camera[i]->ImageFormat()); ^ /local/robotpkg/var/tmp/robotpkg/wip/prf-gazebo-ros-pkgs/work/gazebo_ros_pkgs-2.6.7/gazebo_plugins/src/MultiCameraPlugin.cpp:73:50: error: 'class gazebo::sensors::MultiCameraSensor' has no member named 'Camera' std::string cameraName = this->parentSensor->Camera(i)->Name(); ^ In file included from /local/robotpkg/var/tmp/robotpkg/wip/prf-gazebo-ros-pkgs/work/gazebo_ros_pkgs-2.6.7/gazebo_plugins/src/gazebo_ros_block_laser.cpp:27:0: /local/robotpkg/var/tmp/robotpkg/wip/prf-gazebo-ros-pkgs/work/gazebo_ros_pkgs-2.6.7/gazebo_plugins/include/gazebo_plugins/gazebo_ros_utils.h: In function 'std::string gazebo::GetModelName(const SensorPtr&)': /local/robotpkg/var/tmp/robotpkg/wip/prf-gazebo-ros-pkgs/work/gazebo_ros_pkgs-2.6.7/gazebo_plugins/include/gazebo_plugins/gazebo_ros_utils.h:61:38: error: 'class gazebo::sensors::Sensor' has no member named 'ScopedName' std::string scopedName = parent->ScopedName(); ^ make[2]: *** [gazebo_plugins/CMakeFiles/MultiCameraPlugin.dir/src/MultiCameraPlugin.cpp.o] Error 1 make[1]: *** [gazebo_plugins/CMakeFiles/MultiCameraPlugin.dir/all] Error 2 make[2]: Leaving directory `/local/robotpkg/var/tmp/robotpkg/wip/prf-gazebo-ros-pkgs/work/gazebo_ros_pkgs-2.6.7/build' /local/robotpkg/var/tmp/robotpkg/wip/prf-gazebo-ros-pkgs/work/gazebo_ros_pkgs-2.6.7/gazebo_plugins/src/gazebo_ros_block_laser.cpp: In member function 'virtual void gazebo::GazeboRosBlockLaser::Load(gazebo::sensors::SensorPtr, sdf::ElementPtr)': /local/robotpkg/var/tmp/robotpkg/wip/prf-gazebo-ros-pkgs/work/gazebo_ros_pkgs-2.6.7/gazebo_plugins/src/gazebo_ros_block_laser.cpp:82:36: error: 'class gazebo::sensors::Sensor' has no member named 'WorldName' std::string worldName = _parent->WorldName(); ^ In file included from /local/robotpkg/var/tmp/robotpkg/wip/prf-gazebo-ros-pkgs/work/gazebo_ros_pkgs-2.6.7/gazebo_plugins/src/gazebo_ros_block_laser.cpp:27:0: /local/robotpkg/var/tmp/robotpkg/wip/prf-gazebo-ros-pkgs/work/gazebo_ros_pkgs-2.6.7/gazebo_plugins/include/gazebo_plugins/gazebo_ros_utils.h:46:62: error: 'std::dynamic_pointer_cast' has not been declared #define GAZEBO_SENSORS_USING_DYNAMIC_POINTER_CAST using std::dynamic_pointer_cast ^ /local/robotpkg/var/tmp/robotpkg/wip/prf-gazebo-ros-pkgs/work/gazebo_ros_pkgs-2.6.7/gazebo_plugins/src/gazebo_ros_block_laser.cpp:90:3: note: in expansion of macro 'GAZEBO_SENSORS_USING_DYNAMIC_POINTER_CAST' GAZEBO_SENSORS_USING_DYNAMIC_POINTER_CAST; ^ /local/robotpkg/var/tmp/robotpkg/wip/prf-gazebo-ros-pkgs/work/gazebo_ros_pkgs-2.6.7/gazebo_plugins/src/gazebo_ros_block_laser.cpp:91:30: error: 'dynamic_pointer_cast' was not declared in this scope this->parent_ray_sensor_ = dynamic_pointer_cast(this->parent_sensor_); ^ /local/robotpkg/var/tmp/robotpkg/wip/prf-gazebo-ros-pkgs/work/gazebo_ros_pkgs-2.6.7/gazebo_plugins/src/gazebo_ros_block_laser.cpp:91:30: note: suggested alternative: In file included from /usr/include/boost/shared_ptr.hpp:17:0, from /usr/include/boost/format/alt_sstream.hpp:21, from /usr/include/boost/format/internals.hpp:23, from /usr/include/boost/format.hpp:38, from /usr/include/boost/math/policies/error_handling.hpp:31, from /usr/include/boost/math/special_functions/round.hpp:14, from /opt/ros/indigo/include/ros/time.h:58, from /opt/ros/indigo/include/ros/ros.h:38, from /local/robotpkg/var/tmp/robotpkg/wip/prf-gazebo-ros-pkgs/work/gazebo_ros_pkgs-2.6.7/gazebo_plugins/include/gazebo_plugins/gazebo_ros_block_laser.h:27, from /local/robotpkg/var/tmp/robotpkg/wip/prf-gazebo-ros-pkgs/work/gazebo_ros_pkgs-2.6.7/gazebo_plugins/src/gazebo_ros_block_laser.cpp:26: /usr/include/boost/smart_ptr/shared_ptr.hpp:808:42: note: 'boost::dynamic_pointer_cast' template shared_ptr dynamic_pointer_cast( shared_ptr const & r ) BOOST_NOEXCEPT ^ /local/robotpkg/var/tmp/robotpkg/wip/prf-gazebo-ros-pkgs/work/gazebo_ros_pkgs-2.6.7/gazebo_plugins/src/gazebo_ros_block_laser.cpp:91:69: error: expected primary-expression before '>' token this->parent_ray_sensor_ = dynamic_pointer_cast(this->parent_sensor_); ^ /local/robotpkg/var/tmp/robotpkg/wip/prf-gazebo-ros-pkgs/work/gazebo_ros_pkgs-2.6.7/gazebo_plugins/src/gazebo_ros_block_laser.cpp: In member function 'virtual void gazebo::GazeboRosBlockLaser::OnNewLaserScans()': /local/robotpkg/var/tmp/robotpkg/wip/prf-gazebo-ros-pkgs/work/gazebo_ros_pkgs-2.6.7/gazebo_plugins/src/gazebo_ros_block_laser.cpp:209:61: error: 'class gazebo::sensors::Sensor' has no member named 'LastUpdateTime' common::Time sensor_update_time = this->parent_sensor_->LastUpdateTime(); ^ /local/robotpkg/var/tmp/robotpkg/wip/prf-gazebo-ros-pkgs/work/gazebo_ros_pkgs-2.6.7/gazebo_plugins/src/gazebo_ros_block_laser.cpp: In member function 'void gazebo::GazeboRosBlockLaser::PutLaserData(gazebo::common::Time&)': /local/robotpkg/var/tmp/robotpkg/wip/prf-gazebo-ros-pkgs/work/gazebo_ros_pkgs-2.6.7/gazebo_plugins/src/gazebo_ros_block_laser.cpp:235:8: error: 'maxAngle' does not name a type auto maxAngle = this->parent_ray_sensor_->AngleMax(); ^ /local/robotpkg/var/tmp/robotpkg/wip/prf-gazebo-ros-pkgs/work/gazebo_ros_pkgs-2.6.7/gazebo_plugins/src/gazebo_ros_block_laser.cpp:236:8: error: 'minAngle' does not name a type auto minAngle = this->parent_ray_sensor_->AngleMin(); ^ /local/robotpkg/var/tmp/robotpkg/wip/prf-gazebo-ros-pkgs/work/gazebo_ros_pkgs-2.6.7/gazebo_plugins/src/gazebo_ros_block_laser.cpp:238:47: error: 'class gazebo::sensors::RaySensor' has no member named 'RangeMax' double maxRange = this->parent_ray_sensor_->RangeMax(); ^ /local/robotpkg/var/tmp/robotpkg/wip/prf-gazebo-ros-pkgs/work/gazebo_ros_pkgs-2.6.7/gazebo_plugins/src/gazebo_ros_block_laser.cpp:239:47: error: 'class gazebo::sensors::RaySensor' has no member named 'RangeMin' double minRange = this->parent_ray_sensor_->RangeMin(); ^ /local/robotpkg/var/tmp/robotpkg/wip/prf-gazebo-ros-pkgs/work/gazebo_ros_pkgs-2.6.7/gazebo_plugins/src/gazebo_ros_block_laser.cpp:240:44: error: 'class gazebo::sensors::RaySensor' has no member named 'RayCount' int rayCount = this->parent_ray_sensor_->RayCount(); ^ /local/robotpkg/var/tmp/robotpkg/wip/prf-gazebo-ros-pkgs/work/gazebo_ros_pkgs-2.6.7/gazebo_plugins/src/gazebo_ros_block_laser.cpp:241:46: error: 'class gazebo::sensors::RaySensor' has no member named 'RangeCount' int rangeCount = this->parent_ray_sensor_->RangeCount(); ^ /local/robotpkg/var/tmp/robotpkg/wip/prf-gazebo-ros-pkgs/work/gazebo_ros_pkgs-2.6.7/gazebo_plugins/src/gazebo_ros_block_laser.cpp:243:52: error: 'class gazebo::sensors::RaySensor' has no member named 'VerticalRayCount' int verticalRayCount = this->parent_ray_sensor_->VerticalRayCount(); ^ /local/robotpkg/var/tmp/robotpkg/wip/prf-gazebo-ros-pkgs/work/gazebo_ros_pkgs-2.6.7/gazebo_plugins/src/gazebo_ros_block_laser.cpp:244:54: error: 'class gazebo::sensors::RaySensor' has no member named 'VerticalRangeCount' int verticalRangeCount = this->parent_ray_sensor_->VerticalRangeCount(); ^ /local/robotpkg/var/tmp/robotpkg/wip/prf-gazebo-ros-pkgs/work/gazebo_ros_pkgs-2.6.7/gazebo_plugins/src/gazebo_ros_block_laser.cpp:245:8: error: 'verticalMaxAngle' does not name a type auto verticalMaxAngle = this->parent_ray_sensor_->VerticalAngleMax(); ^ /local/robotpkg/var/tmp/robotpkg/wip/prf-gazebo-ros-pkgs/work/gazebo_ros_pkgs-2.6.7/gazebo_plugins/src/gazebo_ros_block_laser.cpp:246:8: error: 'verticalMinAngle' does not name a type auto verticalMinAngle = this->parent_ray_sensor_->VerticalAngleMin(); ^ /local/robotpkg/var/tmp/robotpkg/wip/prf-gazebo-ros-pkgs/work/gazebo_ros_pkgs-2.6.7/gazebo_plugins/src/gazebo_ros_block_laser.cpp:248:18: error: 'maxAngle' was not declared in this scope double yDiff = maxAngle.Radian() - minAngle.Radian(); ^ /local/robotpkg/var/tmp/robotpkg/wip/prf-gazebo-ros-pkgs/work/gazebo_ros_pkgs-2.6.7/gazebo_plugins/src/gazebo_ros_block_laser.cpp:248:38: error: 'minAngle' was not declared in this scope double yDiff = maxAngle.Radian() - minAngle.Radian(); ^ /local/robotpkg/var/tmp/robotpkg/wip/prf-gazebo-ros-pkgs/work/gazebo_ros_pkgs-2.6.7/gazebo_plugins/src/gazebo_ros_block_laser.cpp:249:18: error: 'verticalMaxAngle' was not declared in this scope double pDiff = verticalMaxAngle.Radian() - verticalMinAngle.Radian(); ^ /local/robotpkg/var/tmp/robotpkg/wip/prf-gazebo-ros-pkgs/work/gazebo_ros_pkgs-2.6.7/gazebo_plugins/src/gazebo_ros_block_laser.cpp:249:46: error: 'verticalMinAngle' was not declared in this scope double pDiff = verticalMaxAngle.Radian() - verticalMinAngle.Radian(); ^ /local/robotpkg/var/tmp/robotpkg/wip/prf-gazebo-ros-pkgs/work/gazebo_ros_pkgs-2.6.7/gazebo_plugins/src/gazebo_ros_block_laser.cpp:297:47: error: 'class gazebo::sensors::RaySensor' has no member named 'LaserShape' r1 = std::min(this->parent_ray_sensor_->LaserShape()->GetRange(j1) , maxRange-minRange); ^ /local/robotpkg/var/tmp/robotpkg/wip/prf-gazebo-ros-pkgs/work/gazebo_ros_pkgs-2.6.7/gazebo_plugins/src/gazebo_ros_block_laser.cpp:298:47: error: 'class gazebo::sensors::RaySensor' has no member named 'LaserShape' r2 = std::min(this->parent_ray_sensor_->LaserShape()->GetRange(j2) , maxRange-minRange); ^ /local/robotpkg/var/tmp/robotpkg/wip/prf-gazebo-ros-pkgs/work/gazebo_ros_pkgs-2.6.7/gazebo_plugins/src/gazebo_ros_block_laser.cpp:299:47: error: 'class gazebo::sensors::RaySensor' has no member named 'LaserShape' r3 = std::min(this->parent_ray_sensor_->LaserShape()->GetRange(j3) , maxRange-minRange); ^ /local/robotpkg/var/tmp/robotpkg/wip/prf-gazebo-ros-pkgs/work/gazebo_ros_pkgs-2.6.7/gazebo_plugins/src/gazebo_ros_block_laser.cpp:300:47: error: 'class gazebo::sensors::RaySensor' has no member named 'LaserShape' r4 = std::min(this->parent_ray_sensor_->LaserShape()->GetRange(j4) , maxRange-minRange); ^ /local/robotpkg/var/tmp/robotpkg/wip/prf-gazebo-ros-pkgs/work/gazebo_ros_pkgs-2.6.7/gazebo_plugins/src/gazebo_ros_block_laser.cpp:308:51: error: 'class gazebo::sensors::RaySensor' has no member named 'LaserShape' intensity = 0.25*(this->parent_ray_sensor_->LaserShape()->GetRetro(j1) + ^ /local/robotpkg/var/tmp/robotpkg/wip/prf-gazebo-ros-pkgs/work/gazebo_ros_pkgs-2.6.7/gazebo_plugins/src/gazebo_ros_block_laser.cpp:309:51: error: 'class gazebo::sensors::RaySensor' has no member named 'LaserShape' this->parent_ray_sensor_->LaserShape()->GetRetro(j2) + ^ /local/robotpkg/var/tmp/robotpkg/wip/prf-gazebo-ros-pkgs/work/gazebo_ros_pkgs-2.6.7/gazebo_plugins/src/gazebo_ros_block_laser.cpp:310:51: error: 'class gazebo::sensors::RaySensor' has no member named 'LaserShape' this->parent_ray_sensor_->LaserShape()->GetRetro(j3) + ^ /local/robotpkg/var/tmp/robotpkg/wip/prf-gazebo-ros-pkgs/work/gazebo_ros_pkgs-2.6.7/gazebo_plugins/src/gazebo_ros_block_laser.cpp:311:51: error: 'class gazebo::sensors::RaySensor' has no member named 'LaserShape' this->parent_ray_sensor_->LaserShape()->GetRetro(j4)); ^ /local/robotpkg/var/tmp/robotpkg/wip/prf-gazebo-ros-pkgs/work/gazebo_ros_pkgs-2.6.7/gazebo_plugins/src/gazebo_ros_block_laser.cpp: In member function 'void gazebo::GazeboRosBlockLaser::OnStats(const boost::shared_ptr&)': /local/robotpkg/var/tmp/robotpkg/wip/prf-gazebo-ros-pkgs/work/gazebo_ros_pkgs-2.6.7/gazebo_plugins/src/gazebo_ros_block_laser.cpp:398:3: error: 'ignition' has not been declared ignition::math::Pose3d pose; ^ /local/robotpkg/var/tmp/robotpkg/wip/prf-gazebo-ros-pkgs/work/gazebo_ros_pkgs-2.6.7/gazebo_plugins/src/gazebo_ros_block_laser.cpp:398:26: error: expected ';' before 'pose' ignition::math::Pose3d pose; ^ /local/robotpkg/var/tmp/robotpkg/wip/prf-gazebo-ros-pkgs/work/gazebo_ros_pkgs-2.6.7/gazebo_plugins/src/gazebo_ros_block_laser.cpp:399:3: error: 'pose' was not declared in this scope pose.Pos().X() = 0.5*sin(0.01*this->sim_time_.Double()); ^ make[2]: *** [gazebo_plugins/CMakeFiles/gazebo_ros_block_laser.dir/src/gazebo_ros_block_laser.cpp.o] Error 1 make[1]: *** [gazebo_plugins/CMakeFiles/gazebo_ros_block_laser.dir/all] Error 2 make[2]: Leaving directory `/local/robotpkg/var/tmp/robotpkg/wip/prf-gazebo-ros-pkgs/work/gazebo_ros_pkgs-2.6.7/build' make[1]: Leaving directory `/local/robotpkg/var/tmp/robotpkg/wip/prf-gazebo-ros-pkgs/work/gazebo_ros_pkgs-2.6.7/build' make: *** [all] Error 2