robotpkg/wip/prf-gazebo-ros-pkgs bulk build results

Log for prf-gazebo-ros-pkgs-2.6.7r4 on Ubuntu-12.04-x86_64: bulk.log (Back)

=> Checking for clear installation ===> Installing bootstrap dependencies for prf-gazebo-ros-pkgs-2.6.7r4 => Installing /opt/robotpkg/var/lib/robotpkg/packages/bsd/Ubuntu-12.04-x86_64/All/digest-20080510.tgz => Installing /opt/robotpkg/var/lib/robotpkg/packages/bsd/Ubuntu-12.04-x86_64/All/tnftp-20130505~ssl.tgz ===> Checking bootstrap dependencies for prf-gazebo-ros-pkgs-2.6.7r4 => Required robotpkg package digest>=20080510: digest-20080510 found => Required robotpkg package tnftp>=20130505~ssl: tnftp-20130505~ssl found => Required system package gnupg>=1: gnupg-1.4.11 found => Required system package gzip: gzip-1.4 found => Required system package pax and tar archivers: pax found => Required system package pkg_install>=20110805.9: pkg_install-20110805.9 found => Required system package pkgrepo2deb>=1.4: pkgrepo2deb-1.4 found ===> Done bootstrap-depends for prf-gazebo-ros-pkgs-2.6.7r4 ===> Installing full dependencies for prf-gazebo-ros-pkgs-2.6.7r4 => Dependency digest-20080510 already installed => Installing /opt/robotpkg/var/lib/robotpkg/wip/packages/bsd/Ubuntu-12.04-x86_64/All/prf-ros-control-0.2.6r3.tgz => Dependency tnftp-20130505~ssl already installed ===> Checking build options for prf-gazebo-ros-pkgs-2.6.7r4 => Building with no option. ===> Checking alternatives for prf-gazebo-ros-pkgs-2.6.7r4 => Use the GNU C++ compiler: c++-compiler provided by g++>=3 => Use the GNU C compiler: c-compiler provided by gcc>=3 => Use python-2.7: python>=2.5<3.7 provided by python27>=2.7<2.8 => Use ros hydro: ros>=groovy ros>=hydro provided by ros-hydro ===> Checking dependencies for prf-gazebo-ros-pkgs-2.6.7r4 => Required system package boost-headers>=1.34.1: boost-headers-1.46.1 found => Required system package boostlib-filesystem>=1.34.1: boost-libs-1.46.1 found => Required system package boostlib-iostreams>=1.34.1: boost-libs-1.46.1 found => Required system package boostlib-math>=1.34.1: boost-libs-1.46.1 found => Required system package boostlib-thread>=1.34.1: boost-libs-1.46.1 found => Required system package cmake>=2.8.3: cmake-2.8.7 found => Required system package eigen3>=3.0.0: eigen3-3.0.5 found => Required system package g++>=3: g++-4.6 found => Required system package gazebo>=1: gazebo-1.9.6 found => Required system package gcc>=3: gcc-4.6 found => Required system package googletest: googletest found => Required system package libogre>=1.0: libogre-1.7.4 found => Required system package libstdc++: libstdc++ found => Required system package pkg-config>=0.22: pkg-config-0.26 found => Required system package py27-empy>=3: py27-empy-3.3 found => Required system package py27-nose>=0.10: py27-nose-1.1.2 found => Required system package python27>=2.7<2.8: python27-2.7.3 found => Required system package ros-actionlib>=1.10<1.11: ros-actionlib-1.10.3 found => Required system package ros-catkin>=0.5<0.6: ros-catkin-0.5.90 found => Required system package ros-class-loader>=0.2<0.3: ros-class-loader-0.2.5 found => Required system package ros-comm>=1.10<1.11: ros-comm-1.10.12 found => Required system package ros-common-msgs>=1.10<1.11: ros-common-msgs-1.10.6 found => Required system package ros-control-toolbox>=1.10<1.13: ros-control-toolbox-1.10.4 found => Required system package ros-genmsg>=0.4<0.5: ros-genmsg-0.4.26 found => Required system package ros-geometry>=1.10<1.11: ros-geometry-1.10.8 found => Required system package ros-message-generation>=0.2<0.3: ros-message-generation-0.2.10 found => Required system package ros-message-runtime>=0.4<0.5: ros-message-runtime-0.4.12 found => Required system package ros-pluginlib>=1.9<1.10: ros-pluginlib-1.9.24 found => Required system package ros-ros>=1.10<1.11: ros-ros-1.10.11 found => Required system package ros-std-msgs>=0.5: ros-std-msgs-0.5.8 found => Required system package ros-urdf>=1.10<1.11: ros-urdf-1.10.21 found => Required robotpkg package prf-ros-control>=0.2: prf-ros-control-0.2.6r3 found ===> Done depends for prf-gazebo-ros-pkgs-2.6.7r4 ===> Extracting for prf-gazebo-ros-pkgs-2.6.7r4 => SHA1 checksums OK => RMD160 checksums OK ===> Configuring for prf-gazebo-ros-pkgs-2.6.7r4 CMake Warning at /opt/ros/hydro/share/genmsg/cmake/genmsg-extras.cmake:43 (message): Unknown message generator specified in ROS_LANG_DISABLE: geneus Call Stack (most recent call first): /opt/ros/hydro/share/genmsg/cmake/genmsgConfig.cmake:190 (include) /opt/ros/hydro/share/gencpp/cmake/gencppConfig.cmake:165 (find_package) /opt/ros/hydro/share/message_generation/cmake/message_generationConfig.cmake:165 (find_package) /opt/ros/hydro/share/catkin/cmake/catkinConfig.cmake:75 (find_package) gazebo_msgs/CMakeLists.txt:4 (find_package) CMake Warning at /opt/ros/hydro/share/genmsg/cmake/genmsg-extras.cmake:43 (message): Unknown message generator specified in ROS_LANG_DISABLE: gennodejs Call Stack (most recent call first): /opt/ros/hydro/share/genmsg/cmake/genmsgConfig.cmake:190 (include) /opt/ros/hydro/share/gencpp/cmake/gencppConfig.cmake:165 (find_package) /opt/ros/hydro/share/message_generation/cmake/message_generationConfig.cmake:165 (find_package) /opt/ros/hydro/share/catkin/cmake/catkinConfig.cmake:75 (find_package) gazebo_msgs/CMakeLists.txt:4 (find_package) CMake Warning at /opt/ros/hydro/share/genmsg/cmake/genmsg-extras.cmake:43 (message): Unknown message generator specified in ROS_LANG_DISABLE: geneus Call Stack (most recent call first): /opt/ros/hydro/share/genmsg/cmake/genmsgConfig.cmake:190 (include) /opt/ros/hydro/share/actionlib_msgs/cmake/actionlib_msgs-extras.cmake:2 (find_package) /opt/ros/hydro/share/actionlib_msgs/cmake/actionlib_msgsConfig.cmake:190 (include) /opt/ros/hydro/share/actionlib/cmake/actionlibConfig.cmake:165 (find_package) /opt/ros/hydro/share/tf2_ros/cmake/tf2_rosConfig.cmake:165 (find_package) /opt/ros/hydro/share/tf/cmake/tfConfig.cmake:165 (find_package) /opt/ros/hydro/share/catkin/cmake/catkinConfig.cmake:75 (find_package) gazebo_ros/CMakeLists.txt:4 (find_package) CMake Warning at /opt/ros/hydro/share/genmsg/cmake/genmsg-extras.cmake:43 (message): Unknown message generator specified in ROS_LANG_DISABLE: gennodejs Call Stack (most recent call first): /opt/ros/hydro/share/genmsg/cmake/genmsgConfig.cmake:190 (include) /opt/ros/hydro/share/actionlib_msgs/cmake/actionlib_msgs-extras.cmake:2 (find_package) /opt/ros/hydro/share/actionlib_msgs/cmake/actionlib_msgsConfig.cmake:190 (include) /opt/ros/hydro/share/actionlib/cmake/actionlibConfig.cmake:165 (find_package) /opt/ros/hydro/share/tf2_ros/cmake/tf2_rosConfig.cmake:165 (find_package) /opt/ros/hydro/share/tf/cmake/tfConfig.cmake:165 (find_package) /opt/ros/hydro/share/catkin/cmake/catkinConfig.cmake:75 (find_package) gazebo_ros/CMakeLists.txt:4 (find_package) CMake Warning at /opt/ros/hydro/share/genmsg/cmake/genmsg-extras.cmake:43 (message): Unknown message generator specified in ROS_LANG_DISABLE: geneus Call Stack (most recent call first): /opt/ros/hydro/share/genmsg/cmake/genmsgConfig.cmake:190 (include) /opt/ros/hydro/share/gencpp/cmake/gencppConfig.cmake:165 (find_package) /opt/ros/hydro/share/message_generation/cmake/message_generationConfig.cmake:165 (find_package) /opt/ros/hydro/share/catkin/cmake/catkinConfig.cmake:75 (find_package) gazebo_plugins/CMakeLists.txt:6 (find_package) CMake Warning at /opt/ros/hydro/share/genmsg/cmake/genmsg-extras.cmake:43 (message): Unknown message generator specified in ROS_LANG_DISABLE: gennodejs Call Stack (most recent call first): /opt/ros/hydro/share/genmsg/cmake/genmsgConfig.cmake:190 (include) /opt/ros/hydro/share/gencpp/cmake/gencppConfig.cmake:165 (find_package) /opt/ros/hydro/share/message_generation/cmake/message_generationConfig.cmake:165 (find_package) /opt/ros/hydro/share/catkin/cmake/catkinConfig.cmake:75 (find_package) gazebo_plugins/CMakeLists.txt:6 (find_package) CMake Warning at /opt/ros/hydro/share/genmsg/cmake/genmsg-extras.cmake:43 (message): Unknown message generator specified in ROS_LANG_DISABLE: geneus Call Stack (most recent call first): /opt/ros/hydro/share/genmsg/cmake/genmsgConfig.cmake:190 (include) /opt/ros/hydro/share/actionlib_msgs/cmake/actionlib_msgs-extras.cmake:2 (find_package) /opt/ros/hydro/share/actionlib_msgs/cmake/actionlib_msgsConfig.cmake:190 (include) /opt/ros/hydro/share/actionlib/cmake/actionlibConfig.cmake:165 (find_package) /opt/ros/hydro/share/tf2_ros/cmake/tf2_rosConfig.cmake:165 (find_package) /opt/ros/hydro/share/tf/cmake/tfConfig.cmake:165 (find_package) /opt/ros/hydro/share/control_toolbox/cmake/control_toolboxConfig.cmake:165 (find_package) /opt/ros/hydro/share/catkin/cmake/catkinConfig.cmake:75 (find_package) gazebo_ros_control/CMakeLists.txt:5 (find_package) CMake Warning at /opt/ros/hydro/share/genmsg/cmake/genmsg-extras.cmake:43 (message): Unknown message generator specified in ROS_LANG_DISABLE: gennodejs Call Stack (most recent call first): /opt/ros/hydro/share/genmsg/cmake/genmsgConfig.cmake:190 (include) /opt/ros/hydro/share/actionlib_msgs/cmake/actionlib_msgs-extras.cmake:2 (find_package) /opt/ros/hydro/share/actionlib_msgs/cmake/actionlib_msgsConfig.cmake:190 (include) /opt/ros/hydro/share/actionlib/cmake/actionlibConfig.cmake:165 (find_package) /opt/ros/hydro/share/tf2_ros/cmake/tf2_rosConfig.cmake:165 (find_package) /opt/ros/hydro/share/tf/cmake/tfConfig.cmake:165 (find_package) /opt/ros/hydro/share/control_toolbox/cmake/control_toolboxConfig.cmake:165 (find_package) /opt/ros/hydro/share/catkin/cmake/catkinConfig.cmake:75 (find_package) gazebo_ros_control/CMakeLists.txt:5 (find_package) ===> Building for prf-gazebo-ros-pkgs-2.6.7r4 In file included from /local/robotpkg/var/tmp/robotpkg/wip/prf-gazebo-ros-pkgs/work/gazebo_ros_pkgs-2.6.7/gazebo_plugins/src/gazebo_ros_utils.cpp:35:0: /local/robotpkg/var/tmp/robotpkg/wip/prf-gazebo-ros-pkgs/work/gazebo_ros_pkgs-2.6.7/gazebo_plugins/include/gazebo_plugins/gazebo_ros_utils.h: In function 'std::string gazebo::GetModelName(const SensorPtr&)': /local/robotpkg/var/tmp/robotpkg/wip/prf-gazebo-ros-pkgs/work/gazebo_ros_pkgs-2.6.7/gazebo_plugins/include/gazebo_plugins/gazebo_ros_utils.h:61:38: error: 'class gazebo::sensors::Sensor' has no member named 'ScopedName' /local/robotpkg/var/tmp/robotpkg/wip/prf-gazebo-ros-pkgs/work/gazebo_ros_pkgs-2.6.7/gazebo_plugins/src/gazebo_ros_f3d.cpp: In member function 'virtual void gazebo::GazeboRosF3D::UpdateChild()': /local/robotpkg/var/tmp/robotpkg/wip/prf-gazebo-ros-pkgs/work/gazebo_ros_pkgs-2.6.7/gazebo_plugins/src/gazebo_ros_f3d.cpp:152:3: error: 'ignition' has not been declared /local/robotpkg/var/tmp/robotpkg/wip/prf-gazebo-ros-pkgs/work/gazebo_ros_pkgs-2.6.7/gazebo_plugins/src/gazebo_ros_f3d.cpp:152:28: error: expected ';' before 'torque' /local/robotpkg/var/tmp/robotpkg/wip/prf-gazebo-ros-pkgs/work/gazebo_ros_pkgs-2.6.7/gazebo_plugins/src/gazebo_ros_f3d.cpp:153:3: error: 'ignition' has not been declared /local/robotpkg/var/tmp/robotpkg/wip/prf-gazebo-ros-pkgs/work/gazebo_ros_pkgs-2.6.7/gazebo_plugins/src/gazebo_ros_f3d.cpp:153:28: error: expected ';' before 'force' /local/robotpkg/var/tmp/robotpkg/wip/prf-gazebo-ros-pkgs/work/gazebo_ros_pkgs-2.6.7/gazebo_plugins/src/gazebo_ros_f3d.cpp:160:3: error: 'force' was not declared in this scope /local/robotpkg/var/tmp/robotpkg/wip/prf-gazebo-ros-pkgs/work/gazebo_ros_pkgs-2.6.7/gazebo_plugins/src/gazebo_ros_f3d.cpp:160:40: error: 'class gazebo::math::Vector3' has no member named 'Ign' /local/robotpkg/var/tmp/robotpkg/wip/prf-gazebo-ros-pkgs/work/gazebo_ros_pkgs-2.6.7/gazebo_plugins/src/gazebo_ros_f3d.cpp:161:3: error: 'torque' was not declared in this scope /local/robotpkg/var/tmp/robotpkg/wip/prf-gazebo-ros-pkgs/work/gazebo_ros_pkgs-2.6.7/gazebo_plugins/src/gazebo_ros_f3d.cpp:161:42: error: 'class gazebo::math::Vector3' has no member named 'Ign' In file included from /local/robotpkg/var/tmp/robotpkg/wip/prf-gazebo-ros-pkgs/work/gazebo_ros_pkgs-2.6.7/gazebo_plugins/src/MultiCameraPlugin.cpp:19:0: /local/robotpkg/var/tmp/robotpkg/wip/prf-gazebo-ros-pkgs/work/gazebo_ros_pkgs-2.6.7/gazebo_plugins/include/gazebo_plugins/MultiCameraPlugin.h:46:16: error: 'MultiCameraSensorPtr' in namespace 'gazebo::sensors' does not name a type In file included from /local/robotpkg/var/tmp/robotpkg/wip/prf-gazebo-ros-pkgs/work/gazebo_ros_pkgs-2.6.7/gazebo_plugins/src/MultiCameraPlugin.cpp:20:0: /local/robotpkg/var/tmp/robotpkg/wip/prf-gazebo-ros-pkgs/work/gazebo_ros_pkgs-2.6.7/gazebo_plugins/include/gazebo_plugins/gazebo_ros_utils.h: In function 'std::string gazebo::GetModelName(const SensorPtr&)': /local/robotpkg/var/tmp/robotpkg/wip/prf-gazebo-ros-pkgs/work/gazebo_ros_pkgs-2.6.7/gazebo_plugins/include/gazebo_plugins/gazebo_ros_utils.h:61:38: error: 'class gazebo::sensors::Sensor' has no member named 'ScopedName' /local/robotpkg/var/tmp/robotpkg/wip/prf-gazebo-ros-pkgs/work/gazebo_ros_pkgs-2.6.7/gazebo_plugins/src/MultiCameraPlugin.cpp: In destructor 'virtual gazebo::MultiCameraPlugin::~MultiCameraPlugin()': /local/robotpkg/var/tmp/robotpkg/wip/prf-gazebo-ros-pkgs/work/gazebo_ros_pkgs-2.6.7/gazebo_plugins/src/MultiCameraPlugin.cpp:33:9: error: 'class gazebo::MultiCameraPlugin' has no member named 'parentSensor' /local/robotpkg/var/tmp/robotpkg/wip/prf-gazebo-ros-pkgs/work/gazebo_ros_pkgs-2.6.7/gazebo_plugins/src/MultiCameraPlugin.cpp: In member function 'virtual void gazebo::MultiCameraPlugin::Load(gazebo::sensors::SensorPtr, sdf::ElementPtr)': /local/robotpkg/var/tmp/robotpkg/wip/prf-gazebo-ros-pkgs/work/gazebo_ros_pkgs-2.6.7/gazebo_plugins/src/MultiCameraPlugin.cpp:44:3: error: 'std::dynamic_pointer_cast' has not been declared /local/robotpkg/var/tmp/robotpkg/wip/prf-gazebo-ros-pkgs/work/gazebo_ros_pkgs-2.6.7/gazebo_plugins/src/MultiCameraPlugin.cpp:45:9: error: 'class gazebo::MultiCameraPlugin' has no member named 'parentSensor' /local/robotpkg/var/tmp/robotpkg/wip/prf-gazebo-ros-pkgs/work/gazebo_ros_pkgs-2.6.7/gazebo_plugins/src/MultiCameraPlugin.cpp:46:5: error: 'dynamic_pointer_cast' was not declared in this scope /local/robotpkg/var/tmp/robotpkg/wip/prf-gazebo-ros-pkgs/work/gazebo_ros_pkgs-2.6.7/gazebo_plugins/src/MultiCameraPlugin.cpp:46:5: note: suggested alternative: /usr/include/boost/smart_ptr/shared_ptr.hpp:520:42: note: 'boost::dynamic_pointer_cast' /local/robotpkg/var/tmp/robotpkg/wip/prf-gazebo-ros-pkgs/work/gazebo_ros_pkgs-2.6.7/gazebo_plugins/src/MultiCameraPlugin.cpp:46:52: error: expected primary-expression before '>' token /local/robotpkg/var/tmp/robotpkg/wip/prf-gazebo-ros-pkgs/work/gazebo_ros_pkgs-2.6.7/gazebo_plugins/src/MultiCameraPlugin.cpp:48:14: error: 'class gazebo::MultiCameraPlugin' has no member named 'parentSensor' /local/robotpkg/var/tmp/robotpkg/wip/prf-gazebo-ros-pkgs/work/gazebo_ros_pkgs-2.6.7/gazebo_plugins/src/MultiCameraPlugin.cpp:51:56: error: expected primary-expression before '>' token /local/robotpkg/var/tmp/robotpkg/wip/prf-gazebo-ros-pkgs/work/gazebo_ros_pkgs-2.6.7/gazebo_plugins/src/MultiCameraPlugin.cpp:53:51: error: expected primary-expression before '>' token /local/robotpkg/var/tmp/robotpkg/wip/prf-gazebo-ros-pkgs/work/gazebo_ros_pkgs-2.6.7/gazebo_plugins/src/MultiCameraPlugin.cpp:57:14: error: 'class gazebo::MultiCameraPlugin' has no member named 'parentSensor' /local/robotpkg/var/tmp/robotpkg/wip/prf-gazebo-ros-pkgs/work/gazebo_ros_pkgs-2.6.7/gazebo_plugins/src/MultiCameraPlugin.cpp:63:38: error: 'class gazebo::MultiCameraPlugin' has no member named 'parentSensor' /local/robotpkg/var/tmp/robotpkg/wip/prf-gazebo-ros-pkgs/work/gazebo_ros_pkgs-2.6.7/gazebo_plugins/src/MultiCameraPlugin.cpp:65:34: error: 'class gazebo::MultiCameraPlugin' has no member named 'parentSensor' /local/robotpkg/var/tmp/robotpkg/wip/prf-gazebo-ros-pkgs/work/gazebo_ros_pkgs-2.6.7/gazebo_plugins/src/MultiCameraPlugin.cpp:68:44: error: 'class gazebo::rendering::Camera' has no member named 'ImageWidth' /local/robotpkg/var/tmp/robotpkg/wip/prf-gazebo-ros-pkgs/work/gazebo_ros_pkgs-2.6.7/gazebo_plugins/src/MultiCameraPlugin.cpp:69:45: error: 'class gazebo::rendering::Camera' has no member named 'ImageHeight' /local/robotpkg/var/tmp/robotpkg/wip/prf-gazebo-ros-pkgs/work/gazebo_ros_pkgs-2.6.7/gazebo_plugins/src/MultiCameraPlugin.cpp:70:44: error: 'class gazebo::rendering::Camera' has no member named 'ImageDepth' /local/robotpkg/var/tmp/robotpkg/wip/prf-gazebo-ros-pkgs/work/gazebo_ros_pkgs-2.6.7/gazebo_plugins/src/MultiCameraPlugin.cpp:71:45: error: 'class gazebo::rendering::Camera' has no member named 'ImageFormat' /local/robotpkg/var/tmp/robotpkg/wip/prf-gazebo-ros-pkgs/work/gazebo_ros_pkgs-2.6.7/gazebo_plugins/src/MultiCameraPlugin.cpp:73:36: error: 'class gazebo::MultiCameraPlugin' has no member named 'parentSensor' /local/robotpkg/var/tmp/robotpkg/wip/prf-gazebo-ros-pkgs/work/gazebo_ros_pkgs-2.6.7/gazebo_plugins/src/MultiCameraPlugin.cpp:91:9: error: 'class gazebo::MultiCameraPlugin' has no member named 'parentSensor' In file included from /local/robotpkg/var/tmp/robotpkg/wip/prf-gazebo-ros-pkgs/work/gazebo_ros_pkgs-2.6.7/gazebo_plugins/src/gazebo_ros_block_laser.cpp:27:0: /local/robotpkg/var/tmp/robotpkg/wip/prf-gazebo-ros-pkgs/work/gazebo_ros_pkgs-2.6.7/gazebo_plugins/include/gazebo_plugins/gazebo_ros_utils.h: In function 'std::string gazebo::GetModelName(const SensorPtr&)': /local/robotpkg/var/tmp/robotpkg/wip/prf-gazebo-ros-pkgs/work/gazebo_ros_pkgs-2.6.7/gazebo_plugins/include/gazebo_plugins/gazebo_ros_utils.h:61:38: error: 'class gazebo::sensors::Sensor' has no member named 'ScopedName' make[2]: *** [gazebo_plugins/CMakeFiles/gazebo_ros_f3d.dir/src/gazebo_ros_f3d.cpp.o] Error 1 make[1]: *** [gazebo_plugins/CMakeFiles/gazebo_ros_f3d.dir/all] Error 2 make[1]: *** Waiting for unfinished jobs.... make[2]: *** [gazebo_plugins/CMakeFiles/gazebo_ros_utils.dir/src/gazebo_ros_utils.cpp.o] Error 1 make[1]: *** [gazebo_plugins/CMakeFiles/gazebo_ros_utils.dir/all] Error 2 /local/robotpkg/var/tmp/robotpkg/wip/prf-gazebo-ros-pkgs/work/gazebo_ros_pkgs-2.6.7/gazebo_plugins/src/gazebo_ros_block_laser.cpp: In member function 'virtual void gazebo::GazeboRosBlockLaser::Load(gazebo::sensors::SensorPtr, sdf::ElementPtr)': /local/robotpkg/var/tmp/robotpkg/wip/prf-gazebo-ros-pkgs/work/gazebo_ros_pkgs-2.6.7/gazebo_plugins/src/gazebo_ros_block_laser.cpp:82:36: error: 'class gazebo::sensors::Sensor' has no member named 'WorldName' /local/robotpkg/var/tmp/robotpkg/wip/prf-gazebo-ros-pkgs/work/gazebo_ros_pkgs-2.6.7/gazebo_plugins/src/gazebo_ros_block_laser.cpp:90:3: error: 'std::dynamic_pointer_cast' has not been declared /local/robotpkg/var/tmp/robotpkg/wip/prf-gazebo-ros-pkgs/work/gazebo_ros_pkgs-2.6.7/gazebo_plugins/src/gazebo_ros_block_laser.cpp:91:30: error: 'dynamic_pointer_cast' was not declared in this scope /local/robotpkg/var/tmp/robotpkg/wip/prf-gazebo-ros-pkgs/work/gazebo_ros_pkgs-2.6.7/gazebo_plugins/src/gazebo_ros_block_laser.cpp:91:30: note: suggested alternative: /usr/include/boost/smart_ptr/intrusive_ptr.hpp:253:45: note: 'boost::dynamic_pointer_cast' /local/robotpkg/var/tmp/robotpkg/wip/prf-gazebo-ros-pkgs/work/gazebo_ros_pkgs-2.6.7/gazebo_plugins/src/gazebo_ros_block_laser.cpp:91:69: error: expected primary-expression before '>' token /local/robotpkg/var/tmp/robotpkg/wip/prf-gazebo-ros-pkgs/work/gazebo_ros_pkgs-2.6.7/gazebo_plugins/src/gazebo_ros_block_laser.cpp: In member function 'virtual void gazebo::GazeboRosBlockLaser::OnNewLaserScans()': /local/robotpkg/var/tmp/robotpkg/wip/prf-gazebo-ros-pkgs/work/gazebo_ros_pkgs-2.6.7/gazebo_plugins/src/gazebo_ros_block_laser.cpp:209:61: error: 'class gazebo::sensors::Sensor' has no member named 'LastUpdateTime' /local/robotpkg/var/tmp/robotpkg/wip/prf-gazebo-ros-pkgs/work/gazebo_ros_pkgs-2.6.7/gazebo_plugins/src/gazebo_ros_block_laser.cpp: In member function 'void gazebo::GazeboRosBlockLaser::PutLaserData(gazebo::common::Time&)': /local/robotpkg/var/tmp/robotpkg/wip/prf-gazebo-ros-pkgs/work/gazebo_ros_pkgs-2.6.7/gazebo_plugins/src/gazebo_ros_block_laser.cpp:235:8: error: 'maxAngle' does not name a type /local/robotpkg/var/tmp/robotpkg/wip/prf-gazebo-ros-pkgs/work/gazebo_ros_pkgs-2.6.7/gazebo_plugins/src/gazebo_ros_block_laser.cpp:236:8: error: 'minAngle' does not name a type /local/robotpkg/var/tmp/robotpkg/wip/prf-gazebo-ros-pkgs/work/gazebo_ros_pkgs-2.6.7/gazebo_plugins/src/gazebo_ros_block_laser.cpp:238:47: error: 'class gazebo::sensors::RaySensor' has no member named 'RangeMax' /local/robotpkg/var/tmp/robotpkg/wip/prf-gazebo-ros-pkgs/work/gazebo_ros_pkgs-2.6.7/gazebo_plugins/src/gazebo_ros_block_laser.cpp:239:47: error: 'class gazebo::sensors::RaySensor' has no member named 'RangeMin' /local/robotpkg/var/tmp/robotpkg/wip/prf-gazebo-ros-pkgs/work/gazebo_ros_pkgs-2.6.7/gazebo_plugins/src/gazebo_ros_block_laser.cpp:240:44: error: 'class gazebo::sensors::RaySensor' has no member named 'RayCount' /local/robotpkg/var/tmp/robotpkg/wip/prf-gazebo-ros-pkgs/work/gazebo_ros_pkgs-2.6.7/gazebo_plugins/src/gazebo_ros_block_laser.cpp:241:46: error: 'class gazebo::sensors::RaySensor' has no member named 'RangeCount' /local/robotpkg/var/tmp/robotpkg/wip/prf-gazebo-ros-pkgs/work/gazebo_ros_pkgs-2.6.7/gazebo_plugins/src/gazebo_ros_block_laser.cpp:243:52: error: 'class gazebo::sensors::RaySensor' has no member named 'VerticalRayCount' /local/robotpkg/var/tmp/robotpkg/wip/prf-gazebo-ros-pkgs/work/gazebo_ros_pkgs-2.6.7/gazebo_plugins/src/gazebo_ros_block_laser.cpp:244:54: error: 'class gazebo::sensors::RaySensor' has no member named 'VerticalRangeCount' /local/robotpkg/var/tmp/robotpkg/wip/prf-gazebo-ros-pkgs/work/gazebo_ros_pkgs-2.6.7/gazebo_plugins/src/gazebo_ros_block_laser.cpp:245:8: error: 'verticalMaxAngle' does not name a type /local/robotpkg/var/tmp/robotpkg/wip/prf-gazebo-ros-pkgs/work/gazebo_ros_pkgs-2.6.7/gazebo_plugins/src/gazebo_ros_block_laser.cpp:246:8: error: 'verticalMinAngle' does not name a type /local/robotpkg/var/tmp/robotpkg/wip/prf-gazebo-ros-pkgs/work/gazebo_ros_pkgs-2.6.7/gazebo_plugins/src/gazebo_ros_block_laser.cpp:248:18: error: 'maxAngle' was not declared in this scope /local/robotpkg/var/tmp/robotpkg/wip/prf-gazebo-ros-pkgs/work/gazebo_ros_pkgs-2.6.7/gazebo_plugins/src/gazebo_ros_block_laser.cpp:248:38: error: 'minAngle' was not declared in this scope /local/robotpkg/var/tmp/robotpkg/wip/prf-gazebo-ros-pkgs/work/gazebo_ros_pkgs-2.6.7/gazebo_plugins/src/gazebo_ros_block_laser.cpp:249:18: error: 'verticalMaxAngle' was not declared in this scope /local/robotpkg/var/tmp/robotpkg/wip/prf-gazebo-ros-pkgs/work/gazebo_ros_pkgs-2.6.7/gazebo_plugins/src/gazebo_ros_block_laser.cpp:249:46: error: 'verticalMinAngle' was not declared in this scope /local/robotpkg/var/tmp/robotpkg/wip/prf-gazebo-ros-pkgs/work/gazebo_ros_pkgs-2.6.7/gazebo_plugins/src/gazebo_ros_block_laser.cpp:297:47: error: 'class gazebo::sensors::RaySensor' has no member named 'LaserShape' /local/robotpkg/var/tmp/robotpkg/wip/prf-gazebo-ros-pkgs/work/gazebo_ros_pkgs-2.6.7/gazebo_plugins/src/gazebo_ros_block_laser.cpp:298:47: error: 'class gazebo::sensors::RaySensor' has no member named 'LaserShape' /local/robotpkg/var/tmp/robotpkg/wip/prf-gazebo-ros-pkgs/work/gazebo_ros_pkgs-2.6.7/gazebo_plugins/src/gazebo_ros_block_laser.cpp:299:47: error: 'class gazebo::sensors::RaySensor' has no member named 'LaserShape' /local/robotpkg/var/tmp/robotpkg/wip/prf-gazebo-ros-pkgs/work/gazebo_ros_pkgs-2.6.7/gazebo_plugins/src/gazebo_ros_block_laser.cpp:300:47: error: 'class gazebo::sensors::RaySensor' has no member named 'LaserShape' /local/robotpkg/var/tmp/robotpkg/wip/prf-gazebo-ros-pkgs/work/gazebo_ros_pkgs-2.6.7/gazebo_plugins/src/gazebo_ros_block_laser.cpp:308:51: error: 'class gazebo::sensors::RaySensor' has no member named 'LaserShape' /local/robotpkg/var/tmp/robotpkg/wip/prf-gazebo-ros-pkgs/work/gazebo_ros_pkgs-2.6.7/gazebo_plugins/src/gazebo_ros_block_laser.cpp:309:51: error: 'class gazebo::sensors::RaySensor' has no member named 'LaserShape' /local/robotpkg/var/tmp/robotpkg/wip/prf-gazebo-ros-pkgs/work/gazebo_ros_pkgs-2.6.7/gazebo_plugins/src/gazebo_ros_block_laser.cpp:310:51: error: 'class gazebo::sensors::RaySensor' has no member named 'LaserShape' /local/robotpkg/var/tmp/robotpkg/wip/prf-gazebo-ros-pkgs/work/gazebo_ros_pkgs-2.6.7/gazebo_plugins/src/gazebo_ros_block_laser.cpp:311:51: error: 'class gazebo::sensors::RaySensor' has no member named 'LaserShape' /local/robotpkg/var/tmp/robotpkg/wip/prf-gazebo-ros-pkgs/work/gazebo_ros_pkgs-2.6.7/gazebo_plugins/src/gazebo_ros_block_laser.cpp: In member function 'void gazebo::GazeboRosBlockLaser::OnStats(const boost::shared_ptr&)': /local/robotpkg/var/tmp/robotpkg/wip/prf-gazebo-ros-pkgs/work/gazebo_ros_pkgs-2.6.7/gazebo_plugins/src/gazebo_ros_block_laser.cpp:398:3: error: 'ignition' has not been declared /local/robotpkg/var/tmp/robotpkg/wip/prf-gazebo-ros-pkgs/work/gazebo_ros_pkgs-2.6.7/gazebo_plugins/src/gazebo_ros_block_laser.cpp:398:26: error: expected ';' before 'pose' /local/robotpkg/var/tmp/robotpkg/wip/prf-gazebo-ros-pkgs/work/gazebo_ros_pkgs-2.6.7/gazebo_plugins/src/gazebo_ros_block_laser.cpp:399:3: error: 'pose' was not declared in this scope make[2]: *** [gazebo_plugins/CMakeFiles/MultiCameraPlugin.dir/src/MultiCameraPlugin.cpp.o] Error 1 make[1]: *** [gazebo_plugins/CMakeFiles/MultiCameraPlugin.dir/all] Error 2 make[2]: *** [gazebo_plugins/CMakeFiles/gazebo_ros_block_laser.dir/src/gazebo_ros_block_laser.cpp.o] Error 1 make[1]: *** [gazebo_plugins/CMakeFiles/gazebo_ros_block_laser.dir/all] Error 2 make: *** [all] Error 2 An unexpected error occured. The last 10 log lines are shown below. | /local/robotpkg/var/tmp/robotpkg/wip/prf-gazebo-ros-pkgs/work/gazebo_ros_pkgs-2.6.7/gazebo_plugins/src/gazebo_ros_block_laser.cpp:398:26: error: expected ';' before 'pose' | /local/robotpkg/var/tmp/robotpkg/wip/prf-gazebo-ros-pkgs/work/gazebo_ros_pkgs-2.6.7/gazebo_plugins/src/gazebo_ros_block_laser.cpp:399:3: error: 'pose' was not declared in this scope | make[2]: Leaving directory `/local/robotpkg/var/tmp/robotpkg/wip/prf-gazebo-ros-pkgs/work/gazebo_ros_pkgs-2.6.7/build' | make[2]: *** [gazebo_plugins/CMakeFiles/MultiCameraPlugin.dir/src/MultiCameraPlugin.cpp.o] Error 1 | make[1]: *** [gazebo_plugins/CMakeFiles/MultiCameraPlugin.dir/all] Error 2 | make[2]: Leaving directory `/local/robotpkg/var/tmp/robotpkg/wip/prf-gazebo-ros-pkgs/work/gazebo_ros_pkgs-2.6.7/build' | make[1]: Leaving directory `/local/robotpkg/var/tmp/robotpkg/wip/prf-gazebo-ros-pkgs/work/gazebo_ros_pkgs-2.6.7/build' | make[2]: *** [gazebo_plugins/CMakeFiles/gazebo_ros_block_laser.dir/src/gazebo_ros_block_laser.cpp.o] Error 1 | make[1]: *** [gazebo_plugins/CMakeFiles/gazebo_ros_block_laser.dir/all] Error 2 | make: *** [all] Error 2 For details or bug reports, check the complete log file in: /local/robotpkg/var/tmp/robotpkg/wip/prf-gazebo-ros-pkgs/work/build.log make[3]: *** [do-build] Error 2 make[2]: *** [pkg-check-installed] Error 2 => Marking prf-gazebo-ros-pkgs-2.6.7r4 as broken ERROR: make: *** [package] Error 2 ===> Deinstalling for prf-gazebo-ros-pkgs Removed digest-20080510 Removed prf-ros-control-0.2.6r3 Removed tnftp-20130505~ssl