robotpkg/wip/prf-gazebo-ros-pkgs bulk build results

Log for prf-gazebo-ros-pkgs-2.6.7r4 on Ubuntu-12.04-i386: build.log (Back)

--- Environment --- _overrides_lang_ros_message_generation_PKGREQD=ros-message-generation>=0.2<0.3 ros-message-generation>=0.2<0.3 ros-message-generation>=0.2<0.3 _override_vars_interfaces_ros_common_msgs=PKGREQD PKGREQD PKGREQD ROS_LANG_DISABLE=geneus:gennodejs LOWER_ARCH=i386 OPSYS=Ubuntu _overrides_interfaces_ros_common_msgs_PKGREQD=ros-common-msgs>=1.10<1.11 ros-common-msgs>=1.10<1.11 ros-common-msgs>=1.10<1.11 GZIP_CMD=/bin/gzip OS_KERNEL_VERSION=3.5.0-54-generic _override_vars_pkgtools_pkg_install=PKGREQD PKGREQD PKGREQD LC_TIME=C PKGREPO2DEB=/local/robotpkg/sbin/pkgrepo2deb BULKBASE=/opt/openrobots ROS_PACKAGE_PATH=/opt/ros/hydro ECHO_N=echo -n _overrides_pkgtools_pkg_install_PKGREQD=pkg_install>=20110805.9 pkg_install>=20110805.9 pkg_install>=20110805.9 OS_VERSION=12.04 _override_vars_devel_boost_headers=PKGREQD PKGREQD PKGREQD ROBOTPKG_BASE=/local/robotpkg PYTHON_LIB=/usr/lib/libpython2.7.so OLDPWD=/local/robotpkg/var/lib/robotpkg/wip/libmove3d-hri _override_vars_pkgtools_tnftp=PKGREQD PKGREQD PYTHON=/usr/bin/python2.7 _overrides_devel_boost_headers_PKGREQD=boost-headers>=1.34.1 boost-headers>=1.34.1 boost-headers>=1.34.1 PKG_DBDIR=/opt/openrobots/var/db/robotpkg hline="$bf======================================================================$rm" _override_vars_devel_ros_catkin=PKGREQD PKGREQD PKGREQD MACHINE_ARCH=i386 _overrides_pkgtools_tnftp_PKGREQD=tnftp>=20130505~ssl tnftp>=20130505~ssl FC=false LC_CTYPE=C NOSETESTS=/usr/bin/nosetests-2.7 _override_vars_devel_ros_class_loader=PKGREQD PKGREQD PKGREQD _overrides_devel_ros_catkin_PKGREQD=ros-catkin>=0.5<0.6 ros-catkin>=0.5<0.6 ros-catkin>=0.5<0.6 EXPECT_TARGETS=fetch install package LC_MONETARY=C PKG_CONFIG=/usr/bin/pkg-config _override_vars_devel_boost_libs=PKGREQD PKGREQD PKGREQD PKGREQD PKGREQD PKGREQD PKGREQD PKGREQD PKGREQD PKGREQD PKGREQD PKGREQD _override_vars_graphics_ros_urdf=PKGREQD PKGREQD PKGREQD MAKEFLAGS= --no-print-directory -- PKGREQD.cmdline=prf-gazebo-ros-pkgs-2.6.7r4 RECURSIVE_PKGPATH=wip/prf-gazebo-ros-pkgs\ tag=Ubuntu-12.04-i386 BULK_LOGDIR=/local/robotpkg/var/log/bulk BULKBASE=/opt/openrobots LOCALBASE=/opt/openrobots PKG_DBDIR=/opt/openrobots/var/db/robotpkg EXPECT_TARGETS=fetch\ install\ package _override_vars_pkgtools_digest=PKGREQD PKGREQD CPP=/usr/bin/gcc -E _overrides_devel_ros_class_loader_PKGREQD=ros-class-loader>=0.2<0.3 ros-class-loader>=0.2<0.3 ros-class-loader>=0.2<0.3 LOWER_OPSYS=ubuntu _overrides_devel_boost_libs_PKGREQD=boost-libs>=1.34.1 boost-libs>=1.34.1 boost-libs>=1.34.1 boost-libs>=1.34.1 boost-libs>=1.34.1 boost-libs>=1.34.1 boost-libs>=1.34.1 boost-libs>=1.34.1 boost-libs>=1.34.1 boost-libs>=1.34.1 boost-libs>=1.34.1 boost-libs>=1.34.1 bf= _overrides_graphics_ros_urdf_PKGREQD=ros-urdf>=1.10<1.11 ros-urdf>=1.10<1.11 ros-urdf>=1.10<1.11 _override_vars_pkgtools_pkgrepo2deb=PKGREQD PKGREQD _overrides_pkgtools_digest_PKGREQD=digest>=20080510 digest>=20080510 _override_vars_lang_ros_message_runtime=PKGREQD PKGREQD PKGREQD GCC=/usr/bin/gcc DIGEST=/opt/openrobots/sbin/robotpkg_digest TAR=/bin/tar LOWER_OS_VERSION=12.04 MACHINE_KERNEL=Linux-3.5.0-54-generic-i386 _overrides_pkgtools_pkgrepo2deb_PKGREQD=pkgrepo2deb>=1.4 pkgrepo2deb>=1.4 OWNER_GID=robots _override_vars_motion_ros_control_toolbox=PKGREQD PKGREQD PKGREQD _override_vars_middleware_ros_comm=PKGREQD PKGREQD PKGREQD _overrides_lang_ros_message_runtime_PKGREQD=ros-message-runtime>=0.4<0.5 ros-message-runtime>=0.4<0.5 ros-message-runtime>=0.4<0.5 PKGTOOLS_VERSION=20110805.9 RECURSIVE_PKGPATH=wip/prf-gazebo-ros-pkgs PKG_CONFIG_PATH=/opt/openrobots/lib/pkgconfig:/opt/ros/hydro/lib/pkgconfig _overrides_motion_ros_control_toolbox_PKGREQD=ros-control-toolbox>=1.10<1.13 ros-control-toolbox>=1.10<1.13 ros-control-toolbox>=1.10<1.13 _overrides_middleware_ros_comm_PKGREQD=ros-comm>=1.10<1.11 ros-comm>=1.10<1.11 ros-comm>=1.10<1.11 GXX=/usr/bin/g++ TERM=linux MAKECONF=/opt/robotpkg/etc/robotpkg-wip.conf _override_vars_archivers_pax=PKGREQD PKGREQD rm= PYTHON_INCLUDE_CONFIG=/usr/include/python2.7/ LC_COLLATE=C OS_KERNEL=Linux ROBOTPKG_TRUSTED_ENV=robotpkg PATH=/usr/local/sbin:/usr/local/bin:/usr/bin:/usr/sbin:/sbin:/bin _overrides_archivers_pax_PKGREQD=pax pax PYTHON27_INCLUDE=/usr/include/python2.7/ CMAKE=/usr/bin/cmake CXXCPP=/usr/bin/g++ -E MAKELEVEL=4 _override_vars_wip_prf_ros_control=PKGREQD PKGREQD PKGREQD DEB_HOST_MULTIARCH=i386-linux-gnu MACHINE_PLATFORM=Ubuntu-12.04-i386 ROBOTPKG_DIR=/local/robotpkg/var/lib/robotpkg TNFTP=/opt/openrobots/sbin/tnftp LANG=C _overrides_wip_prf_ros_control_PKGREQD=prf-ros-control>=0.2 prf-ros-control>=0.2 prf-ros-control>=0.2 MAKEOVERRIDES=PKGREQD.cmdline=prf-gazebo-ros-pkgs-2.6.7r4 RECURSIVE_PKGPATH=wip/prf-gazebo-ros-pkgs\ tag=Ubuntu-12.04-i386 BULK_LOGDIR=/local/robotpkg/var/log/bulk BULKBASE=/opt/openrobots LOCALBASE=/opt/openrobots PKG_DBDIR=/opt/openrobots/var/db/robotpkg EXPECT_TARGETS=fetch\ install\ package LC_MESSAGES=C _override_vars_devel_ros_ros=PKGREQD PKGREQD PKGREQD tag=Ubuntu-12.04-i386 CXX=/usr/bin/g++ _override_vars_wip_prf_gazebo_ros_pkgs=PKGREQD _overrides_devel_ros_ros_PKGREQD=ros-ros>=1.10<1.11 ros-ros>=1.10<1.11 ros-ros>=1.10<1.11 _override_vars_devel_ros_pluginlib=PKGREQD PKGREQD PKGREQD LOCALBASE=/opt/openrobots _override_vars_pkgtools_pkg_config=PKGREQD PKGREQD PKGREQD OWNER_UID=rbulk BULK_LOGDIR=/local/robotpkg/var/log/bulk _overrides_devel_ros_pluginlib_PKGREQD=ros-pluginlib>=1.9<1.10 ros-pluginlib>=1.9<1.10 ros-pluginlib>=1.9<1.10 _overrides_wip_prf_gazebo_ros_pkgs_PKGREQD=prf-gazebo-ros-pkgs-2.6.7r4 _override_vars_middleware_ros_actionlib=PKGREQD PKGREQD PKGREQD ZCAT=/bin/zcat _override_vars_math_ros_geometry=PKGREQD PKGREQD PKGREQD PAX=/bin/pax LOWER_OS_KERNEL=linux _overrides_pkgtools_pkg_config_PKGREQD=pkg-config>=0.22 pkg-config>=0.22 pkg-config>=0.22 _override_vars_math_eigen3=PKGREQD PKGREQD PKGREQD GPG=/usr/bin/gpg --homedir=/opt/robotpkg/etc/gnupg PYTHON27_LIB=/usr/lib/libpython2.7.so _overrides_middleware_ros_actionlib_PKGREQD=ros-actionlib>=1.10<1.11 ros-actionlib>=1.10<1.11 ros-actionlib>=1.10<1.11 _overrides_math_ros_geometry_PKGREQD=ros-geometry>=1.10<1.11 ros-geometry>=1.10<1.11 ros-geometry>=1.10<1.11 PYTHON_INCLUDE=/usr/include/python2.7/ PWD=/local/robotpkg/var/lib/robotpkg/wip/prf-gazebo-ros-pkgs _override_vars_interfaces_ros_std_msgs=PKGREQD PKGREQD PKGREQD _overrides_math_eigen3_PKGREQD=eigen3>=3.0.0 eigen3>=3.0.0 eigen3>=3.0.0 _override_vars_middleware_ros_genmsg=PKGREQD PKGREQD PKGREQD PYTHON27=/usr/bin/python2.7 _ROBOTPKG_NOW=1018150840 _overrides_interfaces_ros_std_msgs_PKGREQD=ros-std-msgs>=0.5 ros-std-msgs>=0.5 ros-std-msgs>=0.5 PYTHONPATH=/usr/lib/python2.7/dist-packages:/opt/ros/hydro/lib/python2.7/dist-packages LC_NUMERIC=C _overrides_middleware_ros_genmsg_PKGREQD=ros-genmsg>=0.4<0.5 ros-genmsg>=0.4<0.5 ros-genmsg>=0.4<0.5 CC=/usr/bin/gcc MFLAGS=- --no-print-directory _override_vars_lang_ros_message_generation=PKGREQD PKGREQD PKGREQD PKG_CONFIG_LIBDIR=/usr/lib/i386-linux-gnu/pkgconfig:/usr/lib/pkgconfig:/usr/share/pkgconfig NODENAME=fluffy32-ubuntu1204 --- Running set -e; \ cd /local/robotpkg/var/tmp/robotpkg/wip/prf-gazebo-ros-pkgs/work/gazebo_ros_pkgs-2.6.7 && cd /local/robotpkg/var/tmp/robotpkg/wip/prf-gazebo-ros-pkgs/work/gazebo_ros_pkgs-2.6.7/build && /usr/bin/env MAKELEVEL= MAKEOVERRIDES= MAKEFLAGS= MFLAGS= 'CPPFLAGS=' 'CFLAGS=-pipe -O3 -DNDEBUG' 'LDFLAGS=' 'CXXFLAGS=-pipe -O3 -DNDEBUG' PREFIX='/opt/openrobots' HOME=/local/robotpkg/var/tmp/robotpkg/wip/prf-gazebo-ros-pkgs/work PATH='/opt/openrobots/sbin:/opt/ros/hydro/bin:/usr/local/sbin:/usr/local/bin:/usr/bin:/usr/sbin:/sbin:/bin' LD_LIBRARY_PATH='' LOCALBASE=/opt/openrobots PKGMANDIR=man make -j4 -f Makefile all; /usr/bin/cmake -H/local/robotpkg/var/tmp/robotpkg/wip/prf-gazebo-ros-pkgs/work/gazebo_ros_pkgs-2.6.7 -B/local/robotpkg/var/tmp/robotpkg/wip/prf-gazebo-ros-pkgs/work/gazebo_ros_pkgs-2.6.7/build --check-build-system CMakeFiles/Makefile.cmake 0 /usr/bin/cmake -E cmake_progress_start /local/robotpkg/var/tmp/robotpkg/wip/prf-gazebo-ros-pkgs/work/gazebo_ros_pkgs-2.6.7/build/CMakeFiles /local/robotpkg/var/tmp/robotpkg/wip/prf-gazebo-ros-pkgs/work/gazebo_ros_pkgs-2.6.7/build/CMakeFiles/progress.marks make -f CMakeFiles/Makefile2 all make[1]: Entering directory `/local/robotpkg/var/tmp/robotpkg/wip/prf-gazebo-ros-pkgs/work/gazebo_ros_pkgs-2.6.7/build' make -f gazebo_msgs/CMakeFiles/sensor_msgs_generate_messages_py.dir/build.make gazebo_msgs/CMakeFiles/sensor_msgs_generate_messages_py.dir/depend make -f gazebo_msgs/CMakeFiles/std_msgs_generate_messages_py.dir/build.make gazebo_msgs/CMakeFiles/std_msgs_generate_messages_py.dir/depend make[2]: Entering directory `/local/robotpkg/var/tmp/robotpkg/wip/prf-gazebo-ros-pkgs/work/gazebo_ros_pkgs-2.6.7/build' cd /local/robotpkg/var/tmp/robotpkg/wip/prf-gazebo-ros-pkgs/work/gazebo_ros_pkgs-2.6.7/build && /usr/bin/cmake -E cmake_depends "Unix Makefiles" /local/robotpkg/var/tmp/robotpkg/wip/prf-gazebo-ros-pkgs/work/gazebo_ros_pkgs-2.6.7 /local/robotpkg/var/tmp/robotpkg/wip/prf-gazebo-ros-pkgs/work/gazebo_ros_pkgs-2.6.7/gazebo_msgs /local/robotpkg/var/tmp/robotpkg/wip/prf-gazebo-ros-pkgs/work/gazebo_ros_pkgs-2.6.7/build /local/robotpkg/var/tmp/robotpkg/wip/prf-gazebo-ros-pkgs/work/gazebo_ros_pkgs-2.6.7/build/gazebo_msgs /local/robotpkg/var/tmp/robotpkg/wip/prf-gazebo-ros-pkgs/work/gazebo_ros_pkgs-2.6.7/build/gazebo_msgs/CMakeFiles/sensor_msgs_generate_messages_py.dir/DependInfo.cmake --color= make -f gazebo_msgs/CMakeFiles/trajectory_msgs_generate_messages_py.dir/build.make gazebo_msgs/CMakeFiles/trajectory_msgs_generate_messages_py.dir/depend make -f gazebo_msgs/CMakeFiles/geometry_msgs_generate_messages_py.dir/build.make gazebo_msgs/CMakeFiles/geometry_msgs_generate_messages_py.dir/depend make[2]: Entering directory `/local/robotpkg/var/tmp/robotpkg/wip/prf-gazebo-ros-pkgs/work/gazebo_ros_pkgs-2.6.7/build' cd /local/robotpkg/var/tmp/robotpkg/wip/prf-gazebo-ros-pkgs/work/gazebo_ros_pkgs-2.6.7/build && /usr/bin/cmake -E cmake_depends "Unix Makefiles" /local/robotpkg/var/tmp/robotpkg/wip/prf-gazebo-ros-pkgs/work/gazebo_ros_pkgs-2.6.7 /local/robotpkg/var/tmp/robotpkg/wip/prf-gazebo-ros-pkgs/work/gazebo_ros_pkgs-2.6.7/gazebo_msgs /local/robotpkg/var/tmp/robotpkg/wip/prf-gazebo-ros-pkgs/work/gazebo_ros_pkgs-2.6.7/build /local/robotpkg/var/tmp/robotpkg/wip/prf-gazebo-ros-pkgs/work/gazebo_ros_pkgs-2.6.7/build/gazebo_msgs /local/robotpkg/var/tmp/robotpkg/wip/prf-gazebo-ros-pkgs/work/gazebo_ros_pkgs-2.6.7/build/gazebo_msgs/CMakeFiles/std_msgs_generate_messages_py.dir/DependInfo.cmake --color= make[2]: Entering directory `/local/robotpkg/var/tmp/robotpkg/wip/prf-gazebo-ros-pkgs/work/gazebo_ros_pkgs-2.6.7/build' cd /local/robotpkg/var/tmp/robotpkg/wip/prf-gazebo-ros-pkgs/work/gazebo_ros_pkgs-2.6.7/build && /usr/bin/cmake -E cmake_depends "Unix Makefiles" /local/robotpkg/var/tmp/robotpkg/wip/prf-gazebo-ros-pkgs/work/gazebo_ros_pkgs-2.6.7 /local/robotpkg/var/tmp/robotpkg/wip/prf-gazebo-ros-pkgs/work/gazebo_ros_pkgs-2.6.7/gazebo_msgs /local/robotpkg/var/tmp/robotpkg/wip/prf-gazebo-ros-pkgs/work/gazebo_ros_pkgs-2.6.7/build /local/robotpkg/var/tmp/robotpkg/wip/prf-gazebo-ros-pkgs/work/gazebo_ros_pkgs-2.6.7/build/gazebo_msgs /local/robotpkg/var/tmp/robotpkg/wip/prf-gazebo-ros-pkgs/work/gazebo_ros_pkgs-2.6.7/build/gazebo_msgs/CMakeFiles/trajectory_msgs_generate_messages_py.dir/DependInfo.cmake --color= make[2]: Entering directory `/local/robotpkg/var/tmp/robotpkg/wip/prf-gazebo-ros-pkgs/work/gazebo_ros_pkgs-2.6.7/build' cd /local/robotpkg/var/tmp/robotpkg/wip/prf-gazebo-ros-pkgs/work/gazebo_ros_pkgs-2.6.7/build && /usr/bin/cmake -E cmake_depends "Unix Makefiles" /local/robotpkg/var/tmp/robotpkg/wip/prf-gazebo-ros-pkgs/work/gazebo_ros_pkgs-2.6.7 /local/robotpkg/var/tmp/robotpkg/wip/prf-gazebo-ros-pkgs/work/gazebo_ros_pkgs-2.6.7/gazebo_msgs /local/robotpkg/var/tmp/robotpkg/wip/prf-gazebo-ros-pkgs/work/gazebo_ros_pkgs-2.6.7/build /local/robotpkg/var/tmp/robotpkg/wip/prf-gazebo-ros-pkgs/work/gazebo_ros_pkgs-2.6.7/build/gazebo_msgs /local/robotpkg/var/tmp/robotpkg/wip/prf-gazebo-ros-pkgs/work/gazebo_ros_pkgs-2.6.7/build/gazebo_msgs/CMakeFiles/geometry_msgs_generate_messages_py.dir/DependInfo.cmake --color= Scanning dependencies of target sensor_msgs_generate_messages_py make[2]: Leaving directory `/local/robotpkg/var/tmp/robotpkg/wip/prf-gazebo-ros-pkgs/work/gazebo_ros_pkgs-2.6.7/build' make -f gazebo_msgs/CMakeFiles/sensor_msgs_generate_messages_py.dir/build.make gazebo_msgs/CMakeFiles/sensor_msgs_generate_messages_py.dir/build make[2]: Entering directory `/local/robotpkg/var/tmp/robotpkg/wip/prf-gazebo-ros-pkgs/work/gazebo_ros_pkgs-2.6.7/build' make[2]: Nothing to be done for `gazebo_msgs/CMakeFiles/sensor_msgs_generate_messages_py.dir/build'. make[2]: Leaving directory `/local/robotpkg/var/tmp/robotpkg/wip/prf-gazebo-ros-pkgs/work/gazebo_ros_pkgs-2.6.7/build' Scanning dependencies of target std_msgs_generate_messages_py /usr/bin/cmake -E cmake_progress_report /local/robotpkg/var/tmp/robotpkg/wip/prf-gazebo-ros-pkgs/work/gazebo_ros_pkgs-2.6.7/build/CMakeFiles make[2]: Leaving directory `/local/robotpkg/var/tmp/robotpkg/wip/prf-gazebo-ros-pkgs/work/gazebo_ros_pkgs-2.6.7/build' make -f gazebo_msgs/CMakeFiles/std_msgs_generate_messages_py.dir/build.make gazebo_msgs/CMakeFiles/std_msgs_generate_messages_py.dir/build make[2]: Entering directory `/local/robotpkg/var/tmp/robotpkg/wip/prf-gazebo-ros-pkgs/work/gazebo_ros_pkgs-2.6.7/build' make[2]: Nothing to be done for `gazebo_msgs/CMakeFiles/std_msgs_generate_messages_py.dir/build'. make[2]: Leaving directory `/local/robotpkg/var/tmp/robotpkg/wip/prf-gazebo-ros-pkgs/work/gazebo_ros_pkgs-2.6.7/build' /usr/bin/cmake -E cmake_progress_report /local/robotpkg/var/tmp/robotpkg/wip/prf-gazebo-ros-pkgs/work/gazebo_ros_pkgs-2.6.7/build/CMakeFiles Scanning dependencies of target trajectory_msgs_generate_messages_py make[2]: Leaving directory `/local/robotpkg/var/tmp/robotpkg/wip/prf-gazebo-ros-pkgs/work/gazebo_ros_pkgs-2.6.7/build' make -f gazebo_msgs/CMakeFiles/trajectory_msgs_generate_messages_py.dir/build.make gazebo_msgs/CMakeFiles/trajectory_msgs_generate_messages_py.dir/build Scanning dependencies of target geometry_msgs_generate_messages_py [ 0%] make[2]: Leaving directory `/local/robotpkg/var/tmp/robotpkg/wip/prf-gazebo-ros-pkgs/work/gazebo_ros_pkgs-2.6.7/build' make -f gazebo_msgs/CMakeFiles/geometry_msgs_generate_messages_py.dir/build.make gazebo_msgs/CMakeFiles/geometry_msgs_generate_messages_py.dir/build make[2]: Entering directory `/local/robotpkg/var/tmp/robotpkg/wip/prf-gazebo-ros-pkgs/work/gazebo_ros_pkgs-2.6.7/build' make[2]: Nothing to be done for `gazebo_msgs/CMakeFiles/trajectory_msgs_generate_messages_py.dir/build'. make[2]: Leaving directory `/local/robotpkg/var/tmp/robotpkg/wip/prf-gazebo-ros-pkgs/work/gazebo_ros_pkgs-2.6.7/build' make[2]: Entering directory `/local/robotpkg/var/tmp/robotpkg/wip/prf-gazebo-ros-pkgs/work/gazebo_ros_pkgs-2.6.7/build' make[2]: Nothing to be done for `gazebo_msgs/CMakeFiles/geometry_msgs_generate_messages_py.dir/build'. make[2]: Leaving directory `/local/robotpkg/var/tmp/robotpkg/wip/prf-gazebo-ros-pkgs/work/gazebo_ros_pkgs-2.6.7/build' /usr/bin/cmake -E cmake_progress_report /local/robotpkg/var/tmp/robotpkg/wip/prf-gazebo-ros-pkgs/work/gazebo_ros_pkgs-2.6.7/build/CMakeFiles Built target std_msgs_generate_messages_py /usr/bin/cmake -E cmake_progress_report /local/robotpkg/var/tmp/robotpkg/wip/prf-gazebo-ros-pkgs/work/gazebo_ros_pkgs-2.6.7/build/CMakeFiles make -f gazebo_msgs/CMakeFiles/sensor_msgs_generate_messages_cpp.dir/build.make gazebo_msgs/CMakeFiles/sensor_msgs_generate_messages_cpp.dir/depend make[2]: Entering directory `/local/robotpkg/var/tmp/robotpkg/wip/prf-gazebo-ros-pkgs/work/gazebo_ros_pkgs-2.6.7/build' cd /local/robotpkg/var/tmp/robotpkg/wip/prf-gazebo-ros-pkgs/work/gazebo_ros_pkgs-2.6.7/build && /usr/bin/cmake -E cmake_depends "Unix Makefiles" /local/robotpkg/var/tmp/robotpkg/wip/prf-gazebo-ros-pkgs/work/gazebo_ros_pkgs-2.6.7 /local/robotpkg/var/tmp/robotpkg/wip/prf-gazebo-ros-pkgs/work/gazebo_ros_pkgs-2.6.7/gazebo_msgs /local/robotpkg/var/tmp/robotpkg/wip/prf-gazebo-ros-pkgs/work/gazebo_ros_pkgs-2.6.7/build /local/robotpkg/var/tmp/robotpkg/wip/prf-gazebo-ros-pkgs/work/gazebo_ros_pkgs-2.6.7/build/gazebo_msgs /local/robotpkg/var/tmp/robotpkg/wip/prf-gazebo-ros-pkgs/work/gazebo_ros_pkgs-2.6.7/build/gazebo_msgs/CMakeFiles/sensor_msgs_generate_messages_cpp.dir/DependInfo.cmake --color= [ 0%] Built target sensor_msgs_generate_messages_py make -f gazebo_msgs/CMakeFiles/std_msgs_generate_messages_cpp.dir/build.make gazebo_msgs/CMakeFiles/std_msgs_generate_messages_cpp.dir/depend [ 0%] [ 0%] make[2]: Entering directory `/local/robotpkg/var/tmp/robotpkg/wip/prf-gazebo-ros-pkgs/work/gazebo_ros_pkgs-2.6.7/build' cd /local/robotpkg/var/tmp/robotpkg/wip/prf-gazebo-ros-pkgs/work/gazebo_ros_pkgs-2.6.7/build && /usr/bin/cmake -E cmake_depends "Unix Makefiles" /local/robotpkg/var/tmp/robotpkg/wip/prf-gazebo-ros-pkgs/work/gazebo_ros_pkgs-2.6.7 /local/robotpkg/var/tmp/robotpkg/wip/prf-gazebo-ros-pkgs/work/gazebo_ros_pkgs-2.6.7/gazebo_msgs /local/robotpkg/var/tmp/robotpkg/wip/prf-gazebo-ros-pkgs/work/gazebo_ros_pkgs-2.6.7/build /local/robotpkg/var/tmp/robotpkg/wip/prf-gazebo-ros-pkgs/work/gazebo_ros_pkgs-2.6.7/build/gazebo_msgs /local/robotpkg/var/tmp/robotpkg/wip/prf-gazebo-ros-pkgs/work/gazebo_ros_pkgs-2.6.7/build/gazebo_msgs/CMakeFiles/std_msgs_generate_messages_cpp.dir/DependInfo.cmake --color= Scanning dependencies of target sensor_msgs_generate_messages_cpp make[2]: Leaving directory `/local/robotpkg/var/tmp/robotpkg/wip/prf-gazebo-ros-pkgs/work/gazebo_ros_pkgs-2.6.7/build' make -f gazebo_msgs/CMakeFiles/sensor_msgs_generate_messages_cpp.dir/build.make gazebo_msgs/CMakeFiles/sensor_msgs_generate_messages_cpp.dir/build Built target geometry_msgs_generate_messages_py Built target trajectory_msgs_generate_messages_py make -f gazebo_msgs/CMakeFiles/trajectory_msgs_generate_messages_cpp.dir/build.make gazebo_msgs/CMakeFiles/trajectory_msgs_generate_messages_cpp.dir/depend make -f gazebo_msgs/CMakeFiles/geometry_msgs_generate_messages_cpp.dir/build.make gazebo_msgs/CMakeFiles/geometry_msgs_generate_messages_cpp.dir/depend make[2]: Entering directory `/local/robotpkg/var/tmp/robotpkg/wip/prf-gazebo-ros-pkgs/work/gazebo_ros_pkgs-2.6.7/build' make[2]: Entering directory `/local/robotpkg/var/tmp/robotpkg/wip/prf-gazebo-ros-pkgs/work/gazebo_ros_pkgs-2.6.7/build' cd /local/robotpkg/var/tmp/robotpkg/wip/prf-gazebo-ros-pkgs/work/gazebo_ros_pkgs-2.6.7/build && /usr/bin/cmake -E cmake_depends "Unix Makefiles" /local/robotpkg/var/tmp/robotpkg/wip/prf-gazebo-ros-pkgs/work/gazebo_ros_pkgs-2.6.7 /local/robotpkg/var/tmp/robotpkg/wip/prf-gazebo-ros-pkgs/work/gazebo_ros_pkgs-2.6.7/gazebo_msgs /local/robotpkg/var/tmp/robotpkg/wip/prf-gazebo-ros-pkgs/work/gazebo_ros_pkgs-2.6.7/build /local/robotpkg/var/tmp/robotpkg/wip/prf-gazebo-ros-pkgs/work/gazebo_ros_pkgs-2.6.7/build/gazebo_msgs /local/robotpkg/var/tmp/robotpkg/wip/prf-gazebo-ros-pkgs/work/gazebo_ros_pkgs-2.6.7/build/gazebo_msgs/CMakeFiles/trajectory_msgs_generate_messages_cpp.dir/DependInfo.cmake --color= make[2]: Nothing to be done for `gazebo_msgs/CMakeFiles/sensor_msgs_generate_messages_cpp.dir/build'. make[2]: Leaving directory `/local/robotpkg/var/tmp/robotpkg/wip/prf-gazebo-ros-pkgs/work/gazebo_ros_pkgs-2.6.7/build' make[2]: Entering directory `/local/robotpkg/var/tmp/robotpkg/wip/prf-gazebo-ros-pkgs/work/gazebo_ros_pkgs-2.6.7/build' cd /local/robotpkg/var/tmp/robotpkg/wip/prf-gazebo-ros-pkgs/work/gazebo_ros_pkgs-2.6.7/build && /usr/bin/cmake -E cmake_depends "Unix Makefiles" /local/robotpkg/var/tmp/robotpkg/wip/prf-gazebo-ros-pkgs/work/gazebo_ros_pkgs-2.6.7 /local/robotpkg/var/tmp/robotpkg/wip/prf-gazebo-ros-pkgs/work/gazebo_ros_pkgs-2.6.7/gazebo_msgs /local/robotpkg/var/tmp/robotpkg/wip/prf-gazebo-ros-pkgs/work/gazebo_ros_pkgs-2.6.7/build /local/robotpkg/var/tmp/robotpkg/wip/prf-gazebo-ros-pkgs/work/gazebo_ros_pkgs-2.6.7/build/gazebo_msgs /local/robotpkg/var/tmp/robotpkg/wip/prf-gazebo-ros-pkgs/work/gazebo_ros_pkgs-2.6.7/build/gazebo_msgs/CMakeFiles/geometry_msgs_generate_messages_cpp.dir/DependInfo.cmake --color= /usr/bin/cmake -E cmake_progress_report /local/robotpkg/var/tmp/robotpkg/wip/prf-gazebo-ros-pkgs/work/gazebo_ros_pkgs-2.6.7/build/CMakeFiles Scanning dependencies of target std_msgs_generate_messages_cpp make[2]: Leaving directory `/local/robotpkg/var/tmp/robotpkg/wip/prf-gazebo-ros-pkgs/work/gazebo_ros_pkgs-2.6.7/build' make -f gazebo_msgs/CMakeFiles/std_msgs_generate_messages_cpp.dir/build.make gazebo_msgs/CMakeFiles/std_msgs_generate_messages_cpp.dir/build Scanning dependencies of target geometry_msgs_generate_messages_cpp Scanning dependencies of target trajectory_msgs_generate_messages_cpp make[2]: Leaving directory `/local/robotpkg/var/tmp/robotpkg/wip/prf-gazebo-ros-pkgs/work/gazebo_ros_pkgs-2.6.7/build' make[2]: Leaving directory `/local/robotpkg/var/tmp/robotpkg/wip/prf-gazebo-ros-pkgs/work/gazebo_ros_pkgs-2.6.7/build' [ 0%] make -f gazebo_msgs/CMakeFiles/trajectory_msgs_generate_messages_cpp.dir/build.make gazebo_msgs/CMakeFiles/trajectory_msgs_generate_messages_cpp.dir/build make[2]: Entering directory `/local/robotpkg/var/tmp/robotpkg/wip/prf-gazebo-ros-pkgs/work/gazebo_ros_pkgs-2.6.7/build' make[2]: Nothing to be done for `gazebo_msgs/CMakeFiles/std_msgs_generate_messages_cpp.dir/build'. make[2]: Leaving directory `/local/robotpkg/var/tmp/robotpkg/wip/prf-gazebo-ros-pkgs/work/gazebo_ros_pkgs-2.6.7/build' make[2]: Entering directory `/local/robotpkg/var/tmp/robotpkg/wip/prf-gazebo-ros-pkgs/work/gazebo_ros_pkgs-2.6.7/build' make[2]: Nothing to be done for `gazebo_msgs/CMakeFiles/trajectory_msgs_generate_messages_cpp.dir/build'. make -f gazebo_msgs/CMakeFiles/geometry_msgs_generate_messages_cpp.dir/build.make gazebo_msgs/CMakeFiles/geometry_msgs_generate_messages_cpp.dir/build make[2]: Entering directory `/local/robotpkg/var/tmp/robotpkg/wip/prf-gazebo-ros-pkgs/work/gazebo_ros_pkgs-2.6.7/build' make[2]: Nothing to be done for `gazebo_msgs/CMakeFiles/geometry_msgs_generate_messages_cpp.dir/build'. make[2]: Leaving directory `/local/robotpkg/var/tmp/robotpkg/wip/prf-gazebo-ros-pkgs/work/gazebo_ros_pkgs-2.6.7/build' make[2]: Leaving directory `/local/robotpkg/var/tmp/robotpkg/wip/prf-gazebo-ros-pkgs/work/gazebo_ros_pkgs-2.6.7/build' Built target sensor_msgs_generate_messages_cpp /usr/bin/cmake -E cmake_progress_report /local/robotpkg/var/tmp/robotpkg/wip/prf-gazebo-ros-pkgs/work/gazebo_ros_pkgs-2.6.7/build/CMakeFiles /usr/bin/cmake -E cmake_progress_report /local/robotpkg/var/tmp/robotpkg/wip/prf-gazebo-ros-pkgs/work/gazebo_ros_pkgs-2.6.7/build/CMakeFiles /usr/bin/cmake -E cmake_progress_report /local/robotpkg/var/tmp/robotpkg/wip/prf-gazebo-ros-pkgs/work/gazebo_ros_pkgs-2.6.7/build/CMakeFiles make -f gazebo_msgs/CMakeFiles/geometry_msgs_generate_messages_lisp.dir/build.make gazebo_msgs/CMakeFiles/geometry_msgs_generate_messages_lisp.dir/depend [ 0%] make[2]: Entering directory `/local/robotpkg/var/tmp/robotpkg/wip/prf-gazebo-ros-pkgs/work/gazebo_ros_pkgs-2.6.7/build' cd /local/robotpkg/var/tmp/robotpkg/wip/prf-gazebo-ros-pkgs/work/gazebo_ros_pkgs-2.6.7/build && /usr/bin/cmake -E cmake_depends "Unix Makefiles" /local/robotpkg/var/tmp/robotpkg/wip/prf-gazebo-ros-pkgs/work/gazebo_ros_pkgs-2.6.7 /local/robotpkg/var/tmp/robotpkg/wip/prf-gazebo-ros-pkgs/work/gazebo_ros_pkgs-2.6.7/gazebo_msgs /local/robotpkg/var/tmp/robotpkg/wip/prf-gazebo-ros-pkgs/work/gazebo_ros_pkgs-2.6.7/build /local/robotpkg/var/tmp/robotpkg/wip/prf-gazebo-ros-pkgs/work/gazebo_ros_pkgs-2.6.7/build/gazebo_msgs /local/robotpkg/var/tmp/robotpkg/wip/prf-gazebo-ros-pkgs/work/gazebo_ros_pkgs-2.6.7/build/gazebo_msgs/CMakeFiles/geometry_msgs_generate_messages_lisp.dir/DependInfo.cmake --color= [ 0%] [ 0%] Built target std_msgs_generate_messages_cpp Built target trajectory_msgs_generate_messages_cpp Scanning dependencies of target geometry_msgs_generate_messages_lisp make -f gazebo_msgs/CMakeFiles/std_msgs_generate_messages_lisp.dir/build.make gazebo_msgs/CMakeFiles/std_msgs_generate_messages_lisp.dir/depend Built target geometry_msgs_generate_messages_cpp make[2]: Leaving directory `/local/robotpkg/var/tmp/robotpkg/wip/prf-gazebo-ros-pkgs/work/gazebo_ros_pkgs-2.6.7/build' make -f gazebo_msgs/CMakeFiles/geometry_msgs_generate_messages_lisp.dir/build.make gazebo_msgs/CMakeFiles/geometry_msgs_generate_messages_lisp.dir/build make[2]: Entering directory `/local/robotpkg/var/tmp/robotpkg/wip/prf-gazebo-ros-pkgs/work/gazebo_ros_pkgs-2.6.7/build' cd /local/robotpkg/var/tmp/robotpkg/wip/prf-gazebo-ros-pkgs/work/gazebo_ros_pkgs-2.6.7/build && /usr/bin/cmake -E cmake_depends "Unix Makefiles" /local/robotpkg/var/tmp/robotpkg/wip/prf-gazebo-ros-pkgs/work/gazebo_ros_pkgs-2.6.7 /local/robotpkg/var/tmp/robotpkg/wip/prf-gazebo-ros-pkgs/work/gazebo_ros_pkgs-2.6.7/gazebo_msgs /local/robotpkg/var/tmp/robotpkg/wip/prf-gazebo-ros-pkgs/work/gazebo_ros_pkgs-2.6.7/build /local/robotpkg/var/tmp/robotpkg/wip/prf-gazebo-ros-pkgs/work/gazebo_ros_pkgs-2.6.7/build/gazebo_msgs /local/robotpkg/var/tmp/robotpkg/wip/prf-gazebo-ros-pkgs/work/gazebo_ros_pkgs-2.6.7/build/gazebo_msgs/CMakeFiles/std_msgs_generate_messages_lisp.dir/DependInfo.cmake --color= make[2]: Entering directory `/local/robotpkg/var/tmp/robotpkg/wip/prf-gazebo-ros-pkgs/work/gazebo_ros_pkgs-2.6.7/build' make[2]: Nothing to be done for `gazebo_msgs/CMakeFiles/geometry_msgs_generate_messages_lisp.dir/build'. make[2]: Leaving directory `/local/robotpkg/var/tmp/robotpkg/wip/prf-gazebo-ros-pkgs/work/gazebo_ros_pkgs-2.6.7/build' /usr/bin/cmake -E cmake_progress_report /local/robotpkg/var/tmp/robotpkg/wip/prf-gazebo-ros-pkgs/work/gazebo_ros_pkgs-2.6.7/build/CMakeFiles [ 0%] Scanning dependencies of target std_msgs_generate_messages_lisp make[2]: Leaving directory `/local/robotpkg/var/tmp/robotpkg/wip/prf-gazebo-ros-pkgs/work/gazebo_ros_pkgs-2.6.7/build' Built target geometry_msgs_generate_messages_lisp make -f gazebo_msgs/CMakeFiles/std_msgs_generate_messages_lisp.dir/build.make gazebo_msgs/CMakeFiles/std_msgs_generate_messages_lisp.dir/build make[2]: Entering directory `/local/robotpkg/var/tmp/robotpkg/wip/prf-gazebo-ros-pkgs/work/gazebo_ros_pkgs-2.6.7/build' make[2]: Nothing to be done for `gazebo_msgs/CMakeFiles/std_msgs_generate_messages_lisp.dir/build'. make[2]: Leaving directory `/local/robotpkg/var/tmp/robotpkg/wip/prf-gazebo-ros-pkgs/work/gazebo_ros_pkgs-2.6.7/build' /usr/bin/cmake -E cmake_progress_report /local/robotpkg/var/tmp/robotpkg/wip/prf-gazebo-ros-pkgs/work/gazebo_ros_pkgs-2.6.7/build/CMakeFiles make -f gazebo_msgs/CMakeFiles/sensor_msgs_generate_messages_lisp.dir/build.make gazebo_msgs/CMakeFiles/sensor_msgs_generate_messages_lisp.dir/depend make -f gazebo_msgs/CMakeFiles/trajectory_msgs_generate_messages_lisp.dir/build.make gazebo_msgs/CMakeFiles/trajectory_msgs_generate_messages_lisp.dir/depend make[2]: Entering directory `/local/robotpkg/var/tmp/robotpkg/wip/prf-gazebo-ros-pkgs/work/gazebo_ros_pkgs-2.6.7/build' cd /local/robotpkg/var/tmp/robotpkg/wip/prf-gazebo-ros-pkgs/work/gazebo_ros_pkgs-2.6.7/build && /usr/bin/cmake -E cmake_depends "Unix Makefiles" /local/robotpkg/var/tmp/robotpkg/wip/prf-gazebo-ros-pkgs/work/gazebo_ros_pkgs-2.6.7 /local/robotpkg/var/tmp/robotpkg/wip/prf-gazebo-ros-pkgs/work/gazebo_ros_pkgs-2.6.7/gazebo_msgs /local/robotpkg/var/tmp/robotpkg/wip/prf-gazebo-ros-pkgs/work/gazebo_ros_pkgs-2.6.7/build /local/robotpkg/var/tmp/robotpkg/wip/prf-gazebo-ros-pkgs/work/gazebo_ros_pkgs-2.6.7/build/gazebo_msgs /local/robotpkg/var/tmp/robotpkg/wip/prf-gazebo-ros-pkgs/work/gazebo_ros_pkgs-2.6.7/build/gazebo_msgs/CMakeFiles/sensor_msgs_generate_messages_lisp.dir/DependInfo.cmake --color= [ 0%] make[2]: Entering directory `/local/robotpkg/var/tmp/robotpkg/wip/prf-gazebo-ros-pkgs/work/gazebo_ros_pkgs-2.6.7/build' make -f gazebo_ros/CMakeFiles/tf2_msgs_generate_messages_cpp.dir/build.make gazebo_ros/CMakeFiles/tf2_msgs_generate_messages_cpp.dir/depend Scanning dependencies of target sensor_msgs_generate_messages_lisp make[2]: Leaving directory `/local/robotpkg/var/tmp/robotpkg/wip/prf-gazebo-ros-pkgs/work/gazebo_ros_pkgs-2.6.7/build' cd /local/robotpkg/var/tmp/robotpkg/wip/prf-gazebo-ros-pkgs/work/gazebo_ros_pkgs-2.6.7/build && /usr/bin/cmake -E cmake_depends "Unix Makefiles" /local/robotpkg/var/tmp/robotpkg/wip/prf-gazebo-ros-pkgs/work/gazebo_ros_pkgs-2.6.7 /local/robotpkg/var/tmp/robotpkg/wip/prf-gazebo-ros-pkgs/work/gazebo_ros_pkgs-2.6.7/gazebo_msgs /local/robotpkg/var/tmp/robotpkg/wip/prf-gazebo-ros-pkgs/work/gazebo_ros_pkgs-2.6.7/build /local/robotpkg/var/tmp/robotpkg/wip/prf-gazebo-ros-pkgs/work/gazebo_ros_pkgs-2.6.7/build/gazebo_msgs /local/robotpkg/var/tmp/robotpkg/wip/prf-gazebo-ros-pkgs/work/gazebo_ros_pkgs-2.6.7/build/gazebo_msgs/CMakeFiles/trajectory_msgs_generate_messages_lisp.dir/DependInfo.cmake --color= make[2]: Entering directory `/local/robotpkg/var/tmp/robotpkg/wip/prf-gazebo-ros-pkgs/work/gazebo_ros_pkgs-2.6.7/build' cd /local/robotpkg/var/tmp/robotpkg/wip/prf-gazebo-ros-pkgs/work/gazebo_ros_pkgs-2.6.7/build && /usr/bin/cmake -E cmake_depends "Unix Makefiles" /local/robotpkg/var/tmp/robotpkg/wip/prf-gazebo-ros-pkgs/work/gazebo_ros_pkgs-2.6.7 /local/robotpkg/var/tmp/robotpkg/wip/prf-gazebo-ros-pkgs/work/gazebo_ros_pkgs-2.6.7/gazebo_ros /local/robotpkg/var/tmp/robotpkg/wip/prf-gazebo-ros-pkgs/work/gazebo_ros_pkgs-2.6.7/build /local/robotpkg/var/tmp/robotpkg/wip/prf-gazebo-ros-pkgs/work/gazebo_ros_pkgs-2.6.7/build/gazebo_ros /local/robotpkg/var/tmp/robotpkg/wip/prf-gazebo-ros-pkgs/work/gazebo_ros_pkgs-2.6.7/build/gazebo_ros/CMakeFiles/tf2_msgs_generate_messages_cpp.dir/DependInfo.cmake --color= Built target std_msgs_generate_messages_lisp make -f gazebo_msgs/CMakeFiles/sensor_msgs_generate_messages_lisp.dir/build.make gazebo_msgs/CMakeFiles/sensor_msgs_generate_messages_lisp.dir/build make[2]: Entering directory `/local/robotpkg/var/tmp/robotpkg/wip/prf-gazebo-ros-pkgs/work/gazebo_ros_pkgs-2.6.7/build' make -f gazebo_ros/CMakeFiles/tf_generate_messages_cpp.dir/build.make gazebo_ros/CMakeFiles/tf_generate_messages_cpp.dir/depend make[2]: Nothing to be done for `gazebo_msgs/CMakeFiles/sensor_msgs_generate_messages_lisp.dir/build'. make[2]: Leaving directory `/local/robotpkg/var/tmp/robotpkg/wip/prf-gazebo-ros-pkgs/work/gazebo_ros_pkgs-2.6.7/build' /usr/bin/cmake -E cmake_progress_report /local/robotpkg/var/tmp/robotpkg/wip/prf-gazebo-ros-pkgs/work/gazebo_ros_pkgs-2.6.7/build/CMakeFiles make[2]: Entering directory `/local/robotpkg/var/tmp/robotpkg/wip/prf-gazebo-ros-pkgs/work/gazebo_ros_pkgs-2.6.7/build' cd /local/robotpkg/var/tmp/robotpkg/wip/prf-gazebo-ros-pkgs/work/gazebo_ros_pkgs-2.6.7/build && /usr/bin/cmake -E cmake_depends "Unix Makefiles" /local/robotpkg/var/tmp/robotpkg/wip/prf-gazebo-ros-pkgs/work/gazebo_ros_pkgs-2.6.7 /local/robotpkg/var/tmp/robotpkg/wip/prf-gazebo-ros-pkgs/work/gazebo_ros_pkgs-2.6.7/gazebo_ros /local/robotpkg/var/tmp/robotpkg/wip/prf-gazebo-ros-pkgs/work/gazebo_ros_pkgs-2.6.7/build /local/robotpkg/var/tmp/robotpkg/wip/prf-gazebo-ros-pkgs/work/gazebo_ros_pkgs-2.6.7/build/gazebo_ros /local/robotpkg/var/tmp/robotpkg/wip/prf-gazebo-ros-pkgs/work/gazebo_ros_pkgs-2.6.7/build/gazebo_ros/CMakeFiles/tf_generate_messages_cpp.dir/DependInfo.cmake --color= [ 0%] Built target sensor_msgs_generate_messages_lisp make -f gazebo_ros/CMakeFiles/roscpp_generate_messages_lisp.dir/build.make gazebo_ros/CMakeFiles/roscpp_generate_messages_lisp.dir/depend make[2]: Entering directory `/local/robotpkg/var/tmp/robotpkg/wip/prf-gazebo-ros-pkgs/work/gazebo_ros_pkgs-2.6.7/build' cd /local/robotpkg/var/tmp/robotpkg/wip/prf-gazebo-ros-pkgs/work/gazebo_ros_pkgs-2.6.7/build && /usr/bin/cmake -E cmake_depends "Unix Makefiles" /local/robotpkg/var/tmp/robotpkg/wip/prf-gazebo-ros-pkgs/work/gazebo_ros_pkgs-2.6.7 /local/robotpkg/var/tmp/robotpkg/wip/prf-gazebo-ros-pkgs/work/gazebo_ros_pkgs-2.6.7/gazebo_ros /local/robotpkg/var/tmp/robotpkg/wip/prf-gazebo-ros-pkgs/work/gazebo_ros_pkgs-2.6.7/build /local/robotpkg/var/tmp/robotpkg/wip/prf-gazebo-ros-pkgs/work/gazebo_ros_pkgs-2.6.7/build/gazebo_ros /local/robotpkg/var/tmp/robotpkg/wip/prf-gazebo-ros-pkgs/work/gazebo_ros_pkgs-2.6.7/build/gazebo_ros/CMakeFiles/roscpp_generate_messages_lisp.dir/DependInfo.cmake --color= Scanning dependencies of target tf2_msgs_generate_messages_cpp Scanning dependencies of target trajectory_msgs_generate_messages_lisp make[2]: Leaving directory `/local/robotpkg/var/tmp/robotpkg/wip/prf-gazebo-ros-pkgs/work/gazebo_ros_pkgs-2.6.7/build' make[2]: Leaving directory `/local/robotpkg/var/tmp/robotpkg/wip/prf-gazebo-ros-pkgs/work/gazebo_ros_pkgs-2.6.7/build' make -f gazebo_msgs/CMakeFiles/trajectory_msgs_generate_messages_lisp.dir/build.make gazebo_msgs/CMakeFiles/trajectory_msgs_generate_messages_lisp.dir/build make -f gazebo_ros/CMakeFiles/tf2_msgs_generate_messages_cpp.dir/build.make gazebo_ros/CMakeFiles/tf2_msgs_generate_messages_cpp.dir/build make[2]: Entering directory `/local/robotpkg/var/tmp/robotpkg/wip/prf-gazebo-ros-pkgs/work/gazebo_ros_pkgs-2.6.7/build' make[2]: Nothing to be done for `gazebo_msgs/CMakeFiles/trajectory_msgs_generate_messages_lisp.dir/build'. make[2]: Leaving directory `/local/robotpkg/var/tmp/robotpkg/wip/prf-gazebo-ros-pkgs/work/gazebo_ros_pkgs-2.6.7/build' /usr/bin/cmake -E cmake_progress_report /local/robotpkg/var/tmp/robotpkg/wip/prf-gazebo-ros-pkgs/work/gazebo_ros_pkgs-2.6.7/build/CMakeFiles make[2]: Entering directory `/local/robotpkg/var/tmp/robotpkg/wip/prf-gazebo-ros-pkgs/work/gazebo_ros_pkgs-2.6.7/build' make[2]: Nothing to be done for `gazebo_ros/CMakeFiles/tf2_msgs_generate_messages_cpp.dir/build'. make[2]: Leaving directory `/local/robotpkg/var/tmp/robotpkg/wip/prf-gazebo-ros-pkgs/work/gazebo_ros_pkgs-2.6.7/build' /usr/bin/cmake -E cmake_progress_report /local/robotpkg/var/tmp/robotpkg/wip/prf-gazebo-ros-pkgs/work/gazebo_ros_pkgs-2.6.7/build/CMakeFiles [ 0%] Scanning dependencies of target tf_generate_messages_cpp Built target trajectory_msgs_generate_messages_lisp make[2]: Leaving directory `/local/robotpkg/var/tmp/robotpkg/wip/prf-gazebo-ros-pkgs/work/gazebo_ros_pkgs-2.6.7/build' [ 0%] make -f gazebo_ros/CMakeFiles/tf_generate_messages_cpp.dir/build.make gazebo_ros/CMakeFiles/tf_generate_messages_cpp.dir/build Scanning dependencies of target roscpp_generate_messages_lisp make[2]: Leaving directory `/local/robotpkg/var/tmp/robotpkg/wip/prf-gazebo-ros-pkgs/work/gazebo_ros_pkgs-2.6.7/build' make[2]: Entering directory `/local/robotpkg/var/tmp/robotpkg/wip/prf-gazebo-ros-pkgs/work/gazebo_ros_pkgs-2.6.7/build' make[2]: Nothing to be done for `gazebo_ros/CMakeFiles/tf_generate_messages_cpp.dir/build'. make[2]: Leaving directory `/local/robotpkg/var/tmp/robotpkg/wip/prf-gazebo-ros-pkgs/work/gazebo_ros_pkgs-2.6.7/build' /usr/bin/cmake -E cmake_progress_report /local/robotpkg/var/tmp/robotpkg/wip/prf-gazebo-ros-pkgs/work/gazebo_ros_pkgs-2.6.7/build/CMakeFiles Built target tf2_msgs_generate_messages_cpp make -f gazebo_ros/CMakeFiles/roscpp_generate_messages_lisp.dir/build.make gazebo_ros/CMakeFiles/roscpp_generate_messages_lisp.dir/build [ 0%] make[2]: Entering directory `/local/robotpkg/var/tmp/robotpkg/wip/prf-gazebo-ros-pkgs/work/gazebo_ros_pkgs-2.6.7/build' make[2]: Nothing to be done for `gazebo_ros/CMakeFiles/roscpp_generate_messages_lisp.dir/build'. make[2]: Leaving directory `/local/robotpkg/var/tmp/robotpkg/wip/prf-gazebo-ros-pkgs/work/gazebo_ros_pkgs-2.6.7/build' Built target tf_generate_messages_cpp /usr/bin/cmake -E cmake_progress_report /local/robotpkg/var/tmp/robotpkg/wip/prf-gazebo-ros-pkgs/work/gazebo_ros_pkgs-2.6.7/build/CMakeFiles make -f gazebo_msgs/CMakeFiles/std_srvs_generate_messages_cpp.dir/build.make gazebo_msgs/CMakeFiles/std_srvs_generate_messages_cpp.dir/depend make[2]: Entering directory `/local/robotpkg/var/tmp/robotpkg/wip/prf-gazebo-ros-pkgs/work/gazebo_ros_pkgs-2.6.7/build' cd /local/robotpkg/var/tmp/robotpkg/wip/prf-gazebo-ros-pkgs/work/gazebo_ros_pkgs-2.6.7/build && /usr/bin/cmake -E cmake_depends "Unix Makefiles" /local/robotpkg/var/tmp/robotpkg/wip/prf-gazebo-ros-pkgs/work/gazebo_ros_pkgs-2.6.7 /local/robotpkg/var/tmp/robotpkg/wip/prf-gazebo-ros-pkgs/work/gazebo_ros_pkgs-2.6.7/gazebo_msgs /local/robotpkg/var/tmp/robotpkg/wip/prf-gazebo-ros-pkgs/work/gazebo_ros_pkgs-2.6.7/build /local/robotpkg/var/tmp/robotpkg/wip/prf-gazebo-ros-pkgs/work/gazebo_ros_pkgs-2.6.7/build/gazebo_msgs /local/robotpkg/var/tmp/robotpkg/wip/prf-gazebo-ros-pkgs/work/gazebo_ros_pkgs-2.6.7/build/gazebo_msgs/CMakeFiles/std_srvs_generate_messages_cpp.dir/DependInfo.cmake --color= make -f gazebo_msgs/CMakeFiles/std_srvs_generate_messages_py.dir/build.make gazebo_msgs/CMakeFiles/std_srvs_generate_messages_py.dir/depend make -f gazebo_ros/CMakeFiles/gazebo_ros_gencfg.dir/build.make gazebo_ros/CMakeFiles/gazebo_ros_gencfg.dir/depend make[2]: Entering directory `/local/robotpkg/var/tmp/robotpkg/wip/prf-gazebo-ros-pkgs/work/gazebo_ros_pkgs-2.6.7/build' cd /local/robotpkg/var/tmp/robotpkg/wip/prf-gazebo-ros-pkgs/work/gazebo_ros_pkgs-2.6.7/build && /usr/bin/cmake -E cmake_depends "Unix Makefiles" /local/robotpkg/var/tmp/robotpkg/wip/prf-gazebo-ros-pkgs/work/gazebo_ros_pkgs-2.6.7 /local/robotpkg/var/tmp/robotpkg/wip/prf-gazebo-ros-pkgs/work/gazebo_ros_pkgs-2.6.7/gazebo_msgs /local/robotpkg/var/tmp/robotpkg/wip/prf-gazebo-ros-pkgs/work/gazebo_ros_pkgs-2.6.7/build /local/robotpkg/var/tmp/robotpkg/wip/prf-gazebo-ros-pkgs/work/gazebo_ros_pkgs-2.6.7/build/gazebo_msgs /local/robotpkg/var/tmp/robotpkg/wip/prf-gazebo-ros-pkgs/work/gazebo_ros_pkgs-2.6.7/build/gazebo_msgs/CMakeFiles/std_srvs_generate_messages_py.dir/DependInfo.cmake --color= make[2]: Entering directory `/local/robotpkg/var/tmp/robotpkg/wip/prf-gazebo-ros-pkgs/work/gazebo_ros_pkgs-2.6.7/build' cd /local/robotpkg/var/tmp/robotpkg/wip/prf-gazebo-ros-pkgs/work/gazebo_ros_pkgs-2.6.7/build && /usr/bin/cmake -E cmake_depends "Unix Makefiles" /local/robotpkg/var/tmp/robotpkg/wip/prf-gazebo-ros-pkgs/work/gazebo_ros_pkgs-2.6.7 /local/robotpkg/var/tmp/robotpkg/wip/prf-gazebo-ros-pkgs/work/gazebo_ros_pkgs-2.6.7/gazebo_ros /local/robotpkg/var/tmp/robotpkg/wip/prf-gazebo-ros-pkgs/work/gazebo_ros_pkgs-2.6.7/build /local/robotpkg/var/tmp/robotpkg/wip/prf-gazebo-ros-pkgs/work/gazebo_ros_pkgs-2.6.7/build/gazebo_ros /local/robotpkg/var/tmp/robotpkg/wip/prf-gazebo-ros-pkgs/work/gazebo_ros_pkgs-2.6.7/build/gazebo_ros/CMakeFiles/gazebo_ros_gencfg.dir/DependInfo.cmake --color= [ 0%] Scanning dependencies of target std_srvs_generate_messages_py Built target roscpp_generate_messages_lisp make -f gazebo_msgs/CMakeFiles/std_srvs_generate_messages_lisp.dir/build.make gazebo_msgs/CMakeFiles/std_srvs_generate_messages_lisp.dir/depend Scanning dependencies of target std_srvs_generate_messages_cpp make[2]: Leaving directory `/local/robotpkg/var/tmp/robotpkg/wip/prf-gazebo-ros-pkgs/work/gazebo_ros_pkgs-2.6.7/build' make[2]: Entering directory `/local/robotpkg/var/tmp/robotpkg/wip/prf-gazebo-ros-pkgs/work/gazebo_ros_pkgs-2.6.7/build' cd /local/robotpkg/var/tmp/robotpkg/wip/prf-gazebo-ros-pkgs/work/gazebo_ros_pkgs-2.6.7/build && /usr/bin/cmake -E cmake_depends "Unix Makefiles" /local/robotpkg/var/tmp/robotpkg/wip/prf-gazebo-ros-pkgs/work/gazebo_ros_pkgs-2.6.7 /local/robotpkg/var/tmp/robotpkg/wip/prf-gazebo-ros-pkgs/work/gazebo_ros_pkgs-2.6.7/gazebo_msgs /local/robotpkg/var/tmp/robotpkg/wip/prf-gazebo-ros-pkgs/work/gazebo_ros_pkgs-2.6.7/build /local/robotpkg/var/tmp/robotpkg/wip/prf-gazebo-ros-pkgs/work/gazebo_ros_pkgs-2.6.7/build/gazebo_msgs /local/robotpkg/var/tmp/robotpkg/wip/prf-gazebo-ros-pkgs/work/gazebo_ros_pkgs-2.6.7/build/gazebo_msgs/CMakeFiles/std_srvs_generate_messages_lisp.dir/DependInfo.cmake --color= make -f gazebo_msgs/CMakeFiles/std_srvs_generate_messages_cpp.dir/build.make gazebo_msgs/CMakeFiles/std_srvs_generate_messages_cpp.dir/build make[2]: Leaving directory `/local/robotpkg/var/tmp/robotpkg/wip/prf-gazebo-ros-pkgs/work/gazebo_ros_pkgs-2.6.7/build' make -f gazebo_msgs/CMakeFiles/std_srvs_generate_messages_py.dir/build.make gazebo_msgs/CMakeFiles/std_srvs_generate_messages_py.dir/build Scanning dependencies of target gazebo_ros_gencfg make[2]: Entering directory `/local/robotpkg/var/tmp/robotpkg/wip/prf-gazebo-ros-pkgs/work/gazebo_ros_pkgs-2.6.7/build' make[2]: Nothing to be done for `gazebo_msgs/CMakeFiles/std_srvs_generate_messages_py.dir/build'. make[2]: Leaving directory `/local/robotpkg/var/tmp/robotpkg/wip/prf-gazebo-ros-pkgs/work/gazebo_ros_pkgs-2.6.7/build' /usr/bin/cmake -E cmake_progress_report /local/robotpkg/var/tmp/robotpkg/wip/prf-gazebo-ros-pkgs/work/gazebo_ros_pkgs-2.6.7/build/CMakeFiles make[2]: Entering directory `/local/robotpkg/var/tmp/robotpkg/wip/prf-gazebo-ros-pkgs/work/gazebo_ros_pkgs-2.6.7/build' make[2]: Nothing to be done for `gazebo_msgs/CMakeFiles/std_srvs_generate_messages_cpp.dir/build'. make[2]: Leaving directory `/local/robotpkg/var/tmp/robotpkg/wip/prf-gazebo-ros-pkgs/work/gazebo_ros_pkgs-2.6.7/build' /usr/bin/cmake -E cmake_progress_report /local/robotpkg/var/tmp/robotpkg/wip/prf-gazebo-ros-pkgs/work/gazebo_ros_pkgs-2.6.7/build/CMakeFiles Scanning dependencies of target std_srvs_generate_messages_lisp [ 0%] make[2]: Leaving directory `/local/robotpkg/var/tmp/robotpkg/wip/prf-gazebo-ros-pkgs/work/gazebo_ros_pkgs-2.6.7/build' make -f gazebo_msgs/CMakeFiles/std_srvs_generate_messages_lisp.dir/build.make gazebo_msgs/CMakeFiles/std_srvs_generate_messages_lisp.dir/build make[2]: Leaving directory `/local/robotpkg/var/tmp/robotpkg/wip/prf-gazebo-ros-pkgs/work/gazebo_ros_pkgs-2.6.7/build' make[2]: Entering directory `/local/robotpkg/var/tmp/robotpkg/wip/prf-gazebo-ros-pkgs/work/gazebo_ros_pkgs-2.6.7/build' make[2]: Nothing to be done for `gazebo_msgs/CMakeFiles/std_srvs_generate_messages_lisp.dir/build'. make[2]: Leaving directory `/local/robotpkg/var/tmp/robotpkg/wip/prf-gazebo-ros-pkgs/work/gazebo_ros_pkgs-2.6.7/build' make -f gazebo_ros/CMakeFiles/gazebo_ros_gencfg.dir/build.make gazebo_ros/CMakeFiles/gazebo_ros_gencfg.dir/build [ 0%] Built target std_srvs_generate_messages_py /usr/bin/cmake -E cmake_progress_report /local/robotpkg/var/tmp/robotpkg/wip/prf-gazebo-ros-pkgs/work/gazebo_ros_pkgs-2.6.7/build/CMakeFiles Built target std_srvs_generate_messages_cpp make -f gazebo_ros/CMakeFiles/roscpp_generate_messages_cpp.dir/build.make gazebo_ros/CMakeFiles/roscpp_generate_messages_cpp.dir/depend make -f gazebo_ros/CMakeFiles/roscpp_generate_messages_py.dir/build.make gazebo_ros/CMakeFiles/roscpp_generate_messages_py.dir/depend make[2]: Entering directory `/local/robotpkg/var/tmp/robotpkg/wip/prf-gazebo-ros-pkgs/work/gazebo_ros_pkgs-2.6.7/build' cd /local/robotpkg/var/tmp/robotpkg/wip/prf-gazebo-ros-pkgs/work/gazebo_ros_pkgs-2.6.7/build && /usr/bin/cmake -E cmake_depends "Unix Makefiles" /local/robotpkg/var/tmp/robotpkg/wip/prf-gazebo-ros-pkgs/work/gazebo_ros_pkgs-2.6.7 /local/robotpkg/var/tmp/robotpkg/wip/prf-gazebo-ros-pkgs/work/gazebo_ros_pkgs-2.6.7/gazebo_ros /local/robotpkg/var/tmp/robotpkg/wip/prf-gazebo-ros-pkgs/work/gazebo_ros_pkgs-2.6.7/build /local/robotpkg/var/tmp/robotpkg/wip/prf-gazebo-ros-pkgs/work/gazebo_ros_pkgs-2.6.7/build/gazebo_ros /local/robotpkg/var/tmp/robotpkg/wip/prf-gazebo-ros-pkgs/work/gazebo_ros_pkgs-2.6.7/build/gazebo_ros/CMakeFiles/roscpp_generate_messages_py.dir/DependInfo.cmake --color= [ 0%] make[2]: Entering directory `/local/robotpkg/var/tmp/robotpkg/wip/prf-gazebo-ros-pkgs/work/gazebo_ros_pkgs-2.6.7/build' cd /local/robotpkg/var/tmp/robotpkg/wip/prf-gazebo-ros-pkgs/work/gazebo_ros_pkgs-2.6.7/build && /usr/bin/cmake -E cmake_depends "Unix Makefiles" /local/robotpkg/var/tmp/robotpkg/wip/prf-gazebo-ros-pkgs/work/gazebo_ros_pkgs-2.6.7 /local/robotpkg/var/tmp/robotpkg/wip/prf-gazebo-ros-pkgs/work/gazebo_ros_pkgs-2.6.7/gazebo_ros /local/robotpkg/var/tmp/robotpkg/wip/prf-gazebo-ros-pkgs/work/gazebo_ros_pkgs-2.6.7/build /local/robotpkg/var/tmp/robotpkg/wip/prf-gazebo-ros-pkgs/work/gazebo_ros_pkgs-2.6.7/build/gazebo_ros /local/robotpkg/var/tmp/robotpkg/wip/prf-gazebo-ros-pkgs/work/gazebo_ros_pkgs-2.6.7/build/gazebo_ros/CMakeFiles/roscpp_generate_messages_cpp.dir/DependInfo.cmake --color= make[2]: Entering directory `/local/robotpkg/var/tmp/robotpkg/wip/prf-gazebo-ros-pkgs/work/gazebo_ros_pkgs-2.6.7/build' /usr/bin/cmake -E cmake_progress_report /local/robotpkg/var/tmp/robotpkg/wip/prf-gazebo-ros-pkgs/work/gazebo_ros_pkgs-2.6.7/build/CMakeFiles 81 Built target std_srvs_generate_messages_lisp make -f gazebo_ros/CMakeFiles/dynamic_reconfigure_generate_messages_cpp.dir/build.make gazebo_ros/CMakeFiles/dynamic_reconfigure_generate_messages_cpp.dir/depend [ 1%] make[2]: Entering directory `/local/robotpkg/var/tmp/robotpkg/wip/prf-gazebo-ros-pkgs/work/gazebo_ros_pkgs-2.6.7/build' cd /local/robotpkg/var/tmp/robotpkg/wip/prf-gazebo-ros-pkgs/work/gazebo_ros_pkgs-2.6.7/build && /usr/bin/cmake -E cmake_depends "Unix Makefiles" /local/robotpkg/var/tmp/robotpkg/wip/prf-gazebo-ros-pkgs/work/gazebo_ros_pkgs-2.6.7 /local/robotpkg/var/tmp/robotpkg/wip/prf-gazebo-ros-pkgs/work/gazebo_ros_pkgs-2.6.7/gazebo_ros /local/robotpkg/var/tmp/robotpkg/wip/prf-gazebo-ros-pkgs/work/gazebo_ros_pkgs-2.6.7/build /local/robotpkg/var/tmp/robotpkg/wip/prf-gazebo-ros-pkgs/work/gazebo_ros_pkgs-2.6.7/build/gazebo_ros /local/robotpkg/var/tmp/robotpkg/wip/prf-gazebo-ros-pkgs/work/gazebo_ros_pkgs-2.6.7/build/gazebo_ros/CMakeFiles/dynamic_reconfigure_generate_messages_cpp.dir/DependInfo.cmake --color= Scanning dependencies of target roscpp_generate_messages_py Generating dynamic reconfigure files from cfg/Physics.cfg: /local/robotpkg/var/tmp/robotpkg/wip/prf-gazebo-ros-pkgs/work/stage/include/gazebo_ros/PhysicsConfig.h /local/robotpkg/var/tmp/robotpkg/wip/prf-gazebo-ros-pkgs/work/stage/lib/python2.7/site-packages/gazebo_ros/cfg/PhysicsConfig.py Scanning dependencies of target roscpp_generate_messages_cpp make[2]: Leaving directory `/local/robotpkg/var/tmp/robotpkg/wip/prf-gazebo-ros-pkgs/work/gazebo_ros_pkgs-2.6.7/build' make[2]: Leaving directory `/local/robotpkg/var/tmp/robotpkg/wip/prf-gazebo-ros-pkgs/work/gazebo_ros_pkgs-2.6.7/build' make -f gazebo_ros/CMakeFiles/roscpp_generate_messages_py.dir/build.make gazebo_ros/CMakeFiles/roscpp_generate_messages_py.dir/build cd /local/robotpkg/var/tmp/robotpkg/wip/prf-gazebo-ros-pkgs/work/gazebo_ros_pkgs-2.6.7/build/gazebo_ros && ../catkin_generated/env_cached.sh /local/robotpkg/var/tmp/robotpkg/wip/prf-gazebo-ros-pkgs/work/gazebo_ros_pkgs-2.6.7/gazebo_ros/cfg/Physics.cfg /opt/ros/hydro/share/dynamic_reconfigure/cmake/.. /local/robotpkg/var/tmp/robotpkg/wip/prf-gazebo-ros-pkgs/work/stage/share/gazebo_ros /local/robotpkg/var/tmp/robotpkg/wip/prf-gazebo-ros-pkgs/work/stage/include/gazebo_ros /local/robotpkg/var/tmp/robotpkg/wip/prf-gazebo-ros-pkgs/work/stage/lib/python2.7/site-packages/gazebo_ros make -f gazebo_ros/CMakeFiles/roscpp_generate_messages_cpp.dir/build.make gazebo_ros/CMakeFiles/roscpp_generate_messages_cpp.dir/build make[2]: Entering directory `/local/robotpkg/var/tmp/robotpkg/wip/prf-gazebo-ros-pkgs/work/gazebo_ros_pkgs-2.6.7/build' make[2]: Nothing to be done for `gazebo_ros/CMakeFiles/roscpp_generate_messages_py.dir/build'. make[2]: Leaving directory `/local/robotpkg/var/tmp/robotpkg/wip/prf-gazebo-ros-pkgs/work/gazebo_ros_pkgs-2.6.7/build' /usr/bin/cmake -E cmake_progress_report /local/robotpkg/var/tmp/robotpkg/wip/prf-gazebo-ros-pkgs/work/gazebo_ros_pkgs-2.6.7/build/CMakeFiles make[2]: Entering directory `/local/robotpkg/var/tmp/robotpkg/wip/prf-gazebo-ros-pkgs/work/gazebo_ros_pkgs-2.6.7/build' make[2]: Nothing to be done for `gazebo_ros/CMakeFiles/roscpp_generate_messages_cpp.dir/build'. make[2]: Leaving directory `/local/robotpkg/var/tmp/robotpkg/wip/prf-gazebo-ros-pkgs/work/gazebo_ros_pkgs-2.6.7/build' Scanning dependencies of target dynamic_reconfigure_generate_messages_cpp make[2]: Leaving directory `/local/robotpkg/var/tmp/robotpkg/wip/prf-gazebo-ros-pkgs/work/gazebo_ros_pkgs-2.6.7/build' make -f gazebo_ros/CMakeFiles/dynamic_reconfigure_generate_messages_cpp.dir/build.make gazebo_ros/CMakeFiles/dynamic_reconfigure_generate_messages_cpp.dir/build /usr/bin/cmake -E cmake_progress_report /local/robotpkg/var/tmp/robotpkg/wip/prf-gazebo-ros-pkgs/work/gazebo_ros_pkgs-2.6.7/build/CMakeFiles make[2]: Entering directory `/local/robotpkg/var/tmp/robotpkg/wip/prf-gazebo-ros-pkgs/work/gazebo_ros_pkgs-2.6.7/build' make[2]: Nothing to be done for `gazebo_ros/CMakeFiles/dynamic_reconfigure_generate_messages_cpp.dir/build'. make[2]: Leaving directory `/local/robotpkg/var/tmp/robotpkg/wip/prf-gazebo-ros-pkgs/work/gazebo_ros_pkgs-2.6.7/build' /usr/bin/cmake -E cmake_progress_report /local/robotpkg/var/tmp/robotpkg/wip/prf-gazebo-ros-pkgs/work/gazebo_ros_pkgs-2.6.7/build/CMakeFiles [ 1%] [ 1%] [ 1%] Built target roscpp_generate_messages_py Built target roscpp_generate_messages_cpp Built target dynamic_reconfigure_generate_messages_cpp make -f gazebo_ros/CMakeFiles/tf_generate_messages_py.dir/build.make gazebo_ros/CMakeFiles/tf_generate_messages_py.dir/depend make[2]: Entering directory `/local/robotpkg/var/tmp/robotpkg/wip/prf-gazebo-ros-pkgs/work/gazebo_ros_pkgs-2.6.7/build' cd /local/robotpkg/var/tmp/robotpkg/wip/prf-gazebo-ros-pkgs/work/gazebo_ros_pkgs-2.6.7/build && /usr/bin/cmake -E cmake_depends "Unix Makefiles" /local/robotpkg/var/tmp/robotpkg/wip/prf-gazebo-ros-pkgs/work/gazebo_ros_pkgs-2.6.7 /local/robotpkg/var/tmp/robotpkg/wip/prf-gazebo-ros-pkgs/work/gazebo_ros_pkgs-2.6.7/gazebo_ros /local/robotpkg/var/tmp/robotpkg/wip/prf-gazebo-ros-pkgs/work/gazebo_ros_pkgs-2.6.7/build /local/robotpkg/var/tmp/robotpkg/wip/prf-gazebo-ros-pkgs/work/gazebo_ros_pkgs-2.6.7/build/gazebo_ros /local/robotpkg/var/tmp/robotpkg/wip/prf-gazebo-ros-pkgs/work/gazebo_ros_pkgs-2.6.7/build/gazebo_ros/CMakeFiles/tf_generate_messages_py.dir/DependInfo.cmake --color= make -f gazebo_ros/CMakeFiles/rosgraph_msgs_generate_messages_lisp.dir/build.make gazebo_ros/CMakeFiles/rosgraph_msgs_generate_messages_lisp.dir/depend make -f gazebo_ros/CMakeFiles/actionlib_generate_messages_cpp.dir/build.make gazebo_ros/CMakeFiles/actionlib_generate_messages_cpp.dir/depend make[2]: Entering directory `/local/robotpkg/var/tmp/robotpkg/wip/prf-gazebo-ros-pkgs/work/gazebo_ros_pkgs-2.6.7/build' cd /local/robotpkg/var/tmp/robotpkg/wip/prf-gazebo-ros-pkgs/work/gazebo_ros_pkgs-2.6.7/build && /usr/bin/cmake -E cmake_depends "Unix Makefiles" /local/robotpkg/var/tmp/robotpkg/wip/prf-gazebo-ros-pkgs/work/gazebo_ros_pkgs-2.6.7 /local/robotpkg/var/tmp/robotpkg/wip/prf-gazebo-ros-pkgs/work/gazebo_ros_pkgs-2.6.7/gazebo_ros /local/robotpkg/var/tmp/robotpkg/wip/prf-gazebo-ros-pkgs/work/gazebo_ros_pkgs-2.6.7/build /local/robotpkg/var/tmp/robotpkg/wip/prf-gazebo-ros-pkgs/work/gazebo_ros_pkgs-2.6.7/build/gazebo_ros /local/robotpkg/var/tmp/robotpkg/wip/prf-gazebo-ros-pkgs/work/gazebo_ros_pkgs-2.6.7/build/gazebo_ros/CMakeFiles/rosgraph_msgs_generate_messages_lisp.dir/DependInfo.cmake --color= make[2]: Entering directory `/local/robotpkg/var/tmp/robotpkg/wip/prf-gazebo-ros-pkgs/work/gazebo_ros_pkgs-2.6.7/build' cd /local/robotpkg/var/tmp/robotpkg/wip/prf-gazebo-ros-pkgs/work/gazebo_ros_pkgs-2.6.7/build && /usr/bin/cmake -E cmake_depends "Unix Makefiles" /local/robotpkg/var/tmp/robotpkg/wip/prf-gazebo-ros-pkgs/work/gazebo_ros_pkgs-2.6.7 /local/robotpkg/var/tmp/robotpkg/wip/prf-gazebo-ros-pkgs/work/gazebo_ros_pkgs-2.6.7/gazebo_ros /local/robotpkg/var/tmp/robotpkg/wip/prf-gazebo-ros-pkgs/work/gazebo_ros_pkgs-2.6.7/build /local/robotpkg/var/tmp/robotpkg/wip/prf-gazebo-ros-pkgs/work/gazebo_ros_pkgs-2.6.7/build/gazebo_ros /local/robotpkg/var/tmp/robotpkg/wip/prf-gazebo-ros-pkgs/work/gazebo_ros_pkgs-2.6.7/build/gazebo_ros/CMakeFiles/actionlib_generate_messages_cpp.dir/DependInfo.cmake --color= Scanning dependencies of target tf_generate_messages_py make[2]: Leaving directory `/local/robotpkg/var/tmp/robotpkg/wip/prf-gazebo-ros-pkgs/work/gazebo_ros_pkgs-2.6.7/build' make -f gazebo_ros/CMakeFiles/tf_generate_messages_py.dir/build.make gazebo_ros/CMakeFiles/tf_generate_messages_py.dir/build make[2]: Entering directory `/local/robotpkg/var/tmp/robotpkg/wip/prf-gazebo-ros-pkgs/work/gazebo_ros_pkgs-2.6.7/build' make[2]: Nothing to be done for `gazebo_ros/CMakeFiles/tf_generate_messages_py.dir/build'. make[2]: Leaving directory `/local/robotpkg/var/tmp/robotpkg/wip/prf-gazebo-ros-pkgs/work/gazebo_ros_pkgs-2.6.7/build' /usr/bin/cmake -E cmake_progress_report /local/robotpkg/var/tmp/robotpkg/wip/prf-gazebo-ros-pkgs/work/gazebo_ros_pkgs-2.6.7/build/CMakeFiles Scanning dependencies of target actionlib_generate_messages_cpp make[2]: Leaving directory `/local/robotpkg/var/tmp/robotpkg/wip/prf-gazebo-ros-pkgs/work/gazebo_ros_pkgs-2.6.7/build' make -f gazebo_ros/CMakeFiles/actionlib_generate_messages_cpp.dir/build.make gazebo_ros/CMakeFiles/actionlib_generate_messages_cpp.dir/build [ 1%] Scanning dependencies of target rosgraph_msgs_generate_messages_lisp make[2]: Leaving directory `/local/robotpkg/var/tmp/robotpkg/wip/prf-gazebo-ros-pkgs/work/gazebo_ros_pkgs-2.6.7/build' make[2]: Entering directory `/local/robotpkg/var/tmp/robotpkg/wip/prf-gazebo-ros-pkgs/work/gazebo_ros_pkgs-2.6.7/build' make[2]: Nothing to be done for `gazebo_ros/CMakeFiles/actionlib_generate_messages_cpp.dir/build'. make[2]: Leaving directory `/local/robotpkg/var/tmp/robotpkg/wip/prf-gazebo-ros-pkgs/work/gazebo_ros_pkgs-2.6.7/build' Built target tf_generate_messages_py make -f gazebo_ros/CMakeFiles/rosgraph_msgs_generate_messages_lisp.dir/build.make gazebo_ros/CMakeFiles/rosgraph_msgs_generate_messages_lisp.dir/build make[2]: Entering directory `/local/robotpkg/var/tmp/robotpkg/wip/prf-gazebo-ros-pkgs/work/gazebo_ros_pkgs-2.6.7/build' make[2]: Nothing to be done for `gazebo_ros/CMakeFiles/rosgraph_msgs_generate_messages_lisp.dir/build'. make[2]: Leaving directory `/local/robotpkg/var/tmp/robotpkg/wip/prf-gazebo-ros-pkgs/work/gazebo_ros_pkgs-2.6.7/build' /usr/bin/cmake -E cmake_progress_report /local/robotpkg/var/tmp/robotpkg/wip/prf-gazebo-ros-pkgs/work/gazebo_ros_pkgs-2.6.7/build/CMakeFiles /usr/bin/cmake -E cmake_progress_report /local/robotpkg/var/tmp/robotpkg/wip/prf-gazebo-ros-pkgs/work/gazebo_ros_pkgs-2.6.7/build/CMakeFiles [ 1%] [ 1%] Built target rosgraph_msgs_generate_messages_lisp make -f gazebo_ros/CMakeFiles/rosgraph_msgs_generate_messages_py.dir/build.make gazebo_ros/CMakeFiles/rosgraph_msgs_generate_messages_py.dir/depend make[2]: Entering directory `/local/robotpkg/var/tmp/robotpkg/wip/prf-gazebo-ros-pkgs/work/gazebo_ros_pkgs-2.6.7/build' cd /local/robotpkg/var/tmp/robotpkg/wip/prf-gazebo-ros-pkgs/work/gazebo_ros_pkgs-2.6.7/build && /usr/bin/cmake -E cmake_depends "Unix Makefiles" /local/robotpkg/var/tmp/robotpkg/wip/prf-gazebo-ros-pkgs/work/gazebo_ros_pkgs-2.6.7 /local/robotpkg/var/tmp/robotpkg/wip/prf-gazebo-ros-pkgs/work/gazebo_ros_pkgs-2.6.7/gazebo_ros /local/robotpkg/var/tmp/robotpkg/wip/prf-gazebo-ros-pkgs/work/gazebo_ros_pkgs-2.6.7/build /local/robotpkg/var/tmp/robotpkg/wip/prf-gazebo-ros-pkgs/work/gazebo_ros_pkgs-2.6.7/build/gazebo_ros /local/robotpkg/var/tmp/robotpkg/wip/prf-gazebo-ros-pkgs/work/gazebo_ros_pkgs-2.6.7/build/gazebo_ros/CMakeFiles/rosgraph_msgs_generate_messages_py.dir/DependInfo.cmake --color= make -f gazebo_ros/CMakeFiles/tf_generate_messages_lisp.dir/build.make gazebo_ros/CMakeFiles/tf_generate_messages_lisp.dir/depend Built target actionlib_generate_messages_cpp make[2]: Entering directory `/local/robotpkg/var/tmp/robotpkg/wip/prf-gazebo-ros-pkgs/work/gazebo_ros_pkgs-2.6.7/build' cd /local/robotpkg/var/tmp/robotpkg/wip/prf-gazebo-ros-pkgs/work/gazebo_ros_pkgs-2.6.7/build && /usr/bin/cmake -E cmake_depends "Unix Makefiles" /local/robotpkg/var/tmp/robotpkg/wip/prf-gazebo-ros-pkgs/work/gazebo_ros_pkgs-2.6.7 /local/robotpkg/var/tmp/robotpkg/wip/prf-gazebo-ros-pkgs/work/gazebo_ros_pkgs-2.6.7/gazebo_ros /local/robotpkg/var/tmp/robotpkg/wip/prf-gazebo-ros-pkgs/work/gazebo_ros_pkgs-2.6.7/build /local/robotpkg/var/tmp/robotpkg/wip/prf-gazebo-ros-pkgs/work/gazebo_ros_pkgs-2.6.7/build/gazebo_ros /local/robotpkg/var/tmp/robotpkg/wip/prf-gazebo-ros-pkgs/work/gazebo_ros_pkgs-2.6.7/build/gazebo_ros/CMakeFiles/tf_generate_messages_lisp.dir/DependInfo.cmake --color= make -f gazebo_ros/CMakeFiles/actionlib_generate_messages_lisp.dir/build.make gazebo_ros/CMakeFiles/actionlib_generate_messages_lisp.dir/depend make[2]: Entering directory `/local/robotpkg/var/tmp/robotpkg/wip/prf-gazebo-ros-pkgs/work/gazebo_ros_pkgs-2.6.7/build' cd /local/robotpkg/var/tmp/robotpkg/wip/prf-gazebo-ros-pkgs/work/gazebo_ros_pkgs-2.6.7/build && /usr/bin/cmake -E cmake_depends "Unix Makefiles" /local/robotpkg/var/tmp/robotpkg/wip/prf-gazebo-ros-pkgs/work/gazebo_ros_pkgs-2.6.7 /local/robotpkg/var/tmp/robotpkg/wip/prf-gazebo-ros-pkgs/work/gazebo_ros_pkgs-2.6.7/gazebo_ros /local/robotpkg/var/tmp/robotpkg/wip/prf-gazebo-ros-pkgs/work/gazebo_ros_pkgs-2.6.7/build /local/robotpkg/var/tmp/robotpkg/wip/prf-gazebo-ros-pkgs/work/gazebo_ros_pkgs-2.6.7/build/gazebo_ros /local/robotpkg/var/tmp/robotpkg/wip/prf-gazebo-ros-pkgs/work/gazebo_ros_pkgs-2.6.7/build/gazebo_ros/CMakeFiles/actionlib_generate_messages_lisp.dir/DependInfo.cmake --color= Scanning dependencies of target tf_generate_messages_lisp make[2]: Leaving directory `/local/robotpkg/var/tmp/robotpkg/wip/prf-gazebo-ros-pkgs/work/gazebo_ros_pkgs-2.6.7/build' make -f gazebo_ros/CMakeFiles/tf_generate_messages_lisp.dir/build.make gazebo_ros/CMakeFiles/tf_generate_messages_lisp.dir/build Scanning dependencies of target actionlib_generate_messages_lisp make[2]: Entering directory `/local/robotpkg/var/tmp/robotpkg/wip/prf-gazebo-ros-pkgs/work/gazebo_ros_pkgs-2.6.7/build' make[2]: Nothing to be done for `gazebo_ros/CMakeFiles/tf_generate_messages_lisp.dir/build'. make[2]: Leaving directory `/local/robotpkg/var/tmp/robotpkg/wip/prf-gazebo-ros-pkgs/work/gazebo_ros_pkgs-2.6.7/build' make[2]: Leaving directory `/local/robotpkg/var/tmp/robotpkg/wip/prf-gazebo-ros-pkgs/work/gazebo_ros_pkgs-2.6.7/build' make -f gazebo_ros/CMakeFiles/actionlib_generate_messages_lisp.dir/build.make gazebo_ros/CMakeFiles/actionlib_generate_messages_lisp.dir/build Scanning dependencies of target rosgraph_msgs_generate_messages_py make[2]: Entering directory `/local/robotpkg/var/tmp/robotpkg/wip/prf-gazebo-ros-pkgs/work/gazebo_ros_pkgs-2.6.7/build' make[2]: Nothing to be done for `gazebo_ros/CMakeFiles/actionlib_generate_messages_lisp.dir/build'. make[2]: Leaving directory `/local/robotpkg/var/tmp/robotpkg/wip/prf-gazebo-ros-pkgs/work/gazebo_ros_pkgs-2.6.7/build' /usr/bin/cmake -E cmake_progress_report /local/robotpkg/var/tmp/robotpkg/wip/prf-gazebo-ros-pkgs/work/gazebo_ros_pkgs-2.6.7/build/CMakeFiles make[2]: Leaving directory `/local/robotpkg/var/tmp/robotpkg/wip/prf-gazebo-ros-pkgs/work/gazebo_ros_pkgs-2.6.7/build' make -f gazebo_ros/CMakeFiles/rosgraph_msgs_generate_messages_py.dir/build.make gazebo_ros/CMakeFiles/rosgraph_msgs_generate_messages_py.dir/build make[2]: Entering directory `/local/robotpkg/var/tmp/robotpkg/wip/prf-gazebo-ros-pkgs/work/gazebo_ros_pkgs-2.6.7/build' [ 1%] make[2]: Nothing to be done for `gazebo_ros/CMakeFiles/rosgraph_msgs_generate_messages_py.dir/build'. make[2]: Leaving directory `/local/robotpkg/var/tmp/robotpkg/wip/prf-gazebo-ros-pkgs/work/gazebo_ros_pkgs-2.6.7/build' /usr/bin/cmake -E cmake_progress_report /local/robotpkg/var/tmp/robotpkg/wip/prf-gazebo-ros-pkgs/work/gazebo_ros_pkgs-2.6.7/build/CMakeFiles /usr/bin/cmake -E cmake_progress_report /local/robotpkg/var/tmp/robotpkg/wip/prf-gazebo-ros-pkgs/work/gazebo_ros_pkgs-2.6.7/build/CMakeFiles Built target tf_generate_messages_lisp make -f gazebo_ros/CMakeFiles/tf2_msgs_generate_messages_lisp.dir/build.make gazebo_ros/CMakeFiles/tf2_msgs_generate_messages_lisp.dir/depend make[2]: Entering directory `/local/robotpkg/var/tmp/robotpkg/wip/prf-gazebo-ros-pkgs/work/gazebo_ros_pkgs-2.6.7/build' cd /local/robotpkg/var/tmp/robotpkg/wip/prf-gazebo-ros-pkgs/work/gazebo_ros_pkgs-2.6.7/build && /usr/bin/cmake -E cmake_depends "Unix Makefiles" /local/robotpkg/var/tmp/robotpkg/wip/prf-gazebo-ros-pkgs/work/gazebo_ros_pkgs-2.6.7 /local/robotpkg/var/tmp/robotpkg/wip/prf-gazebo-ros-pkgs/work/gazebo_ros_pkgs-2.6.7/gazebo_ros /local/robotpkg/var/tmp/robotpkg/wip/prf-gazebo-ros-pkgs/work/gazebo_ros_pkgs-2.6.7/build /local/robotpkg/var/tmp/robotpkg/wip/prf-gazebo-ros-pkgs/work/gazebo_ros_pkgs-2.6.7/build/gazebo_ros /local/robotpkg/var/tmp/robotpkg/wip/prf-gazebo-ros-pkgs/work/gazebo_ros_pkgs-2.6.7/build/gazebo_ros/CMakeFiles/tf2_msgs_generate_messages_lisp.dir/DependInfo.cmake --color= [ 1%] [ 1%] Built target rosgraph_msgs_generate_messages_py make -f gazebo_ros/CMakeFiles/dynamic_reconfigure_generate_messages_lisp.dir/build.make gazebo_ros/CMakeFiles/dynamic_reconfigure_generate_messages_lisp.dir/depend Built target actionlib_generate_messages_lisp make -f gazebo_ros/CMakeFiles/rosgraph_msgs_generate_messages_cpp.dir/build.make gazebo_ros/CMakeFiles/rosgraph_msgs_generate_messages_cpp.dir/depend make[2]: Entering directory `/local/robotpkg/var/tmp/robotpkg/wip/prf-gazebo-ros-pkgs/work/gazebo_ros_pkgs-2.6.7/build' cd /local/robotpkg/var/tmp/robotpkg/wip/prf-gazebo-ros-pkgs/work/gazebo_ros_pkgs-2.6.7/build && /usr/bin/cmake -E cmake_depends "Unix Makefiles" /local/robotpkg/var/tmp/robotpkg/wip/prf-gazebo-ros-pkgs/work/gazebo_ros_pkgs-2.6.7 /local/robotpkg/var/tmp/robotpkg/wip/prf-gazebo-ros-pkgs/work/gazebo_ros_pkgs-2.6.7/gazebo_ros /local/robotpkg/var/tmp/robotpkg/wip/prf-gazebo-ros-pkgs/work/gazebo_ros_pkgs-2.6.7/build /local/robotpkg/var/tmp/robotpkg/wip/prf-gazebo-ros-pkgs/work/gazebo_ros_pkgs-2.6.7/build/gazebo_ros /local/robotpkg/var/tmp/robotpkg/wip/prf-gazebo-ros-pkgs/work/gazebo_ros_pkgs-2.6.7/build/gazebo_ros/CMakeFiles/dynamic_reconfigure_generate_messages_lisp.dir/DependInfo.cmake --color= make[2]: Entering directory `/local/robotpkg/var/tmp/robotpkg/wip/prf-gazebo-ros-pkgs/work/gazebo_ros_pkgs-2.6.7/build' cd /local/robotpkg/var/tmp/robotpkg/wip/prf-gazebo-ros-pkgs/work/gazebo_ros_pkgs-2.6.7/build && /usr/bin/cmake -E cmake_depends "Unix Makefiles" /local/robotpkg/var/tmp/robotpkg/wip/prf-gazebo-ros-pkgs/work/gazebo_ros_pkgs-2.6.7 /local/robotpkg/var/tmp/robotpkg/wip/prf-gazebo-ros-pkgs/work/gazebo_ros_pkgs-2.6.7/gazebo_ros /local/robotpkg/var/tmp/robotpkg/wip/prf-gazebo-ros-pkgs/work/gazebo_ros_pkgs-2.6.7/build /local/robotpkg/var/tmp/robotpkg/wip/prf-gazebo-ros-pkgs/work/gazebo_ros_pkgs-2.6.7/build/gazebo_ros /local/robotpkg/var/tmp/robotpkg/wip/prf-gazebo-ros-pkgs/work/gazebo_ros_pkgs-2.6.7/build/gazebo_ros/CMakeFiles/rosgraph_msgs_generate_messages_cpp.dir/DependInfo.cmake --color= Scanning dependencies of target tf2_msgs_generate_messages_lisp Scanning dependencies of target dynamic_reconfigure_generate_messages_lisp make[2]: Leaving directory `/local/robotpkg/var/tmp/robotpkg/wip/prf-gazebo-ros-pkgs/work/gazebo_ros_pkgs-2.6.7/build' make[2]: Leaving directory `/local/robotpkg/var/tmp/robotpkg/wip/prf-gazebo-ros-pkgs/work/gazebo_ros_pkgs-2.6.7/build' make -f gazebo_ros/CMakeFiles/dynamic_reconfigure_generate_messages_lisp.dir/build.make gazebo_ros/CMakeFiles/dynamic_reconfigure_generate_messages_lisp.dir/build make -f gazebo_ros/CMakeFiles/tf2_msgs_generate_messages_lisp.dir/build.make gazebo_ros/CMakeFiles/tf2_msgs_generate_messages_lisp.dir/build make[2]: Entering directory `/local/robotpkg/var/tmp/robotpkg/wip/prf-gazebo-ros-pkgs/work/gazebo_ros_pkgs-2.6.7/build' make[2]: Entering directory `/local/robotpkg/var/tmp/robotpkg/wip/prf-gazebo-ros-pkgs/work/gazebo_ros_pkgs-2.6.7/build' make[2]: Nothing to be done for `gazebo_ros/CMakeFiles/tf2_msgs_generate_messages_lisp.dir/build'. make[2]: Leaving directory `/local/robotpkg/var/tmp/robotpkg/wip/prf-gazebo-ros-pkgs/work/gazebo_ros_pkgs-2.6.7/build' /usr/bin/cmake -E cmake_progress_report /local/robotpkg/var/tmp/robotpkg/wip/prf-gazebo-ros-pkgs/work/gazebo_ros_pkgs-2.6.7/build/CMakeFiles make[2]: Nothing to be done for `gazebo_ros/CMakeFiles/dynamic_reconfigure_generate_messages_lisp.dir/build'. make[2]: Leaving directory `/local/robotpkg/var/tmp/robotpkg/wip/prf-gazebo-ros-pkgs/work/gazebo_ros_pkgs-2.6.7/build' /usr/bin/cmake -E cmake_progress_report /local/robotpkg/var/tmp/robotpkg/wip/prf-gazebo-ros-pkgs/work/gazebo_ros_pkgs-2.6.7/build/CMakeFiles [ 1%] Scanning dependencies of target rosgraph_msgs_generate_messages_cpp make[2]: Leaving directory `/local/robotpkg/var/tmp/robotpkg/wip/prf-gazebo-ros-pkgs/work/gazebo_ros_pkgs-2.6.7/build' make -f gazebo_ros/CMakeFiles/rosgraph_msgs_generate_messages_cpp.dir/build.make gazebo_ros/CMakeFiles/rosgraph_msgs_generate_messages_cpp.dir/build make[2]: Entering directory `/local/robotpkg/var/tmp/robotpkg/wip/prf-gazebo-ros-pkgs/work/gazebo_ros_pkgs-2.6.7/build' make[2]: Nothing to be done for `gazebo_ros/CMakeFiles/rosgraph_msgs_generate_messages_cpp.dir/build'. make[2]: Leaving directory `/local/robotpkg/var/tmp/robotpkg/wip/prf-gazebo-ros-pkgs/work/gazebo_ros_pkgs-2.6.7/build' Built target tf2_msgs_generate_messages_lisp /usr/bin/cmake -E cmake_progress_report /local/robotpkg/var/tmp/robotpkg/wip/prf-gazebo-ros-pkgs/work/gazebo_ros_pkgs-2.6.7/build/CMakeFiles [ 1%] Built target dynamic_reconfigure_generate_messages_lisp make -f gazebo_ros/CMakeFiles/actionlib_generate_messages_py.dir/build.make gazebo_ros/CMakeFiles/actionlib_generate_messages_py.dir/depend make[2]: Entering directory `/local/robotpkg/var/tmp/robotpkg/wip/prf-gazebo-ros-pkgs/work/gazebo_ros_pkgs-2.6.7/build' cd /local/robotpkg/var/tmp/robotpkg/wip/prf-gazebo-ros-pkgs/work/gazebo_ros_pkgs-2.6.7/build && /usr/bin/cmake -E cmake_depends "Unix Makefiles" /local/robotpkg/var/tmp/robotpkg/wip/prf-gazebo-ros-pkgs/work/gazebo_ros_pkgs-2.6.7 /local/robotpkg/var/tmp/robotpkg/wip/prf-gazebo-ros-pkgs/work/gazebo_ros_pkgs-2.6.7/gazebo_ros /local/robotpkg/var/tmp/robotpkg/wip/prf-gazebo-ros-pkgs/work/gazebo_ros_pkgs-2.6.7/build /local/robotpkg/var/tmp/robotpkg/wip/prf-gazebo-ros-pkgs/work/gazebo_ros_pkgs-2.6.7/build/gazebo_ros /local/robotpkg/var/tmp/robotpkg/wip/prf-gazebo-ros-pkgs/work/gazebo_ros_pkgs-2.6.7/build/gazebo_ros/CMakeFiles/actionlib_generate_messages_py.dir/DependInfo.cmake --color= make -f gazebo_ros/CMakeFiles/dynamic_reconfigure_generate_messages_py.dir/build.make gazebo_ros/CMakeFiles/dynamic_reconfigure_generate_messages_py.dir/depend make[2]: Entering directory `/local/robotpkg/var/tmp/robotpkg/wip/prf-gazebo-ros-pkgs/work/gazebo_ros_pkgs-2.6.7/build' cd /local/robotpkg/var/tmp/robotpkg/wip/prf-gazebo-ros-pkgs/work/gazebo_ros_pkgs-2.6.7/build && /usr/bin/cmake -E cmake_depends "Unix Makefiles" /local/robotpkg/var/tmp/robotpkg/wip/prf-gazebo-ros-pkgs/work/gazebo_ros_pkgs-2.6.7 /local/robotpkg/var/tmp/robotpkg/wip/prf-gazebo-ros-pkgs/work/gazebo_ros_pkgs-2.6.7/gazebo_ros /local/robotpkg/var/tmp/robotpkg/wip/prf-gazebo-ros-pkgs/work/gazebo_ros_pkgs-2.6.7/build /local/robotpkg/var/tmp/robotpkg/wip/prf-gazebo-ros-pkgs/work/gazebo_ros_pkgs-2.6.7/build/gazebo_ros /local/robotpkg/var/tmp/robotpkg/wip/prf-gazebo-ros-pkgs/work/gazebo_ros_pkgs-2.6.7/build/gazebo_ros/CMakeFiles/dynamic_reconfigure_generate_messages_py.dir/DependInfo.cmake --color= [ 1%] Scanning dependencies of target actionlib_generate_messages_py Built target rosgraph_msgs_generate_messages_cpp make -f gazebo_ros/CMakeFiles/actionlib_msgs_generate_messages_cpp.dir/build.make gazebo_ros/CMakeFiles/actionlib_msgs_generate_messages_cpp.dir/depend make[2]: Leaving directory `/local/robotpkg/var/tmp/robotpkg/wip/prf-gazebo-ros-pkgs/work/gazebo_ros_pkgs-2.6.7/build' make[2]: Entering directory `/local/robotpkg/var/tmp/robotpkg/wip/prf-gazebo-ros-pkgs/work/gazebo_ros_pkgs-2.6.7/build' cd /local/robotpkg/var/tmp/robotpkg/wip/prf-gazebo-ros-pkgs/work/gazebo_ros_pkgs-2.6.7/build && /usr/bin/cmake -E cmake_depends "Unix Makefiles" /local/robotpkg/var/tmp/robotpkg/wip/prf-gazebo-ros-pkgs/work/gazebo_ros_pkgs-2.6.7 /local/robotpkg/var/tmp/robotpkg/wip/prf-gazebo-ros-pkgs/work/gazebo_ros_pkgs-2.6.7/gazebo_ros /local/robotpkg/var/tmp/robotpkg/wip/prf-gazebo-ros-pkgs/work/gazebo_ros_pkgs-2.6.7/build /local/robotpkg/var/tmp/robotpkg/wip/prf-gazebo-ros-pkgs/work/gazebo_ros_pkgs-2.6.7/build/gazebo_ros /local/robotpkg/var/tmp/robotpkg/wip/prf-gazebo-ros-pkgs/work/gazebo_ros_pkgs-2.6.7/build/gazebo_ros/CMakeFiles/actionlib_msgs_generate_messages_cpp.dir/DependInfo.cmake --color= make -f gazebo_ros/CMakeFiles/actionlib_generate_messages_py.dir/build.make gazebo_ros/CMakeFiles/actionlib_generate_messages_py.dir/build Scanning dependencies of target dynamic_reconfigure_generate_messages_py make[2]: Leaving directory `/local/robotpkg/var/tmp/robotpkg/wip/prf-gazebo-ros-pkgs/work/gazebo_ros_pkgs-2.6.7/build' make -f gazebo_ros/CMakeFiles/dynamic_reconfigure_generate_messages_py.dir/build.make gazebo_ros/CMakeFiles/dynamic_reconfigure_generate_messages_py.dir/build make[2]: Entering directory `/local/robotpkg/var/tmp/robotpkg/wip/prf-gazebo-ros-pkgs/work/gazebo_ros_pkgs-2.6.7/build' make[2]: Nothing to be done for `gazebo_ros/CMakeFiles/actionlib_generate_messages_py.dir/build'. make[2]: Leaving directory `/local/robotpkg/var/tmp/robotpkg/wip/prf-gazebo-ros-pkgs/work/gazebo_ros_pkgs-2.6.7/build' /usr/bin/cmake -E cmake_progress_report /local/robotpkg/var/tmp/robotpkg/wip/prf-gazebo-ros-pkgs/work/gazebo_ros_pkgs-2.6.7/build/CMakeFiles make[2]: Entering directory `/local/robotpkg/var/tmp/robotpkg/wip/prf-gazebo-ros-pkgs/work/gazebo_ros_pkgs-2.6.7/build' make[2]: Nothing to be done for `gazebo_ros/CMakeFiles/dynamic_reconfigure_generate_messages_py.dir/build'. make[2]: Leaving directory `/local/robotpkg/var/tmp/robotpkg/wip/prf-gazebo-ros-pkgs/work/gazebo_ros_pkgs-2.6.7/build' /usr/bin/cmake -E cmake_progress_report /local/robotpkg/var/tmp/robotpkg/wip/prf-gazebo-ros-pkgs/work/gazebo_ros_pkgs-2.6.7/build/CMakeFiles [ 1%] Scanning dependencies of target actionlib_msgs_generate_messages_cpp [ 1%] make[2]: Leaving directory `/local/robotpkg/var/tmp/robotpkg/wip/prf-gazebo-ros-pkgs/work/gazebo_ros_pkgs-2.6.7/build' make -f gazebo_ros/CMakeFiles/actionlib_msgs_generate_messages_cpp.dir/build.make gazebo_ros/CMakeFiles/actionlib_msgs_generate_messages_cpp.dir/build Built target dynamic_reconfigure_generate_messages_py make[2]: Entering directory `/local/robotpkg/var/tmp/robotpkg/wip/prf-gazebo-ros-pkgs/work/gazebo_ros_pkgs-2.6.7/build' make[2]: Nothing to be done for `gazebo_ros/CMakeFiles/actionlib_msgs_generate_messages_cpp.dir/build'. make[2]: Leaving directory `/local/robotpkg/var/tmp/robotpkg/wip/prf-gazebo-ros-pkgs/work/gazebo_ros_pkgs-2.6.7/build' Built target actionlib_generate_messages_py /usr/bin/cmake -E cmake_progress_report /local/robotpkg/var/tmp/robotpkg/wip/prf-gazebo-ros-pkgs/work/gazebo_ros_pkgs-2.6.7/build/CMakeFiles make -f gazebo_ros/CMakeFiles/actionlib_msgs_generate_messages_lisp.dir/build.make gazebo_ros/CMakeFiles/actionlib_msgs_generate_messages_lisp.dir/depend make[2]: Entering directory `/local/robotpkg/var/tmp/robotpkg/wip/prf-gazebo-ros-pkgs/work/gazebo_ros_pkgs-2.6.7/build' cd /local/robotpkg/var/tmp/robotpkg/wip/prf-gazebo-ros-pkgs/work/gazebo_ros_pkgs-2.6.7/build && /usr/bin/cmake -E cmake_depends "Unix Makefiles" /local/robotpkg/var/tmp/robotpkg/wip/prf-gazebo-ros-pkgs/work/gazebo_ros_pkgs-2.6.7 /local/robotpkg/var/tmp/robotpkg/wip/prf-gazebo-ros-pkgs/work/gazebo_ros_pkgs-2.6.7/gazebo_ros /local/robotpkg/var/tmp/robotpkg/wip/prf-gazebo-ros-pkgs/work/gazebo_ros_pkgs-2.6.7/build /local/robotpkg/var/tmp/robotpkg/wip/prf-gazebo-ros-pkgs/work/gazebo_ros_pkgs-2.6.7/build/gazebo_ros /local/robotpkg/var/tmp/robotpkg/wip/prf-gazebo-ros-pkgs/work/gazebo_ros_pkgs-2.6.7/build/gazebo_ros/CMakeFiles/actionlib_msgs_generate_messages_lisp.dir/DependInfo.cmake --color= make -f gazebo_ros/CMakeFiles/actionlib_msgs_generate_messages_py.dir/build.make gazebo_ros/CMakeFiles/actionlib_msgs_generate_messages_py.dir/depend make[2]: Entering directory `/local/robotpkg/var/tmp/robotpkg/wip/prf-gazebo-ros-pkgs/work/gazebo_ros_pkgs-2.6.7/build' cd /local/robotpkg/var/tmp/robotpkg/wip/prf-gazebo-ros-pkgs/work/gazebo_ros_pkgs-2.6.7/build && /usr/bin/cmake -E cmake_depends "Unix Makefiles" /local/robotpkg/var/tmp/robotpkg/wip/prf-gazebo-ros-pkgs/work/gazebo_ros_pkgs-2.6.7 /local/robotpkg/var/tmp/robotpkg/wip/prf-gazebo-ros-pkgs/work/gazebo_ros_pkgs-2.6.7/gazebo_ros /local/robotpkg/var/tmp/robotpkg/wip/prf-gazebo-ros-pkgs/work/gazebo_ros_pkgs-2.6.7/build /local/robotpkg/var/tmp/robotpkg/wip/prf-gazebo-ros-pkgs/work/gazebo_ros_pkgs-2.6.7/build/gazebo_ros /local/robotpkg/var/tmp/robotpkg/wip/prf-gazebo-ros-pkgs/work/gazebo_ros_pkgs-2.6.7/build/gazebo_ros/CMakeFiles/actionlib_msgs_generate_messages_py.dir/DependInfo.cmake --color= Scanning dependencies of target actionlib_msgs_generate_messages_lisp Scanning dependencies of target actionlib_msgs_generate_messages_py [ 1%] Built target actionlib_msgs_generate_messages_cpp make -f gazebo_ros/CMakeFiles/dynamic_reconfigure_gencfg.dir/build.make gazebo_ros/CMakeFiles/dynamic_reconfigure_gencfg.dir/depend make[2]: Leaving directory `/local/robotpkg/var/tmp/robotpkg/wip/prf-gazebo-ros-pkgs/work/gazebo_ros_pkgs-2.6.7/build' make[2]: Leaving directory `/local/robotpkg/var/tmp/robotpkg/wip/prf-gazebo-ros-pkgs/work/gazebo_ros_pkgs-2.6.7/build' make[2]: Entering directory `/local/robotpkg/var/tmp/robotpkg/wip/prf-gazebo-ros-pkgs/work/gazebo_ros_pkgs-2.6.7/build' cd /local/robotpkg/var/tmp/robotpkg/wip/prf-gazebo-ros-pkgs/work/gazebo_ros_pkgs-2.6.7/build && /usr/bin/cmake -E cmake_depends "Unix Makefiles" /local/robotpkg/var/tmp/robotpkg/wip/prf-gazebo-ros-pkgs/work/gazebo_ros_pkgs-2.6.7 /local/robotpkg/var/tmp/robotpkg/wip/prf-gazebo-ros-pkgs/work/gazebo_ros_pkgs-2.6.7/gazebo_ros /local/robotpkg/var/tmp/robotpkg/wip/prf-gazebo-ros-pkgs/work/gazebo_ros_pkgs-2.6.7/build /local/robotpkg/var/tmp/robotpkg/wip/prf-gazebo-ros-pkgs/work/gazebo_ros_pkgs-2.6.7/build/gazebo_ros /local/robotpkg/var/tmp/robotpkg/wip/prf-gazebo-ros-pkgs/work/gazebo_ros_pkgs-2.6.7/build/gazebo_ros/CMakeFiles/dynamic_reconfigure_gencfg.dir/DependInfo.cmake --color= make -f gazebo_ros/CMakeFiles/actionlib_msgs_generate_messages_lisp.dir/build.make gazebo_ros/CMakeFiles/actionlib_msgs_generate_messages_lisp.dir/build make[2]: Entering directory `/local/robotpkg/var/tmp/robotpkg/wip/prf-gazebo-ros-pkgs/work/gazebo_ros_pkgs-2.6.7/build' make[2]: Nothing to be done for `gazebo_ros/CMakeFiles/actionlib_msgs_generate_messages_lisp.dir/build'. make[2]: Leaving directory `/local/robotpkg/var/tmp/robotpkg/wip/prf-gazebo-ros-pkgs/work/gazebo_ros_pkgs-2.6.7/build' make -f gazebo_ros/CMakeFiles/actionlib_msgs_generate_messages_py.dir/build.make gazebo_ros/CMakeFiles/actionlib_msgs_generate_messages_py.dir/build Scanning dependencies of target dynamic_reconfigure_gencfg make[2]: Leaving directory `/local/robotpkg/var/tmp/robotpkg/wip/prf-gazebo-ros-pkgs/work/gazebo_ros_pkgs-2.6.7/build' make[2]: Entering directory `/local/robotpkg/var/tmp/robotpkg/wip/prf-gazebo-ros-pkgs/work/gazebo_ros_pkgs-2.6.7/build' make[2]: Nothing to be done for `gazebo_ros/CMakeFiles/actionlib_msgs_generate_messages_py.dir/build'. make[2]: Leaving directory `/local/robotpkg/var/tmp/robotpkg/wip/prf-gazebo-ros-pkgs/work/gazebo_ros_pkgs-2.6.7/build' make -f gazebo_ros/CMakeFiles/dynamic_reconfigure_gencfg.dir/build.make gazebo_ros/CMakeFiles/dynamic_reconfigure_gencfg.dir/build make[2]: Entering directory `/local/robotpkg/var/tmp/robotpkg/wip/prf-gazebo-ros-pkgs/work/gazebo_ros_pkgs-2.6.7/build' make[2]: Nothing to be done for `gazebo_ros/CMakeFiles/dynamic_reconfigure_gencfg.dir/build'. make[2]: Leaving directory `/local/robotpkg/var/tmp/robotpkg/wip/prf-gazebo-ros-pkgs/work/gazebo_ros_pkgs-2.6.7/build' /usr/bin/cmake -E cmake_progress_report /local/robotpkg/var/tmp/robotpkg/wip/prf-gazebo-ros-pkgs/work/gazebo_ros_pkgs-2.6.7/build/CMakeFiles /usr/bin/cmake -E cmake_progress_report /local/robotpkg/var/tmp/robotpkg/wip/prf-gazebo-ros-pkgs/work/gazebo_ros_pkgs-2.6.7/build/CMakeFiles /usr/bin/cmake -E cmake_progress_report /local/robotpkg/var/tmp/robotpkg/wip/prf-gazebo-ros-pkgs/work/gazebo_ros_pkgs-2.6.7/build/CMakeFiles [ 1%] Generating reconfiguration files for Physics in gazebo_ros Wrote header file in /local/robotpkg/var/tmp/robotpkg/wip/prf-gazebo-ros-pkgs/work/stage/include/gazebo_ros/PhysicsConfig.h Built target actionlib_msgs_generate_messages_py make -f gazebo_ros/CMakeFiles/tf2_msgs_generate_messages_py.dir/build.make gazebo_ros/CMakeFiles/tf2_msgs_generate_messages_py.dir/depend make[2]: Entering directory `/local/robotpkg/var/tmp/robotpkg/wip/prf-gazebo-ros-pkgs/work/gazebo_ros_pkgs-2.6.7/build' cd /local/robotpkg/var/tmp/robotpkg/wip/prf-gazebo-ros-pkgs/work/gazebo_ros_pkgs-2.6.7/build && /usr/bin/cmake -E cmake_depends "Unix Makefiles" /local/robotpkg/var/tmp/robotpkg/wip/prf-gazebo-ros-pkgs/work/gazebo_ros_pkgs-2.6.7 /local/robotpkg/var/tmp/robotpkg/wip/prf-gazebo-ros-pkgs/work/gazebo_ros_pkgs-2.6.7/gazebo_ros /local/robotpkg/var/tmp/robotpkg/wip/prf-gazebo-ros-pkgs/work/gazebo_ros_pkgs-2.6.7/build /local/robotpkg/var/tmp/robotpkg/wip/prf-gazebo-ros-pkgs/work/gazebo_ros_pkgs-2.6.7/build/gazebo_ros /local/robotpkg/var/tmp/robotpkg/wip/prf-gazebo-ros-pkgs/work/gazebo_ros_pkgs-2.6.7/build/gazebo_ros/CMakeFiles/tf2_msgs_generate_messages_py.dir/DependInfo.cmake --color= [ 1%] Built target dynamic_reconfigure_gencfg make -f gazebo_plugins/CMakeFiles/MultiCameraPlugin.dir/build.make gazebo_plugins/CMakeFiles/MultiCameraPlugin.dir/depend [ 1%] make[2]: Leaving directory `/local/robotpkg/var/tmp/robotpkg/wip/prf-gazebo-ros-pkgs/work/gazebo_ros_pkgs-2.6.7/build' make[2]: Entering directory `/local/robotpkg/var/tmp/robotpkg/wip/prf-gazebo-ros-pkgs/work/gazebo_ros_pkgs-2.6.7/build' cd /local/robotpkg/var/tmp/robotpkg/wip/prf-gazebo-ros-pkgs/work/gazebo_ros_pkgs-2.6.7/build && /usr/bin/cmake -E cmake_depends "Unix Makefiles" /local/robotpkg/var/tmp/robotpkg/wip/prf-gazebo-ros-pkgs/work/gazebo_ros_pkgs-2.6.7 /local/robotpkg/var/tmp/robotpkg/wip/prf-gazebo-ros-pkgs/work/gazebo_ros_pkgs-2.6.7/gazebo_plugins /local/robotpkg/var/tmp/robotpkg/wip/prf-gazebo-ros-pkgs/work/gazebo_ros_pkgs-2.6.7/build /local/robotpkg/var/tmp/robotpkg/wip/prf-gazebo-ros-pkgs/work/gazebo_ros_pkgs-2.6.7/build/gazebo_plugins /local/robotpkg/var/tmp/robotpkg/wip/prf-gazebo-ros-pkgs/work/gazebo_ros_pkgs-2.6.7/build/gazebo_plugins/CMakeFiles/MultiCameraPlugin.dir/DependInfo.cmake --color= /usr/bin/cmake -E cmake_progress_report /local/robotpkg/var/tmp/robotpkg/wip/prf-gazebo-ros-pkgs/work/gazebo_ros_pkgs-2.6.7/build/CMakeFiles 81 Scanning dependencies of target tf2_msgs_generate_messages_py make[2]: Leaving directory `/local/robotpkg/var/tmp/robotpkg/wip/prf-gazebo-ros-pkgs/work/gazebo_ros_pkgs-2.6.7/build' make -f gazebo_ros/CMakeFiles/tf2_msgs_generate_messages_py.dir/build.make gazebo_ros/CMakeFiles/tf2_msgs_generate_messages_py.dir/build Built target actionlib_msgs_generate_messages_lisp make[2]: Entering directory `/local/robotpkg/var/tmp/robotpkg/wip/prf-gazebo-ros-pkgs/work/gazebo_ros_pkgs-2.6.7/build' make[2]: Nothing to be done for `gazebo_ros/CMakeFiles/tf2_msgs_generate_messages_py.dir/build'. make[2]: Leaving directory `/local/robotpkg/var/tmp/robotpkg/wip/prf-gazebo-ros-pkgs/work/gazebo_ros_pkgs-2.6.7/build' /usr/bin/cmake -E cmake_progress_report /local/robotpkg/var/tmp/robotpkg/wip/prf-gazebo-ros-pkgs/work/gazebo_ros_pkgs-2.6.7/build/CMakeFiles [ 1%] Built target gazebo_ros_gencfg make -f gazebo_plugins/CMakeFiles/diagnostic_msgs_generate_messages_cpp.dir/build.make gazebo_plugins/CMakeFiles/diagnostic_msgs_generate_messages_cpp.dir/depend [ 1%] make[2]: Entering directory `/local/robotpkg/var/tmp/robotpkg/wip/prf-gazebo-ros-pkgs/work/gazebo_ros_pkgs-2.6.7/build' cd /local/robotpkg/var/tmp/robotpkg/wip/prf-gazebo-ros-pkgs/work/gazebo_ros_pkgs-2.6.7/build && /usr/bin/cmake -E cmake_depends "Unix Makefiles" /local/robotpkg/var/tmp/robotpkg/wip/prf-gazebo-ros-pkgs/work/gazebo_ros_pkgs-2.6.7 /local/robotpkg/var/tmp/robotpkg/wip/prf-gazebo-ros-pkgs/work/gazebo_ros_pkgs-2.6.7/gazebo_plugins /local/robotpkg/var/tmp/robotpkg/wip/prf-gazebo-ros-pkgs/work/gazebo_ros_pkgs-2.6.7/build /local/robotpkg/var/tmp/robotpkg/wip/prf-gazebo-ros-pkgs/work/gazebo_ros_pkgs-2.6.7/build/gazebo_plugins /local/robotpkg/var/tmp/robotpkg/wip/prf-gazebo-ros-pkgs/work/gazebo_ros_pkgs-2.6.7/build/gazebo_plugins/CMakeFiles/diagnostic_msgs_generate_messages_cpp.dir/DependInfo.cmake --color= Built target tf2_msgs_generate_messages_py make -f gazebo_plugins/CMakeFiles/nodelet_generate_messages_lisp.dir/build.make gazebo_plugins/CMakeFiles/nodelet_generate_messages_lisp.dir/depend make[2]: Entering directory `/local/robotpkg/var/tmp/robotpkg/wip/prf-gazebo-ros-pkgs/work/gazebo_ros_pkgs-2.6.7/build' cd /local/robotpkg/var/tmp/robotpkg/wip/prf-gazebo-ros-pkgs/work/gazebo_ros_pkgs-2.6.7/build && /usr/bin/cmake -E cmake_depends "Unix Makefiles" /local/robotpkg/var/tmp/robotpkg/wip/prf-gazebo-ros-pkgs/work/gazebo_ros_pkgs-2.6.7 /local/robotpkg/var/tmp/robotpkg/wip/prf-gazebo-ros-pkgs/work/gazebo_ros_pkgs-2.6.7/gazebo_plugins /local/robotpkg/var/tmp/robotpkg/wip/prf-gazebo-ros-pkgs/work/gazebo_ros_pkgs-2.6.7/build /local/robotpkg/var/tmp/robotpkg/wip/prf-gazebo-ros-pkgs/work/gazebo_ros_pkgs-2.6.7/build/gazebo_plugins /local/robotpkg/var/tmp/robotpkg/wip/prf-gazebo-ros-pkgs/work/gazebo_ros_pkgs-2.6.7/build/gazebo_plugins/CMakeFiles/nodelet_generate_messages_lisp.dir/DependInfo.cmake --color= make -f gazebo_plugins/CMakeFiles/nodelet_generate_messages_cpp.dir/build.make gazebo_plugins/CMakeFiles/nodelet_generate_messages_cpp.dir/depend make[2]: Entering directory `/local/robotpkg/var/tmp/robotpkg/wip/prf-gazebo-ros-pkgs/work/gazebo_ros_pkgs-2.6.7/build' cd /local/robotpkg/var/tmp/robotpkg/wip/prf-gazebo-ros-pkgs/work/gazebo_ros_pkgs-2.6.7/build && /usr/bin/cmake -E cmake_depends "Unix Makefiles" /local/robotpkg/var/tmp/robotpkg/wip/prf-gazebo-ros-pkgs/work/gazebo_ros_pkgs-2.6.7 /local/robotpkg/var/tmp/robotpkg/wip/prf-gazebo-ros-pkgs/work/gazebo_ros_pkgs-2.6.7/gazebo_plugins /local/robotpkg/var/tmp/robotpkg/wip/prf-gazebo-ros-pkgs/work/gazebo_ros_pkgs-2.6.7/build /local/robotpkg/var/tmp/robotpkg/wip/prf-gazebo-ros-pkgs/work/gazebo_ros_pkgs-2.6.7/build/gazebo_plugins /local/robotpkg/var/tmp/robotpkg/wip/prf-gazebo-ros-pkgs/work/gazebo_ros_pkgs-2.6.7/build/gazebo_plugins/CMakeFiles/nodelet_generate_messages_cpp.dir/DependInfo.cmake --color= Scanning dependencies of target diagnostic_msgs_generate_messages_cpp Scanning dependencies of target nodelet_generate_messages_cpp make[2]: Leaving directory `/local/robotpkg/var/tmp/robotpkg/wip/prf-gazebo-ros-pkgs/work/gazebo_ros_pkgs-2.6.7/build' make[2]: Leaving directory `/local/robotpkg/var/tmp/robotpkg/wip/prf-gazebo-ros-pkgs/work/gazebo_ros_pkgs-2.6.7/build' make -f gazebo_plugins/CMakeFiles/diagnostic_msgs_generate_messages_cpp.dir/build.make gazebo_plugins/CMakeFiles/diagnostic_msgs_generate_messages_cpp.dir/build Scanning dependencies of target nodelet_generate_messages_lisp make[2]: Leaving directory `/local/robotpkg/var/tmp/robotpkg/wip/prf-gazebo-ros-pkgs/work/gazebo_ros_pkgs-2.6.7/build' make[2]: Entering directory `/local/robotpkg/var/tmp/robotpkg/wip/prf-gazebo-ros-pkgs/work/gazebo_ros_pkgs-2.6.7/build' make[2]: Nothing to be done for `gazebo_plugins/CMakeFiles/diagnostic_msgs_generate_messages_cpp.dir/build'. make[2]: Leaving directory `/local/robotpkg/var/tmp/robotpkg/wip/prf-gazebo-ros-pkgs/work/gazebo_ros_pkgs-2.6.7/build' make -f gazebo_plugins/CMakeFiles/nodelet_generate_messages_lisp.dir/build.make gazebo_plugins/CMakeFiles/nodelet_generate_messages_lisp.dir/build make[2]: Entering directory `/local/robotpkg/var/tmp/robotpkg/wip/prf-gazebo-ros-pkgs/work/gazebo_ros_pkgs-2.6.7/build' make[2]: Nothing to be done for `gazebo_plugins/CMakeFiles/nodelet_generate_messages_lisp.dir/build'. make[2]: Leaving directory `/local/robotpkg/var/tmp/robotpkg/wip/prf-gazebo-ros-pkgs/work/gazebo_ros_pkgs-2.6.7/build' make -f gazebo_plugins/CMakeFiles/nodelet_generate_messages_cpp.dir/build.make gazebo_plugins/CMakeFiles/nodelet_generate_messages_cpp.dir/build /usr/bin/cmake -E cmake_progress_report /local/robotpkg/var/tmp/robotpkg/wip/prf-gazebo-ros-pkgs/work/gazebo_ros_pkgs-2.6.7/build/CMakeFiles make[2]: Entering directory `/local/robotpkg/var/tmp/robotpkg/wip/prf-gazebo-ros-pkgs/work/gazebo_ros_pkgs-2.6.7/build' make[2]: Nothing to be done for `gazebo_plugins/CMakeFiles/nodelet_generate_messages_cpp.dir/build'. make[2]: Leaving directory `/local/robotpkg/var/tmp/robotpkg/wip/prf-gazebo-ros-pkgs/work/gazebo_ros_pkgs-2.6.7/build' /usr/bin/cmake -E cmake_progress_report /local/robotpkg/var/tmp/robotpkg/wip/prf-gazebo-ros-pkgs/work/gazebo_ros_pkgs-2.6.7/build/CMakeFiles [ 1%] [ 1%] /usr/bin/cmake -E cmake_progress_report /local/robotpkg/var/tmp/robotpkg/wip/prf-gazebo-ros-pkgs/work/gazebo_ros_pkgs-2.6.7/build/CMakeFiles [ 1%] Built target diagnostic_msgs_generate_messages_cpp Built target nodelet_generate_messages_lisp Built target nodelet_generate_messages_cpp make -f gazebo_plugins/CMakeFiles/nav_msgs_generate_messages_py.dir/build.make gazebo_plugins/CMakeFiles/nav_msgs_generate_messages_py.dir/depend make -f gazebo_plugins/CMakeFiles/bond_generate_messages_lisp.dir/build.make gazebo_plugins/CMakeFiles/bond_generate_messages_lisp.dir/depend make[2]: Entering directory `/local/robotpkg/var/tmp/robotpkg/wip/prf-gazebo-ros-pkgs/work/gazebo_ros_pkgs-2.6.7/build' cd /local/robotpkg/var/tmp/robotpkg/wip/prf-gazebo-ros-pkgs/work/gazebo_ros_pkgs-2.6.7/build && /usr/bin/cmake -E cmake_depends "Unix Makefiles" /local/robotpkg/var/tmp/robotpkg/wip/prf-gazebo-ros-pkgs/work/gazebo_ros_pkgs-2.6.7 /local/robotpkg/var/tmp/robotpkg/wip/prf-gazebo-ros-pkgs/work/gazebo_ros_pkgs-2.6.7/gazebo_plugins /local/robotpkg/var/tmp/robotpkg/wip/prf-gazebo-ros-pkgs/work/gazebo_ros_pkgs-2.6.7/build /local/robotpkg/var/tmp/robotpkg/wip/prf-gazebo-ros-pkgs/work/gazebo_ros_pkgs-2.6.7/build/gazebo_plugins /local/robotpkg/var/tmp/robotpkg/wip/prf-gazebo-ros-pkgs/work/gazebo_ros_pkgs-2.6.7/build/gazebo_plugins/CMakeFiles/nav_msgs_generate_messages_py.dir/DependInfo.cmake --color= make[2]: Entering directory `/local/robotpkg/var/tmp/robotpkg/wip/prf-gazebo-ros-pkgs/work/gazebo_ros_pkgs-2.6.7/build' cd /local/robotpkg/var/tmp/robotpkg/wip/prf-gazebo-ros-pkgs/work/gazebo_ros_pkgs-2.6.7/build && /usr/bin/cmake -E cmake_depends "Unix Makefiles" /local/robotpkg/var/tmp/robotpkg/wip/prf-gazebo-ros-pkgs/work/gazebo_ros_pkgs-2.6.7 /local/robotpkg/var/tmp/robotpkg/wip/prf-gazebo-ros-pkgs/work/gazebo_ros_pkgs-2.6.7/gazebo_plugins /local/robotpkg/var/tmp/robotpkg/wip/prf-gazebo-ros-pkgs/work/gazebo_ros_pkgs-2.6.7/build /local/robotpkg/var/tmp/robotpkg/wip/prf-gazebo-ros-pkgs/work/gazebo_ros_pkgs-2.6.7/build/gazebo_plugins /local/robotpkg/var/tmp/robotpkg/wip/prf-gazebo-ros-pkgs/work/gazebo_ros_pkgs-2.6.7/build/gazebo_plugins/CMakeFiles/bond_generate_messages_lisp.dir/DependInfo.cmake --color= make -f gazebo_plugins/CMakeFiles/nodelet_generate_messages_py.dir/build.make gazebo_plugins/CMakeFiles/nodelet_generate_messages_py.dir/depend Scanning dependencies of target bond_generate_messages_lisp make[2]: Leaving directory `/local/robotpkg/var/tmp/robotpkg/wip/prf-gazebo-ros-pkgs/work/gazebo_ros_pkgs-2.6.7/build' make[2]: Entering directory `/local/robotpkg/var/tmp/robotpkg/wip/prf-gazebo-ros-pkgs/work/gazebo_ros_pkgs-2.6.7/build' cd /local/robotpkg/var/tmp/robotpkg/wip/prf-gazebo-ros-pkgs/work/gazebo_ros_pkgs-2.6.7/build && /usr/bin/cmake -E cmake_depends "Unix Makefiles" /local/robotpkg/var/tmp/robotpkg/wip/prf-gazebo-ros-pkgs/work/gazebo_ros_pkgs-2.6.7 /local/robotpkg/var/tmp/robotpkg/wip/prf-gazebo-ros-pkgs/work/gazebo_ros_pkgs-2.6.7/gazebo_plugins /local/robotpkg/var/tmp/robotpkg/wip/prf-gazebo-ros-pkgs/work/gazebo_ros_pkgs-2.6.7/build /local/robotpkg/var/tmp/robotpkg/wip/prf-gazebo-ros-pkgs/work/gazebo_ros_pkgs-2.6.7/build/gazebo_plugins /local/robotpkg/var/tmp/robotpkg/wip/prf-gazebo-ros-pkgs/work/gazebo_ros_pkgs-2.6.7/build/gazebo_plugins/CMakeFiles/nodelet_generate_messages_py.dir/DependInfo.cmake --color= make -f gazebo_plugins/CMakeFiles/bond_generate_messages_lisp.dir/build.make gazebo_plugins/CMakeFiles/bond_generate_messages_lisp.dir/build make[2]: Entering directory `/local/robotpkg/var/tmp/robotpkg/wip/prf-gazebo-ros-pkgs/work/gazebo_ros_pkgs-2.6.7/build' make[2]: Nothing to be done for `gazebo_plugins/CMakeFiles/bond_generate_messages_lisp.dir/build'. make[2]: Leaving directory `/local/robotpkg/var/tmp/robotpkg/wip/prf-gazebo-ros-pkgs/work/gazebo_ros_pkgs-2.6.7/build' /usr/bin/cmake -E cmake_progress_report /local/robotpkg/var/tmp/robotpkg/wip/prf-gazebo-ros-pkgs/work/gazebo_ros_pkgs-2.6.7/build/CMakeFiles Scanning dependencies of target nav_msgs_generate_messages_py make[2]: Leaving directory `/local/robotpkg/var/tmp/robotpkg/wip/prf-gazebo-ros-pkgs/work/gazebo_ros_pkgs-2.6.7/build' make -f gazebo_plugins/CMakeFiles/nav_msgs_generate_messages_py.dir/build.make gazebo_plugins/CMakeFiles/nav_msgs_generate_messages_py.dir/build [ 1%] make[2]: Entering directory `/local/robotpkg/var/tmp/robotpkg/wip/prf-gazebo-ros-pkgs/work/gazebo_ros_pkgs-2.6.7/build' make[2]: Nothing to be done for `gazebo_plugins/CMakeFiles/nav_msgs_generate_messages_py.dir/build'. make[2]: Leaving directory `/local/robotpkg/var/tmp/robotpkg/wip/prf-gazebo-ros-pkgs/work/gazebo_ros_pkgs-2.6.7/build' Built target bond_generate_messages_lisp /usr/bin/cmake -E cmake_progress_report /local/robotpkg/var/tmp/robotpkg/wip/prf-gazebo-ros-pkgs/work/gazebo_ros_pkgs-2.6.7/build/CMakeFiles make -f gazebo_plugins/CMakeFiles/bond_generate_messages_py.dir/build.make gazebo_plugins/CMakeFiles/bond_generate_messages_py.dir/depend make[2]: Entering directory `/local/robotpkg/var/tmp/robotpkg/wip/prf-gazebo-ros-pkgs/work/gazebo_ros_pkgs-2.6.7/build' cd /local/robotpkg/var/tmp/robotpkg/wip/prf-gazebo-ros-pkgs/work/gazebo_ros_pkgs-2.6.7/build && /usr/bin/cmake -E cmake_depends "Unix Makefiles" /local/robotpkg/var/tmp/robotpkg/wip/prf-gazebo-ros-pkgs/work/gazebo_ros_pkgs-2.6.7 /local/robotpkg/var/tmp/robotpkg/wip/prf-gazebo-ros-pkgs/work/gazebo_ros_pkgs-2.6.7/gazebo_plugins /local/robotpkg/var/tmp/robotpkg/wip/prf-gazebo-ros-pkgs/work/gazebo_ros_pkgs-2.6.7/build /local/robotpkg/var/tmp/robotpkg/wip/prf-gazebo-ros-pkgs/work/gazebo_ros_pkgs-2.6.7/build/gazebo_plugins /local/robotpkg/var/tmp/robotpkg/wip/prf-gazebo-ros-pkgs/work/gazebo_ros_pkgs-2.6.7/build/gazebo_plugins/CMakeFiles/bond_generate_messages_py.dir/DependInfo.cmake --color= Scanning dependencies of target nodelet_generate_messages_py make[2]: Leaving directory `/local/robotpkg/var/tmp/robotpkg/wip/prf-gazebo-ros-pkgs/work/gazebo_ros_pkgs-2.6.7/build' [ 1%] make -f gazebo_plugins/CMakeFiles/nodelet_generate_messages_py.dir/build.make gazebo_plugins/CMakeFiles/nodelet_generate_messages_py.dir/build make[2]: Entering directory `/local/robotpkg/var/tmp/robotpkg/wip/prf-gazebo-ros-pkgs/work/gazebo_ros_pkgs-2.6.7/build' make[2]: Nothing to be done for `gazebo_plugins/CMakeFiles/nodelet_generate_messages_py.dir/build'. make[2]: Leaving directory `/local/robotpkg/var/tmp/robotpkg/wip/prf-gazebo-ros-pkgs/work/gazebo_ros_pkgs-2.6.7/build' Scanning dependencies of target bond_generate_messages_py make[2]: Leaving directory `/local/robotpkg/var/tmp/robotpkg/wip/prf-gazebo-ros-pkgs/work/gazebo_ros_pkgs-2.6.7/build' make -f gazebo_plugins/CMakeFiles/bond_generate_messages_py.dir/build.make gazebo_plugins/CMakeFiles/bond_generate_messages_py.dir/build Built target nav_msgs_generate_messages_py /usr/bin/cmake -E cmake_progress_report /local/robotpkg/var/tmp/robotpkg/wip/prf-gazebo-ros-pkgs/work/gazebo_ros_pkgs-2.6.7/build/CMakeFiles make[2]: Entering directory `/local/robotpkg/var/tmp/robotpkg/wip/prf-gazebo-ros-pkgs/work/gazebo_ros_pkgs-2.6.7/build' make[2]: Nothing to be done for `gazebo_plugins/CMakeFiles/bond_generate_messages_py.dir/build'. make[2]: Leaving directory `/local/robotpkg/var/tmp/robotpkg/wip/prf-gazebo-ros-pkgs/work/gazebo_ros_pkgs-2.6.7/build' /usr/bin/cmake -E cmake_progress_report /local/robotpkg/var/tmp/robotpkg/wip/prf-gazebo-ros-pkgs/work/gazebo_ros_pkgs-2.6.7/build/CMakeFiles [ 1%] Built target nodelet_generate_messages_py make -f gazebo_plugins/CMakeFiles/bond_generate_messages_cpp.dir/build.make gazebo_plugins/CMakeFiles/bond_generate_messages_cpp.dir/depend [ 1%] make[2]: Entering directory `/local/robotpkg/var/tmp/robotpkg/wip/prf-gazebo-ros-pkgs/work/gazebo_ros_pkgs-2.6.7/build' cd /local/robotpkg/var/tmp/robotpkg/wip/prf-gazebo-ros-pkgs/work/gazebo_ros_pkgs-2.6.7/build && /usr/bin/cmake -E cmake_depends "Unix Makefiles" /local/robotpkg/var/tmp/robotpkg/wip/prf-gazebo-ros-pkgs/work/gazebo_ros_pkgs-2.6.7 /local/robotpkg/var/tmp/robotpkg/wip/prf-gazebo-ros-pkgs/work/gazebo_ros_pkgs-2.6.7/gazebo_plugins /local/robotpkg/var/tmp/robotpkg/wip/prf-gazebo-ros-pkgs/work/gazebo_ros_pkgs-2.6.7/build /local/robotpkg/var/tmp/robotpkg/wip/prf-gazebo-ros-pkgs/work/gazebo_ros_pkgs-2.6.7/build/gazebo_plugins /local/robotpkg/var/tmp/robotpkg/wip/prf-gazebo-ros-pkgs/work/gazebo_ros_pkgs-2.6.7/build/gazebo_plugins/CMakeFiles/bond_generate_messages_cpp.dir/DependInfo.cmake --color= Built target bond_generate_messages_py make -f gazebo_plugins/CMakeFiles/nav_msgs_generate_messages_cpp.dir/build.make gazebo_plugins/CMakeFiles/nav_msgs_generate_messages_cpp.dir/depend make -f gazebo_plugins/CMakeFiles/nav_msgs_generate_messages_lisp.dir/build.make gazebo_plugins/CMakeFiles/nav_msgs_generate_messages_lisp.dir/depend make[2]: Entering directory `/local/robotpkg/var/tmp/robotpkg/wip/prf-gazebo-ros-pkgs/work/gazebo_ros_pkgs-2.6.7/build' cd /local/robotpkg/var/tmp/robotpkg/wip/prf-gazebo-ros-pkgs/work/gazebo_ros_pkgs-2.6.7/build && /usr/bin/cmake -E cmake_depends "Unix Makefiles" /local/robotpkg/var/tmp/robotpkg/wip/prf-gazebo-ros-pkgs/work/gazebo_ros_pkgs-2.6.7 /local/robotpkg/var/tmp/robotpkg/wip/prf-gazebo-ros-pkgs/work/gazebo_ros_pkgs-2.6.7/gazebo_plugins /local/robotpkg/var/tmp/robotpkg/wip/prf-gazebo-ros-pkgs/work/gazebo_ros_pkgs-2.6.7/build /local/robotpkg/var/tmp/robotpkg/wip/prf-gazebo-ros-pkgs/work/gazebo_ros_pkgs-2.6.7/build/gazebo_plugins /local/robotpkg/var/tmp/robotpkg/wip/prf-gazebo-ros-pkgs/work/gazebo_ros_pkgs-2.6.7/build/gazebo_plugins/CMakeFiles/nav_msgs_generate_messages_cpp.dir/DependInfo.cmake --color= make[2]: Entering directory `/local/robotpkg/var/tmp/robotpkg/wip/prf-gazebo-ros-pkgs/work/gazebo_ros_pkgs-2.6.7/build' cd /local/robotpkg/var/tmp/robotpkg/wip/prf-gazebo-ros-pkgs/work/gazebo_ros_pkgs-2.6.7/build && /usr/bin/cmake -E cmake_depends "Unix Makefiles" /local/robotpkg/var/tmp/robotpkg/wip/prf-gazebo-ros-pkgs/work/gazebo_ros_pkgs-2.6.7 /local/robotpkg/var/tmp/robotpkg/wip/prf-gazebo-ros-pkgs/work/gazebo_ros_pkgs-2.6.7/gazebo_plugins /local/robotpkg/var/tmp/robotpkg/wip/prf-gazebo-ros-pkgs/work/gazebo_ros_pkgs-2.6.7/build /local/robotpkg/var/tmp/robotpkg/wip/prf-gazebo-ros-pkgs/work/gazebo_ros_pkgs-2.6.7/build/gazebo_plugins /local/robotpkg/var/tmp/robotpkg/wip/prf-gazebo-ros-pkgs/work/gazebo_ros_pkgs-2.6.7/build/gazebo_plugins/CMakeFiles/nav_msgs_generate_messages_lisp.dir/DependInfo.cmake --color= Scanning dependencies of target bond_generate_messages_cpp make[2]: Leaving directory `/local/robotpkg/var/tmp/robotpkg/wip/prf-gazebo-ros-pkgs/work/gazebo_ros_pkgs-2.6.7/build' make -f gazebo_plugins/CMakeFiles/bond_generate_messages_cpp.dir/build.make gazebo_plugins/CMakeFiles/bond_generate_messages_cpp.dir/build make[2]: Entering directory `/local/robotpkg/var/tmp/robotpkg/wip/prf-gazebo-ros-pkgs/work/gazebo_ros_pkgs-2.6.7/build' make[2]: Nothing to be done for `gazebo_plugins/CMakeFiles/bond_generate_messages_cpp.dir/build'. make[2]: Leaving directory `/local/robotpkg/var/tmp/robotpkg/wip/prf-gazebo-ros-pkgs/work/gazebo_ros_pkgs-2.6.7/build' /usr/bin/cmake -E cmake_progress_report /local/robotpkg/var/tmp/robotpkg/wip/prf-gazebo-ros-pkgs/work/gazebo_ros_pkgs-2.6.7/build/CMakeFiles Scanning dependencies of target nav_msgs_generate_messages_cpp [ 1%] make[2]: Leaving directory `/local/robotpkg/var/tmp/robotpkg/wip/prf-gazebo-ros-pkgs/work/gazebo_ros_pkgs-2.6.7/build' Scanning dependencies of target nav_msgs_generate_messages_lisp Built target bond_generate_messages_cpp make -f gazebo_plugins/CMakeFiles/nav_msgs_generate_messages_cpp.dir/build.make gazebo_plugins/CMakeFiles/nav_msgs_generate_messages_cpp.dir/build make -f gazebo_plugins/CMakeFiles/polled_camera_generate_messages_cpp.dir/build.make gazebo_plugins/CMakeFiles/polled_camera_generate_messages_cpp.dir/depend make[2]: Leaving directory `/local/robotpkg/var/tmp/robotpkg/wip/prf-gazebo-ros-pkgs/work/gazebo_ros_pkgs-2.6.7/build' make[2]: Entering directory `/local/robotpkg/var/tmp/robotpkg/wip/prf-gazebo-ros-pkgs/work/gazebo_ros_pkgs-2.6.7/build' make[2]: Nothing to be done for `gazebo_plugins/CMakeFiles/nav_msgs_generate_messages_cpp.dir/build'. make[2]: Leaving directory `/local/robotpkg/var/tmp/robotpkg/wip/prf-gazebo-ros-pkgs/work/gazebo_ros_pkgs-2.6.7/build' make -f gazebo_plugins/CMakeFiles/nav_msgs_generate_messages_lisp.dir/build.make gazebo_plugins/CMakeFiles/nav_msgs_generate_messages_lisp.dir/build make[2]: Entering directory `/local/robotpkg/var/tmp/robotpkg/wip/prf-gazebo-ros-pkgs/work/gazebo_ros_pkgs-2.6.7/build' cd /local/robotpkg/var/tmp/robotpkg/wip/prf-gazebo-ros-pkgs/work/gazebo_ros_pkgs-2.6.7/build && /usr/bin/cmake -E cmake_depends "Unix Makefiles" /local/robotpkg/var/tmp/robotpkg/wip/prf-gazebo-ros-pkgs/work/gazebo_ros_pkgs-2.6.7 /local/robotpkg/var/tmp/robotpkg/wip/prf-gazebo-ros-pkgs/work/gazebo_ros_pkgs-2.6.7/gazebo_plugins /local/robotpkg/var/tmp/robotpkg/wip/prf-gazebo-ros-pkgs/work/gazebo_ros_pkgs-2.6.7/build /local/robotpkg/var/tmp/robotpkg/wip/prf-gazebo-ros-pkgs/work/gazebo_ros_pkgs-2.6.7/build/gazebo_plugins /local/robotpkg/var/tmp/robotpkg/wip/prf-gazebo-ros-pkgs/work/gazebo_ros_pkgs-2.6.7/build/gazebo_plugins/CMakeFiles/polled_camera_generate_messages_cpp.dir/DependInfo.cmake --color= /usr/bin/cmake -E cmake_progress_report /local/robotpkg/var/tmp/robotpkg/wip/prf-gazebo-ros-pkgs/work/gazebo_ros_pkgs-2.6.7/build/CMakeFiles make[2]: Entering directory `/local/robotpkg/var/tmp/robotpkg/wip/prf-gazebo-ros-pkgs/work/gazebo_ros_pkgs-2.6.7/build' make[2]: Nothing to be done for `gazebo_plugins/CMakeFiles/nav_msgs_generate_messages_lisp.dir/build'. make[2]: Leaving directory `/local/robotpkg/var/tmp/robotpkg/wip/prf-gazebo-ros-pkgs/work/gazebo_ros_pkgs-2.6.7/build' /usr/bin/cmake -E cmake_progress_report /local/robotpkg/var/tmp/robotpkg/wip/prf-gazebo-ros-pkgs/work/gazebo_ros_pkgs-2.6.7/build/CMakeFiles [ 1%] [ 1%] Scanning dependencies of target polled_camera_generate_messages_cpp make[2]: Leaving directory `/local/robotpkg/var/tmp/robotpkg/wip/prf-gazebo-ros-pkgs/work/gazebo_ros_pkgs-2.6.7/build' Built target nav_msgs_generate_messages_lisp make -f gazebo_plugins/CMakeFiles/polled_camera_generate_messages_cpp.dir/build.make gazebo_plugins/CMakeFiles/polled_camera_generate_messages_cpp.dir/build make[2]: Entering directory `/local/robotpkg/var/tmp/robotpkg/wip/prf-gazebo-ros-pkgs/work/gazebo_ros_pkgs-2.6.7/build' make[2]: Nothing to be done for `gazebo_plugins/CMakeFiles/polled_camera_generate_messages_cpp.dir/build'. make[2]: Leaving directory `/local/robotpkg/var/tmp/robotpkg/wip/prf-gazebo-ros-pkgs/work/gazebo_ros_pkgs-2.6.7/build' Built target nav_msgs_generate_messages_cpp /usr/bin/cmake -E cmake_progress_report /local/robotpkg/var/tmp/robotpkg/wip/prf-gazebo-ros-pkgs/work/gazebo_ros_pkgs-2.6.7/build/CMakeFiles make -f gazebo_plugins/CMakeFiles/polled_camera_generate_messages_lisp.dir/build.make gazebo_plugins/CMakeFiles/polled_camera_generate_messages_lisp.dir/depend make[2]: Entering directory `/local/robotpkg/var/tmp/robotpkg/wip/prf-gazebo-ros-pkgs/work/gazebo_ros_pkgs-2.6.7/build' cd /local/robotpkg/var/tmp/robotpkg/wip/prf-gazebo-ros-pkgs/work/gazebo_ros_pkgs-2.6.7/build && /usr/bin/cmake -E cmake_depends "Unix Makefiles" /local/robotpkg/var/tmp/robotpkg/wip/prf-gazebo-ros-pkgs/work/gazebo_ros_pkgs-2.6.7 /local/robotpkg/var/tmp/robotpkg/wip/prf-gazebo-ros-pkgs/work/gazebo_ros_pkgs-2.6.7/gazebo_plugins /local/robotpkg/var/tmp/robotpkg/wip/prf-gazebo-ros-pkgs/work/gazebo_ros_pkgs-2.6.7/build /local/robotpkg/var/tmp/robotpkg/wip/prf-gazebo-ros-pkgs/work/gazebo_ros_pkgs-2.6.7/build/gazebo_plugins /local/robotpkg/var/tmp/robotpkg/wip/prf-gazebo-ros-pkgs/work/gazebo_ros_pkgs-2.6.7/build/gazebo_plugins/CMakeFiles/polled_camera_generate_messages_lisp.dir/DependInfo.cmake --color= make -f gazebo_plugins/CMakeFiles/diagnostic_msgs_generate_messages_lisp.dir/build.make gazebo_plugins/CMakeFiles/diagnostic_msgs_generate_messages_lisp.dir/depend [ 1%] make[2]: Entering directory `/local/robotpkg/var/tmp/robotpkg/wip/prf-gazebo-ros-pkgs/work/gazebo_ros_pkgs-2.6.7/build' cd /local/robotpkg/var/tmp/robotpkg/wip/prf-gazebo-ros-pkgs/work/gazebo_ros_pkgs-2.6.7/build && /usr/bin/cmake -E cmake_depends "Unix Makefiles" /local/robotpkg/var/tmp/robotpkg/wip/prf-gazebo-ros-pkgs/work/gazebo_ros_pkgs-2.6.7 /local/robotpkg/var/tmp/robotpkg/wip/prf-gazebo-ros-pkgs/work/gazebo_ros_pkgs-2.6.7/gazebo_plugins /local/robotpkg/var/tmp/robotpkg/wip/prf-gazebo-ros-pkgs/work/gazebo_ros_pkgs-2.6.7/build /local/robotpkg/var/tmp/robotpkg/wip/prf-gazebo-ros-pkgs/work/gazebo_ros_pkgs-2.6.7/build/gazebo_plugins /local/robotpkg/var/tmp/robotpkg/wip/prf-gazebo-ros-pkgs/work/gazebo_ros_pkgs-2.6.7/build/gazebo_plugins/CMakeFiles/diagnostic_msgs_generate_messages_lisp.dir/DependInfo.cmake --color= Built target polled_camera_generate_messages_cpp make -f gazebo_plugins/CMakeFiles/diagnostic_msgs_generate_messages_py.dir/build.make gazebo_plugins/CMakeFiles/diagnostic_msgs_generate_messages_py.dir/depend Scanning dependencies of target polled_camera_generate_messages_lisp make[2]: Entering directory `/local/robotpkg/var/tmp/robotpkg/wip/prf-gazebo-ros-pkgs/work/gazebo_ros_pkgs-2.6.7/build' cd /local/robotpkg/var/tmp/robotpkg/wip/prf-gazebo-ros-pkgs/work/gazebo_ros_pkgs-2.6.7/build && /usr/bin/cmake -E cmake_depends "Unix Makefiles" /local/robotpkg/var/tmp/robotpkg/wip/prf-gazebo-ros-pkgs/work/gazebo_ros_pkgs-2.6.7 /local/robotpkg/var/tmp/robotpkg/wip/prf-gazebo-ros-pkgs/work/gazebo_ros_pkgs-2.6.7/gazebo_plugins /local/robotpkg/var/tmp/robotpkg/wip/prf-gazebo-ros-pkgs/work/gazebo_ros_pkgs-2.6.7/build /local/robotpkg/var/tmp/robotpkg/wip/prf-gazebo-ros-pkgs/work/gazebo_ros_pkgs-2.6.7/build/gazebo_plugins /local/robotpkg/var/tmp/robotpkg/wip/prf-gazebo-ros-pkgs/work/gazebo_ros_pkgs-2.6.7/build/gazebo_plugins/CMakeFiles/diagnostic_msgs_generate_messages_py.dir/DependInfo.cmake --color= Scanning dependencies of target diagnostic_msgs_generate_messages_lisp make[2]: Leaving directory `/local/robotpkg/var/tmp/robotpkg/wip/prf-gazebo-ros-pkgs/work/gazebo_ros_pkgs-2.6.7/build' make -f gazebo_plugins/CMakeFiles/polled_camera_generate_messages_lisp.dir/build.make gazebo_plugins/CMakeFiles/polled_camera_generate_messages_lisp.dir/build make[2]: Leaving directory `/local/robotpkg/var/tmp/robotpkg/wip/prf-gazebo-ros-pkgs/work/gazebo_ros_pkgs-2.6.7/build' make[2]: Entering directory `/local/robotpkg/var/tmp/robotpkg/wip/prf-gazebo-ros-pkgs/work/gazebo_ros_pkgs-2.6.7/build' make[2]: Nothing to be done for `gazebo_plugins/CMakeFiles/polled_camera_generate_messages_lisp.dir/build'. make[2]: Leaving directory `/local/robotpkg/var/tmp/robotpkg/wip/prf-gazebo-ros-pkgs/work/gazebo_ros_pkgs-2.6.7/build' Scanning dependencies of target diagnostic_msgs_generate_messages_py make -f gazebo_plugins/CMakeFiles/diagnostic_msgs_generate_messages_lisp.dir/build.make gazebo_plugins/CMakeFiles/diagnostic_msgs_generate_messages_lisp.dir/build /usr/bin/cmake -E cmake_progress_report /local/robotpkg/var/tmp/robotpkg/wip/prf-gazebo-ros-pkgs/work/gazebo_ros_pkgs-2.6.7/build/CMakeFiles make[2]: Entering directory `/local/robotpkg/var/tmp/robotpkg/wip/prf-gazebo-ros-pkgs/work/gazebo_ros_pkgs-2.6.7/build' make[2]: Nothing to be done for `gazebo_plugins/CMakeFiles/diagnostic_msgs_generate_messages_lisp.dir/build'. make[2]: Leaving directory `/local/robotpkg/var/tmp/robotpkg/wip/prf-gazebo-ros-pkgs/work/gazebo_ros_pkgs-2.6.7/build' make[2]: Leaving directory `/local/robotpkg/var/tmp/robotpkg/wip/prf-gazebo-ros-pkgs/work/gazebo_ros_pkgs-2.6.7/build' make -f gazebo_plugins/CMakeFiles/diagnostic_msgs_generate_messages_py.dir/build.make gazebo_plugins/CMakeFiles/diagnostic_msgs_generate_messages_py.dir/build [ 1%] /usr/bin/cmake -E cmake_progress_report /local/robotpkg/var/tmp/robotpkg/wip/prf-gazebo-ros-pkgs/work/gazebo_ros_pkgs-2.6.7/build/CMakeFiles make[2]: Entering directory `/local/robotpkg/var/tmp/robotpkg/wip/prf-gazebo-ros-pkgs/work/gazebo_ros_pkgs-2.6.7/build' make[2]: Nothing to be done for `gazebo_plugins/CMakeFiles/diagnostic_msgs_generate_messages_py.dir/build'. make[2]: Leaving directory `/local/robotpkg/var/tmp/robotpkg/wip/prf-gazebo-ros-pkgs/work/gazebo_ros_pkgs-2.6.7/build' [ 1%] /usr/bin/cmake -E cmake_progress_report /local/robotpkg/var/tmp/robotpkg/wip/prf-gazebo-ros-pkgs/work/gazebo_ros_pkgs-2.6.7/build/CMakeFiles Built target polled_camera_generate_messages_lisp make -f gazebo_plugins/CMakeFiles/polled_camera_generate_messages_py.dir/build.make gazebo_plugins/CMakeFiles/polled_camera_generate_messages_py.dir/depend Built target diagnostic_msgs_generate_messages_lisp make -f gazebo_plugins/CMakeFiles/gazebo_ros_block_laser.dir/build.make gazebo_plugins/CMakeFiles/gazebo_ros_block_laser.dir/depend [ 1%] make[2]: Entering directory `/local/robotpkg/var/tmp/robotpkg/wip/prf-gazebo-ros-pkgs/work/gazebo_ros_pkgs-2.6.7/build' cd /local/robotpkg/var/tmp/robotpkg/wip/prf-gazebo-ros-pkgs/work/gazebo_ros_pkgs-2.6.7/build && /usr/bin/cmake -E cmake_depends "Unix Makefiles" /local/robotpkg/var/tmp/robotpkg/wip/prf-gazebo-ros-pkgs/work/gazebo_ros_pkgs-2.6.7 /local/robotpkg/var/tmp/robotpkg/wip/prf-gazebo-ros-pkgs/work/gazebo_ros_pkgs-2.6.7/gazebo_plugins /local/robotpkg/var/tmp/robotpkg/wip/prf-gazebo-ros-pkgs/work/gazebo_ros_pkgs-2.6.7/build /local/robotpkg/var/tmp/robotpkg/wip/prf-gazebo-ros-pkgs/work/gazebo_ros_pkgs-2.6.7/build/gazebo_plugins /local/robotpkg/var/tmp/robotpkg/wip/prf-gazebo-ros-pkgs/work/gazebo_ros_pkgs-2.6.7/build/gazebo_plugins/CMakeFiles/polled_camera_generate_messages_py.dir/DependInfo.cmake --color= make[2]: Entering directory `/local/robotpkg/var/tmp/robotpkg/wip/prf-gazebo-ros-pkgs/work/gazebo_ros_pkgs-2.6.7/build' cd /local/robotpkg/var/tmp/robotpkg/wip/prf-gazebo-ros-pkgs/work/gazebo_ros_pkgs-2.6.7/build && /usr/bin/cmake -E cmake_depends "Unix Makefiles" /local/robotpkg/var/tmp/robotpkg/wip/prf-gazebo-ros-pkgs/work/gazebo_ros_pkgs-2.6.7 /local/robotpkg/var/tmp/robotpkg/wip/prf-gazebo-ros-pkgs/work/gazebo_ros_pkgs-2.6.7/gazebo_plugins /local/robotpkg/var/tmp/robotpkg/wip/prf-gazebo-ros-pkgs/work/gazebo_ros_pkgs-2.6.7/build /local/robotpkg/var/tmp/robotpkg/wip/prf-gazebo-ros-pkgs/work/gazebo_ros_pkgs-2.6.7/build/gazebo_plugins /local/robotpkg/var/tmp/robotpkg/wip/prf-gazebo-ros-pkgs/work/gazebo_ros_pkgs-2.6.7/build/gazebo_plugins/CMakeFiles/gazebo_ros_block_laser.dir/DependInfo.cmake --color= Built target diagnostic_msgs_generate_messages_py make -f gazebo_plugins/CMakeFiles/gazebo_ros_utils.dir/build.make gazebo_plugins/CMakeFiles/gazebo_ros_utils.dir/depend make[2]: Entering directory `/local/robotpkg/var/tmp/robotpkg/wip/prf-gazebo-ros-pkgs/work/gazebo_ros_pkgs-2.6.7/build' cd /local/robotpkg/var/tmp/robotpkg/wip/prf-gazebo-ros-pkgs/work/gazebo_ros_pkgs-2.6.7/build && /usr/bin/cmake -E cmake_depends "Unix Makefiles" /local/robotpkg/var/tmp/robotpkg/wip/prf-gazebo-ros-pkgs/work/gazebo_ros_pkgs-2.6.7 /local/robotpkg/var/tmp/robotpkg/wip/prf-gazebo-ros-pkgs/work/gazebo_ros_pkgs-2.6.7/gazebo_plugins /local/robotpkg/var/tmp/robotpkg/wip/prf-gazebo-ros-pkgs/work/gazebo_ros_pkgs-2.6.7/build /local/robotpkg/var/tmp/robotpkg/wip/prf-gazebo-ros-pkgs/work/gazebo_ros_pkgs-2.6.7/build/gazebo_plugins /local/robotpkg/var/tmp/robotpkg/wip/prf-gazebo-ros-pkgs/work/gazebo_ros_pkgs-2.6.7/build/gazebo_plugins/CMakeFiles/gazebo_ros_utils.dir/DependInfo.cmake --color= Scanning dependencies of target polled_camera_generate_messages_py make[2]: Leaving directory `/local/robotpkg/var/tmp/robotpkg/wip/prf-gazebo-ros-pkgs/work/gazebo_ros_pkgs-2.6.7/build' make -f gazebo_plugins/CMakeFiles/polled_camera_generate_messages_py.dir/build.make gazebo_plugins/CMakeFiles/polled_camera_generate_messages_py.dir/build make[2]: Entering directory `/local/robotpkg/var/tmp/robotpkg/wip/prf-gazebo-ros-pkgs/work/gazebo_ros_pkgs-2.6.7/build' make[2]: Nothing to be done for `gazebo_plugins/CMakeFiles/polled_camera_generate_messages_py.dir/build'. make[2]: Leaving directory `/local/robotpkg/var/tmp/robotpkg/wip/prf-gazebo-ros-pkgs/work/gazebo_ros_pkgs-2.6.7/build' /usr/bin/cmake -E cmake_progress_report /local/robotpkg/var/tmp/robotpkg/wip/prf-gazebo-ros-pkgs/work/gazebo_ros_pkgs-2.6.7/build/CMakeFiles [ 1%] Built target polled_camera_generate_messages_py make -f gazebo_plugins/CMakeFiles/gazebo_ros_f3d.dir/build.make gazebo_plugins/CMakeFiles/gazebo_ros_f3d.dir/depend make[2]: Entering directory `/local/robotpkg/var/tmp/robotpkg/wip/prf-gazebo-ros-pkgs/work/gazebo_ros_pkgs-2.6.7/build' cd /local/robotpkg/var/tmp/robotpkg/wip/prf-gazebo-ros-pkgs/work/gazebo_ros_pkgs-2.6.7/build && /usr/bin/cmake -E cmake_depends "Unix Makefiles" /local/robotpkg/var/tmp/robotpkg/wip/prf-gazebo-ros-pkgs/work/gazebo_ros_pkgs-2.6.7 /local/robotpkg/var/tmp/robotpkg/wip/prf-gazebo-ros-pkgs/work/gazebo_ros_pkgs-2.6.7/gazebo_plugins /local/robotpkg/var/tmp/robotpkg/wip/prf-gazebo-ros-pkgs/work/gazebo_ros_pkgs-2.6.7/build /local/robotpkg/var/tmp/robotpkg/wip/prf-gazebo-ros-pkgs/work/gazebo_ros_pkgs-2.6.7/build/gazebo_plugins /local/robotpkg/var/tmp/robotpkg/wip/prf-gazebo-ros-pkgs/work/gazebo_ros_pkgs-2.6.7/build/gazebo_plugins/CMakeFiles/gazebo_ros_f3d.dir/DependInfo.cmake --color= Scanning dependencies of target MultiCameraPlugin make[2]: Leaving directory `/local/robotpkg/var/tmp/robotpkg/wip/prf-gazebo-ros-pkgs/work/gazebo_ros_pkgs-2.6.7/build' make -f gazebo_plugins/CMakeFiles/MultiCameraPlugin.dir/build.make gazebo_plugins/CMakeFiles/MultiCameraPlugin.dir/build Scanning dependencies of target gazebo_ros_block_laser Scanning dependencies of target gazebo_ros_utils make[2]: Leaving directory `/local/robotpkg/var/tmp/robotpkg/wip/prf-gazebo-ros-pkgs/work/gazebo_ros_pkgs-2.6.7/build' make -f gazebo_plugins/CMakeFiles/gazebo_ros_utils.dir/build.make gazebo_plugins/CMakeFiles/gazebo_ros_utils.dir/build make[2]: Leaving directory `/local/robotpkg/var/tmp/robotpkg/wip/prf-gazebo-ros-pkgs/work/gazebo_ros_pkgs-2.6.7/build' make[2]: Entering directory `/local/robotpkg/var/tmp/robotpkg/wip/prf-gazebo-ros-pkgs/work/gazebo_ros_pkgs-2.6.7/build' /usr/bin/cmake -E cmake_progress_report /local/robotpkg/var/tmp/robotpkg/wip/prf-gazebo-ros-pkgs/work/gazebo_ros_pkgs-2.6.7/build/CMakeFiles make -f gazebo_plugins/CMakeFiles/gazebo_ros_block_laser.dir/build.make gazebo_plugins/CMakeFiles/gazebo_ros_block_laser.dir/build [ 1%] make[2]: Entering directory `/local/robotpkg/var/tmp/robotpkg/wip/prf-gazebo-ros-pkgs/work/gazebo_ros_pkgs-2.6.7/build' /usr/bin/cmake -E cmake_progress_report /local/robotpkg/var/tmp/robotpkg/wip/prf-gazebo-ros-pkgs/work/gazebo_ros_pkgs-2.6.7/build/CMakeFiles Scanning dependencies of target gazebo_ros_f3d make[2]: Leaving directory `/local/robotpkg/var/tmp/robotpkg/wip/prf-gazebo-ros-pkgs/work/gazebo_ros_pkgs-2.6.7/build' make -f gazebo_plugins/CMakeFiles/gazebo_ros_f3d.dir/build.make gazebo_plugins/CMakeFiles/gazebo_ros_f3d.dir/build make[2]: Entering directory `/local/robotpkg/var/tmp/robotpkg/wip/prf-gazebo-ros-pkgs/work/gazebo_ros_pkgs-2.6.7/build' /usr/bin/cmake -E cmake_progress_report /local/robotpkg/var/tmp/robotpkg/wip/prf-gazebo-ros-pkgs/work/gazebo_ros_pkgs-2.6.7/build/CMakeFiles [ 1%] Building CXX object gazebo_plugins/CMakeFiles/MultiCameraPlugin.dir/src/MultiCameraPlugin.cpp.o cd /local/robotpkg/var/tmp/robotpkg/wip/prf-gazebo-ros-pkgs/work/gazebo_ros_pkgs-2.6.7/build/gazebo_plugins && /usr/bin/g++ -DMultiCameraPlugin_EXPORTS -DROS_BUILD_SHARED_LIBS=1 -DROS_PACKAGE_NAME="gazebo_plugins" -DROSCONSOLE_BACKEND_LOG4CXX -pipe -O3 -DNDEBUG -fPIC -I/local/robotpkg/var/tmp/robotpkg/wip/prf-gazebo-ros-pkgs/work/stage/include -I/local/robotpkg/var/tmp/robotpkg/wip/prf-gazebo-ros-pkgs/work/gazebo_ros_pkgs-2.6.7/gazebo_plugins/include -I/opt/ros/hydro/include -I/opt/ros/hydro/include/opencv -I/usr/include/gazebo-1.9 -I/usr/include/gazebo-1.9/gazebo -I/usr/include/sdformat-1.4 -I/usr/include/OGRE -I/usr/include/OGRE/Terrain -I/usr/include/OGRE/Paging -fPIC -o CMakeFiles/MultiCameraPlugin.dir/src/MultiCameraPlugin.cpp.o -c /local/robotpkg/var/tmp/robotpkg/wip/prf-gazebo-ros-pkgs/work/gazebo_ros_pkgs-2.6.7/gazebo_plugins/src/MultiCameraPlugin.cpp Building CXX object gazebo_plugins/CMakeFiles/gazebo_ros_utils.dir/src/gazebo_ros_utils.cpp.o [ 1%] cd /local/robotpkg/var/tmp/robotpkg/wip/prf-gazebo-ros-pkgs/work/gazebo_ros_pkgs-2.6.7/build/gazebo_plugins && /usr/bin/g++ -Dgazebo_ros_utils_EXPORTS -DROS_BUILD_SHARED_LIBS=1 -DROS_PACKAGE_NAME="gazebo_plugins" -DROSCONSOLE_BACKEND_LOG4CXX -pipe -O3 -DNDEBUG -fPIC -I/local/robotpkg/var/tmp/robotpkg/wip/prf-gazebo-ros-pkgs/work/stage/include -I/local/robotpkg/var/tmp/robotpkg/wip/prf-gazebo-ros-pkgs/work/gazebo_ros_pkgs-2.6.7/gazebo_plugins/include -I/opt/ros/hydro/include -I/opt/ros/hydro/include/opencv -I/usr/include/gazebo-1.9 -I/usr/include/gazebo-1.9/gazebo -I/usr/include/sdformat-1.4 -I/usr/include/OGRE -I/usr/include/OGRE/Terrain -I/usr/include/OGRE/Paging -fPIC -o CMakeFiles/gazebo_ros_utils.dir/src/gazebo_ros_utils.cpp.o -c /local/robotpkg/var/tmp/robotpkg/wip/prf-gazebo-ros-pkgs/work/gazebo_ros_pkgs-2.6.7/gazebo_plugins/src/gazebo_ros_utils.cpp make[2]: Entering directory `/local/robotpkg/var/tmp/robotpkg/wip/prf-gazebo-ros-pkgs/work/gazebo_ros_pkgs-2.6.7/build' /usr/bin/cmake -E cmake_progress_report /local/robotpkg/var/tmp/robotpkg/wip/prf-gazebo-ros-pkgs/work/gazebo_ros_pkgs-2.6.7/build/CMakeFiles 79 Building CXX object gazebo_plugins/CMakeFiles/gazebo_ros_block_laser.dir/src/gazebo_ros_block_laser.cpp.o cd /local/robotpkg/var/tmp/robotpkg/wip/prf-gazebo-ros-pkgs/work/gazebo_ros_pkgs-2.6.7/build/gazebo_plugins && /usr/bin/g++ -Dgazebo_ros_block_laser_EXPORTS -DROS_BUILD_SHARED_LIBS=1 -DROS_PACKAGE_NAME="gazebo_plugins" -DROSCONSOLE_BACKEND_LOG4CXX -pipe -O3 -DNDEBUG -fPIC -I/local/robotpkg/var/tmp/robotpkg/wip/prf-gazebo-ros-pkgs/work/stage/include -I/local/robotpkg/var/tmp/robotpkg/wip/prf-gazebo-ros-pkgs/work/gazebo_ros_pkgs-2.6.7/gazebo_plugins/include -I/opt/ros/hydro/include -I/opt/ros/hydro/include/opencv -I/usr/include/gazebo-1.9 -I/usr/include/gazebo-1.9/gazebo -I/usr/include/sdformat-1.4 -I/usr/include/OGRE -I/usr/include/OGRE/Terrain -I/usr/include/OGRE/Paging -fPIC -o CMakeFiles/gazebo_ros_block_laser.dir/src/gazebo_ros_block_laser.cpp.o -c /local/robotpkg/var/tmp/robotpkg/wip/prf-gazebo-ros-pkgs/work/gazebo_ros_pkgs-2.6.7/gazebo_plugins/src/gazebo_ros_block_laser.cpp [ 2%] Building CXX object gazebo_plugins/CMakeFiles/gazebo_ros_f3d.dir/src/gazebo_ros_f3d.cpp.o cd /local/robotpkg/var/tmp/robotpkg/wip/prf-gazebo-ros-pkgs/work/gazebo_ros_pkgs-2.6.7/build/gazebo_plugins && /usr/bin/g++ -Dgazebo_ros_f3d_EXPORTS -DROS_BUILD_SHARED_LIBS=1 -DROS_PACKAGE_NAME="gazebo_plugins" -DROSCONSOLE_BACKEND_LOG4CXX -pipe -O3 -DNDEBUG -fPIC -I/local/robotpkg/var/tmp/robotpkg/wip/prf-gazebo-ros-pkgs/work/stage/include -I/local/robotpkg/var/tmp/robotpkg/wip/prf-gazebo-ros-pkgs/work/gazebo_ros_pkgs-2.6.7/gazebo_plugins/include -I/opt/ros/hydro/include -I/opt/ros/hydro/include/opencv -I/usr/include/gazebo-1.9 -I/usr/include/gazebo-1.9/gazebo -I/usr/include/sdformat-1.4 -I/usr/include/OGRE -I/usr/include/OGRE/Terrain -I/usr/include/OGRE/Paging -fPIC -o CMakeFiles/gazebo_ros_f3d.dir/src/gazebo_ros_f3d.cpp.o -c /local/robotpkg/var/tmp/robotpkg/wip/prf-gazebo-ros-pkgs/work/gazebo_ros_pkgs-2.6.7/gazebo_plugins/src/gazebo_ros_f3d.cpp /local/robotpkg/var/tmp/robotpkg/wip/prf-gazebo-ros-pkgs/work/gazebo_ros_pkgs-2.6.7/gazebo_plugins/src/gazebo_ros_f3d.cpp: In member function 'virtual void gazebo::GazeboRosF3D::UpdateChild()': /local/robotpkg/var/tmp/robotpkg/wip/prf-gazebo-ros-pkgs/work/gazebo_ros_pkgs-2.6.7/gazebo_plugins/src/gazebo_ros_f3d.cpp:152:3: error: 'ignition' has not been declared /local/robotpkg/var/tmp/robotpkg/wip/prf-gazebo-ros-pkgs/work/gazebo_ros_pkgs-2.6.7/gazebo_plugins/src/gazebo_ros_f3d.cpp:152:28: error: expected ';' before 'torque' /local/robotpkg/var/tmp/robotpkg/wip/prf-gazebo-ros-pkgs/work/gazebo_ros_pkgs-2.6.7/gazebo_plugins/src/gazebo_ros_f3d.cpp:153:3: error: 'ignition' has not been declared /local/robotpkg/var/tmp/robotpkg/wip/prf-gazebo-ros-pkgs/work/gazebo_ros_pkgs-2.6.7/gazebo_plugins/src/gazebo_ros_f3d.cpp:153:28: error: expected ';' before 'force' /local/robotpkg/var/tmp/robotpkg/wip/prf-gazebo-ros-pkgs/work/gazebo_ros_pkgs-2.6.7/gazebo_plugins/src/gazebo_ros_f3d.cpp:160:3: error: 'force' was not declared in this scope /local/robotpkg/var/tmp/robotpkg/wip/prf-gazebo-ros-pkgs/work/gazebo_ros_pkgs-2.6.7/gazebo_plugins/src/gazebo_ros_f3d.cpp:160:40: error: 'class gazebo::math::Vector3' has no member named 'Ign' /local/robotpkg/var/tmp/robotpkg/wip/prf-gazebo-ros-pkgs/work/gazebo_ros_pkgs-2.6.7/gazebo_plugins/src/gazebo_ros_f3d.cpp:161:3: error: 'torque' was not declared in this scope /local/robotpkg/var/tmp/robotpkg/wip/prf-gazebo-ros-pkgs/work/gazebo_ros_pkgs-2.6.7/gazebo_plugins/src/gazebo_ros_f3d.cpp:161:42: error: 'class gazebo::math::Vector3' has no member named 'Ign' In file included from /local/robotpkg/var/tmp/robotpkg/wip/prf-gazebo-ros-pkgs/work/gazebo_ros_pkgs-2.6.7/gazebo_plugins/src/gazebo_ros_utils.cpp:35:0: /local/robotpkg/var/tmp/robotpkg/wip/prf-gazebo-ros-pkgs/work/gazebo_ros_pkgs-2.6.7/gazebo_plugins/include/gazebo_plugins/gazebo_ros_utils.h: In function 'std::string gazebo::GetModelName(const SensorPtr&)': /local/robotpkg/var/tmp/robotpkg/wip/prf-gazebo-ros-pkgs/work/gazebo_ros_pkgs-2.6.7/gazebo_plugins/include/gazebo_plugins/gazebo_ros_utils.h:61:38: error: 'class gazebo::sensors::Sensor' has no member named 'ScopedName' In file included from /local/robotpkg/var/tmp/robotpkg/wip/prf-gazebo-ros-pkgs/work/gazebo_ros_pkgs-2.6.7/gazebo_plugins/src/MultiCameraPlugin.cpp:19:0: /local/robotpkg/var/tmp/robotpkg/wip/prf-gazebo-ros-pkgs/work/gazebo_ros_pkgs-2.6.7/gazebo_plugins/include/gazebo_plugins/MultiCameraPlugin.h:46:16: error: 'MultiCameraSensorPtr' in namespace 'gazebo::sensors' does not name a type In file included from /local/robotpkg/var/tmp/robotpkg/wip/prf-gazebo-ros-pkgs/work/gazebo_ros_pkgs-2.6.7/gazebo_plugins/src/MultiCameraPlugin.cpp:20:0: /local/robotpkg/var/tmp/robotpkg/wip/prf-gazebo-ros-pkgs/work/gazebo_ros_pkgs-2.6.7/gazebo_plugins/include/gazebo_plugins/gazebo_ros_utils.h: In function 'std::string gazebo::GetModelName(const SensorPtr&)': /local/robotpkg/var/tmp/robotpkg/wip/prf-gazebo-ros-pkgs/work/gazebo_ros_pkgs-2.6.7/gazebo_plugins/include/gazebo_plugins/gazebo_ros_utils.h:61:38: error: 'class gazebo::sensors::Sensor' has no member named 'ScopedName' /local/robotpkg/var/tmp/robotpkg/wip/prf-gazebo-ros-pkgs/work/gazebo_ros_pkgs-2.6.7/gazebo_plugins/src/MultiCameraPlugin.cpp: In destructor 'virtual gazebo::MultiCameraPlugin::~MultiCameraPlugin()': /local/robotpkg/var/tmp/robotpkg/wip/prf-gazebo-ros-pkgs/work/gazebo_ros_pkgs-2.6.7/gazebo_plugins/src/MultiCameraPlugin.cpp:33:9: error: 'class gazebo::MultiCameraPlugin' has no member named 'parentSensor' /local/robotpkg/var/tmp/robotpkg/wip/prf-gazebo-ros-pkgs/work/gazebo_ros_pkgs-2.6.7/gazebo_plugins/src/MultiCameraPlugin.cpp: In member function 'virtual void gazebo::MultiCameraPlugin::Load(gazebo::sensors::SensorPtr, sdf::ElementPtr)': /local/robotpkg/var/tmp/robotpkg/wip/prf-gazebo-ros-pkgs/work/gazebo_ros_pkgs-2.6.7/gazebo_plugins/src/MultiCameraPlugin.cpp:44:3: error: 'std::dynamic_pointer_cast' has not been declared /local/robotpkg/var/tmp/robotpkg/wip/prf-gazebo-ros-pkgs/work/gazebo_ros_pkgs-2.6.7/gazebo_plugins/src/MultiCameraPlugin.cpp:45:9: error: 'class gazebo::MultiCameraPlugin' has no member named 'parentSensor' /local/robotpkg/var/tmp/robotpkg/wip/prf-gazebo-ros-pkgs/work/gazebo_ros_pkgs-2.6.7/gazebo_plugins/src/MultiCameraPlugin.cpp:46:5: error: 'dynamic_pointer_cast' was not declared in this scope /local/robotpkg/var/tmp/robotpkg/wip/prf-gazebo-ros-pkgs/work/gazebo_ros_pkgs-2.6.7/gazebo_plugins/src/MultiCameraPlugin.cpp:46:5: note: suggested alternative: /usr/include/boost/smart_ptr/shared_ptr.hpp:520:42: note: 'boost::dynamic_pointer_cast' /local/robotpkg/var/tmp/robotpkg/wip/prf-gazebo-ros-pkgs/work/gazebo_ros_pkgs-2.6.7/gazebo_plugins/src/MultiCameraPlugin.cpp:46:52: error: expected primary-expression before '>' token /local/robotpkg/var/tmp/robotpkg/wip/prf-gazebo-ros-pkgs/work/gazebo_ros_pkgs-2.6.7/gazebo_plugins/src/MultiCameraPlugin.cpp:48:14: error: 'class gazebo::MultiCameraPlugin' has no member named 'parentSensor' /local/robotpkg/var/tmp/robotpkg/wip/prf-gazebo-ros-pkgs/work/gazebo_ros_pkgs-2.6.7/gazebo_plugins/src/MultiCameraPlugin.cpp:51:56: error: expected primary-expression before '>' token /local/robotpkg/var/tmp/robotpkg/wip/prf-gazebo-ros-pkgs/work/gazebo_ros_pkgs-2.6.7/gazebo_plugins/src/MultiCameraPlugin.cpp:53:51: error: expected primary-expression before '>' token /local/robotpkg/var/tmp/robotpkg/wip/prf-gazebo-ros-pkgs/work/gazebo_ros_pkgs-2.6.7/gazebo_plugins/src/MultiCameraPlugin.cpp:57:14: error: 'class gazebo::MultiCameraPlugin' has no member named 'parentSensor' /local/robotpkg/var/tmp/robotpkg/wip/prf-gazebo-ros-pkgs/work/gazebo_ros_pkgs-2.6.7/gazebo_plugins/src/MultiCameraPlugin.cpp:63:38: error: 'class gazebo::MultiCameraPlugin' has no member named 'parentSensor' /local/robotpkg/var/tmp/robotpkg/wip/prf-gazebo-ros-pkgs/work/gazebo_ros_pkgs-2.6.7/gazebo_plugins/src/MultiCameraPlugin.cpp:65:34: error: 'class gazebo::MultiCameraPlugin' has no member named 'parentSensor' /local/robotpkg/var/tmp/robotpkg/wip/prf-gazebo-ros-pkgs/work/gazebo_ros_pkgs-2.6.7/gazebo_plugins/src/MultiCameraPlugin.cpp:68:44: error: 'class gazebo::rendering::Camera' has no member named 'ImageWidth' /local/robotpkg/var/tmp/robotpkg/wip/prf-gazebo-ros-pkgs/work/gazebo_ros_pkgs-2.6.7/gazebo_plugins/src/MultiCameraPlugin.cpp:69:45: error: 'class gazebo::rendering::Camera' has no member named 'ImageHeight' /local/robotpkg/var/tmp/robotpkg/wip/prf-gazebo-ros-pkgs/work/gazebo_ros_pkgs-2.6.7/gazebo_plugins/src/MultiCameraPlugin.cpp:70:44: error: 'class gazebo::rendering::Camera' has no member named 'ImageDepth' /local/robotpkg/var/tmp/robotpkg/wip/prf-gazebo-ros-pkgs/work/gazebo_ros_pkgs-2.6.7/gazebo_plugins/src/MultiCameraPlugin.cpp:71:45: error: 'class gazebo::rendering::Camera' has no member named 'ImageFormat' /local/robotpkg/var/tmp/robotpkg/wip/prf-gazebo-ros-pkgs/work/gazebo_ros_pkgs-2.6.7/gazebo_plugins/src/MultiCameraPlugin.cpp:73:36: error: 'class gazebo::MultiCameraPlugin' has no member named 'parentSensor' /local/robotpkg/var/tmp/robotpkg/wip/prf-gazebo-ros-pkgs/work/gazebo_ros_pkgs-2.6.7/gazebo_plugins/src/MultiCameraPlugin.cpp:91:9: error: 'class gazebo::MultiCameraPlugin' has no member named 'parentSensor' make[2]: *** [gazebo_plugins/CMakeFiles/gazebo_ros_f3d.dir/src/gazebo_ros_f3d.cpp.o] Error 1 make[2]: Leaving directory `/local/robotpkg/var/tmp/robotpkg/wip/prf-gazebo-ros-pkgs/work/gazebo_ros_pkgs-2.6.7/build' make[1]: *** [gazebo_plugins/CMakeFiles/gazebo_ros_f3d.dir/all] Error 2 make[1]: *** Waiting for unfinished jobs.... make[2]: *** [gazebo_plugins/CMakeFiles/gazebo_ros_utils.dir/src/gazebo_ros_utils.cpp.o] Error 1 make[2]: Leaving directory `/local/robotpkg/var/tmp/robotpkg/wip/prf-gazebo-ros-pkgs/work/gazebo_ros_pkgs-2.6.7/build' make[1]: *** [gazebo_plugins/CMakeFiles/gazebo_ros_utils.dir/all] Error 2 In file included from /local/robotpkg/var/tmp/robotpkg/wip/prf-gazebo-ros-pkgs/work/gazebo_ros_pkgs-2.6.7/gazebo_plugins/src/gazebo_ros_block_laser.cpp:27:0: /local/robotpkg/var/tmp/robotpkg/wip/prf-gazebo-ros-pkgs/work/gazebo_ros_pkgs-2.6.7/gazebo_plugins/include/gazebo_plugins/gazebo_ros_utils.h: In function 'std::string gazebo::GetModelName(const SensorPtr&)': /local/robotpkg/var/tmp/robotpkg/wip/prf-gazebo-ros-pkgs/work/gazebo_ros_pkgs-2.6.7/gazebo_plugins/include/gazebo_plugins/gazebo_ros_utils.h:61:38: error: 'class gazebo::sensors::Sensor' has no member named 'ScopedName' /local/robotpkg/var/tmp/robotpkg/wip/prf-gazebo-ros-pkgs/work/gazebo_ros_pkgs-2.6.7/gazebo_plugins/src/gazebo_ros_block_laser.cpp: In member function 'virtual void gazebo::GazeboRosBlockLaser::Load(gazebo::sensors::SensorPtr, sdf::ElementPtr)': /local/robotpkg/var/tmp/robotpkg/wip/prf-gazebo-ros-pkgs/work/gazebo_ros_pkgs-2.6.7/gazebo_plugins/src/gazebo_ros_block_laser.cpp:82:36: error: 'class gazebo::sensors::Sensor' has no member named 'WorldName' /local/robotpkg/var/tmp/robotpkg/wip/prf-gazebo-ros-pkgs/work/gazebo_ros_pkgs-2.6.7/gazebo_plugins/src/gazebo_ros_block_laser.cpp:90:3: error: 'std::dynamic_pointer_cast' has not been declared /local/robotpkg/var/tmp/robotpkg/wip/prf-gazebo-ros-pkgs/work/gazebo_ros_pkgs-2.6.7/gazebo_plugins/src/gazebo_ros_block_laser.cpp:91:30: error: 'dynamic_pointer_cast' was not declared in this scope /local/robotpkg/var/tmp/robotpkg/wip/prf-gazebo-ros-pkgs/work/gazebo_ros_pkgs-2.6.7/gazebo_plugins/src/gazebo_ros_block_laser.cpp:91:30: note: suggested alternative: /usr/include/boost/smart_ptr/intrusive_ptr.hpp:253:45: note: 'boost::dynamic_pointer_cast' /local/robotpkg/var/tmp/robotpkg/wip/prf-gazebo-ros-pkgs/work/gazebo_ros_pkgs-2.6.7/gazebo_plugins/src/gazebo_ros_block_laser.cpp:91:69: error: expected primary-expression before '>' token /local/robotpkg/var/tmp/robotpkg/wip/prf-gazebo-ros-pkgs/work/gazebo_ros_pkgs-2.6.7/gazebo_plugins/src/gazebo_ros_block_laser.cpp: In member function 'virtual void gazebo::GazeboRosBlockLaser::OnNewLaserScans()': /local/robotpkg/var/tmp/robotpkg/wip/prf-gazebo-ros-pkgs/work/gazebo_ros_pkgs-2.6.7/gazebo_plugins/src/gazebo_ros_block_laser.cpp:209:61: error: 'class gazebo::sensors::Sensor' has no member named 'LastUpdateTime' /local/robotpkg/var/tmp/robotpkg/wip/prf-gazebo-ros-pkgs/work/gazebo_ros_pkgs-2.6.7/gazebo_plugins/src/gazebo_ros_block_laser.cpp: In member function 'void gazebo::GazeboRosBlockLaser::PutLaserData(gazebo::common::Time&)': /local/robotpkg/var/tmp/robotpkg/wip/prf-gazebo-ros-pkgs/work/gazebo_ros_pkgs-2.6.7/gazebo_plugins/src/gazebo_ros_block_laser.cpp:235:8: error: 'maxAngle' does not name a type /local/robotpkg/var/tmp/robotpkg/wip/prf-gazebo-ros-pkgs/work/gazebo_ros_pkgs-2.6.7/gazebo_plugins/src/gazebo_ros_block_laser.cpp:236:8: error: 'minAngle' does not name a type /local/robotpkg/var/tmp/robotpkg/wip/prf-gazebo-ros-pkgs/work/gazebo_ros_pkgs-2.6.7/gazebo_plugins/src/gazebo_ros_block_laser.cpp:238:47: error: 'class gazebo::sensors::RaySensor' has no member named 'RangeMax' /local/robotpkg/var/tmp/robotpkg/wip/prf-gazebo-ros-pkgs/work/gazebo_ros_pkgs-2.6.7/gazebo_plugins/src/gazebo_ros_block_laser.cpp:239:47: error: 'class gazebo::sensors::RaySensor' has no member named 'RangeMin' /local/robotpkg/var/tmp/robotpkg/wip/prf-gazebo-ros-pkgs/work/gazebo_ros_pkgs-2.6.7/gazebo_plugins/src/gazebo_ros_block_laser.cpp:240:44: error: 'class gazebo::sensors::RaySensor' has no member named 'RayCount' /local/robotpkg/var/tmp/robotpkg/wip/prf-gazebo-ros-pkgs/work/gazebo_ros_pkgs-2.6.7/gazebo_plugins/src/gazebo_ros_block_laser.cpp:241:46: error: 'class gazebo::sensors::RaySensor' has no member named 'RangeCount' /local/robotpkg/var/tmp/robotpkg/wip/prf-gazebo-ros-pkgs/work/gazebo_ros_pkgs-2.6.7/gazebo_plugins/src/gazebo_ros_block_laser.cpp:243:52: error: 'class gazebo::sensors::RaySensor' has no member named 'VerticalRayCount' /local/robotpkg/var/tmp/robotpkg/wip/prf-gazebo-ros-pkgs/work/gazebo_ros_pkgs-2.6.7/gazebo_plugins/src/gazebo_ros_block_laser.cpp:244:54: error: 'class gazebo::sensors::RaySensor' has no member named 'VerticalRangeCount' /local/robotpkg/var/tmp/robotpkg/wip/prf-gazebo-ros-pkgs/work/gazebo_ros_pkgs-2.6.7/gazebo_plugins/src/gazebo_ros_block_laser.cpp:245:8: error: 'verticalMaxAngle' does not name a type /local/robotpkg/var/tmp/robotpkg/wip/prf-gazebo-ros-pkgs/work/gazebo_ros_pkgs-2.6.7/gazebo_plugins/src/gazebo_ros_block_laser.cpp:246:8: error: 'verticalMinAngle' does not name a type /local/robotpkg/var/tmp/robotpkg/wip/prf-gazebo-ros-pkgs/work/gazebo_ros_pkgs-2.6.7/gazebo_plugins/src/gazebo_ros_block_laser.cpp:248:18: error: 'maxAngle' was not declared in this scope /local/robotpkg/var/tmp/robotpkg/wip/prf-gazebo-ros-pkgs/work/gazebo_ros_pkgs-2.6.7/gazebo_plugins/src/gazebo_ros_block_laser.cpp:248:38: error: 'minAngle' was not declared in this scope /local/robotpkg/var/tmp/robotpkg/wip/prf-gazebo-ros-pkgs/work/gazebo_ros_pkgs-2.6.7/gazebo_plugins/src/gazebo_ros_block_laser.cpp:249:18: error: 'verticalMaxAngle' was not declared in this scope /local/robotpkg/var/tmp/robotpkg/wip/prf-gazebo-ros-pkgs/work/gazebo_ros_pkgs-2.6.7/gazebo_plugins/src/gazebo_ros_block_laser.cpp:249:46: error: 'verticalMinAngle' was not declared in this scope /local/robotpkg/var/tmp/robotpkg/wip/prf-gazebo-ros-pkgs/work/gazebo_ros_pkgs-2.6.7/gazebo_plugins/src/gazebo_ros_block_laser.cpp:297:47: error: 'class gazebo::sensors::RaySensor' has no member named 'LaserShape' /local/robotpkg/var/tmp/robotpkg/wip/prf-gazebo-ros-pkgs/work/gazebo_ros_pkgs-2.6.7/gazebo_plugins/src/gazebo_ros_block_laser.cpp:298:47: error: 'class gazebo::sensors::RaySensor' has no member named 'LaserShape' /local/robotpkg/var/tmp/robotpkg/wip/prf-gazebo-ros-pkgs/work/gazebo_ros_pkgs-2.6.7/gazebo_plugins/src/gazebo_ros_block_laser.cpp:299:47: error: 'class gazebo::sensors::RaySensor' has no member named 'LaserShape' /local/robotpkg/var/tmp/robotpkg/wip/prf-gazebo-ros-pkgs/work/gazebo_ros_pkgs-2.6.7/gazebo_plugins/src/gazebo_ros_block_laser.cpp:300:47: error: 'class gazebo::sensors::RaySensor' has no member named 'LaserShape' /local/robotpkg/var/tmp/robotpkg/wip/prf-gazebo-ros-pkgs/work/gazebo_ros_pkgs-2.6.7/gazebo_plugins/src/gazebo_ros_block_laser.cpp:308:51: error: 'class gazebo::sensors::RaySensor' has no member named 'LaserShape' /local/robotpkg/var/tmp/robotpkg/wip/prf-gazebo-ros-pkgs/work/gazebo_ros_pkgs-2.6.7/gazebo_plugins/src/gazebo_ros_block_laser.cpp:309:51: error: 'class gazebo::sensors::RaySensor' has no member named 'LaserShape' /local/robotpkg/var/tmp/robotpkg/wip/prf-gazebo-ros-pkgs/work/gazebo_ros_pkgs-2.6.7/gazebo_plugins/src/gazebo_ros_block_laser.cpp:310:51: error: 'class gazebo::sensors::RaySensor' has no member named 'LaserShape' /local/robotpkg/var/tmp/robotpkg/wip/prf-gazebo-ros-pkgs/work/gazebo_ros_pkgs-2.6.7/gazebo_plugins/src/gazebo_ros_block_laser.cpp:311:51: error: 'class gazebo::sensors::RaySensor' has no member named 'LaserShape' /local/robotpkg/var/tmp/robotpkg/wip/prf-gazebo-ros-pkgs/work/gazebo_ros_pkgs-2.6.7/gazebo_plugins/src/gazebo_ros_block_laser.cpp: In member function 'void gazebo::GazeboRosBlockLaser::OnStats(const boost::shared_ptr&)': /local/robotpkg/var/tmp/robotpkg/wip/prf-gazebo-ros-pkgs/work/gazebo_ros_pkgs-2.6.7/gazebo_plugins/src/gazebo_ros_block_laser.cpp:398:3: error: 'ignition' has not been declared /local/robotpkg/var/tmp/robotpkg/wip/prf-gazebo-ros-pkgs/work/gazebo_ros_pkgs-2.6.7/gazebo_plugins/src/gazebo_ros_block_laser.cpp:398:26: error: expected ';' before 'pose' /local/robotpkg/var/tmp/robotpkg/wip/prf-gazebo-ros-pkgs/work/gazebo_ros_pkgs-2.6.7/gazebo_plugins/src/gazebo_ros_block_laser.cpp:399:3: error: 'pose' was not declared in this scope make[2]: Leaving directory `/local/robotpkg/var/tmp/robotpkg/wip/prf-gazebo-ros-pkgs/work/gazebo_ros_pkgs-2.6.7/build' make[2]: *** [gazebo_plugins/CMakeFiles/MultiCameraPlugin.dir/src/MultiCameraPlugin.cpp.o] Error 1 make[1]: *** [gazebo_plugins/CMakeFiles/MultiCameraPlugin.dir/all] Error 2 make[2]: Leaving directory `/local/robotpkg/var/tmp/robotpkg/wip/prf-gazebo-ros-pkgs/work/gazebo_ros_pkgs-2.6.7/build' make[1]: Leaving directory `/local/robotpkg/var/tmp/robotpkg/wip/prf-gazebo-ros-pkgs/work/gazebo_ros_pkgs-2.6.7/build' make[2]: *** [gazebo_plugins/CMakeFiles/gazebo_ros_block_laser.dir/src/gazebo_ros_block_laser.cpp.o] Error 1 make[1]: *** [gazebo_plugins/CMakeFiles/gazebo_ros_block_laser.dir/all] Error 2 make: *** [all] Error 2