robotpkg/wip/osg-dae bulk build results

Log for osg-dae-3.2.1r4 on NetBSD-9.0-x86_64: build.log (Back)

--- Environment --- _override_vars_pkgtools_pkg_config=PKGREQD PKGREQD PKGREQD _overrides_devel_boost_headers_PKGREQD=boost-headers>=1.34.1 boost-headers>=1.34.1 boost-headers>=1.34.1 LC_MONETARY=C _overrides_pkgtools_pkg_install_PKGREQD=pkg_install>=20110805.9 pkg_install>=20110805.9 pkg_install>=20110805.9 CXX=/usr/bin/g++ PAX=/bin/pax MFLAGS=--no-print-directory OS_KERNEL_VERSION=9.0 MAKEFLAGS= --no-print-directory -- PKGREQD.cmdline=osg-dae-3.2.1r4~!doc RECURSIVE_PKGPATH=wip/osg-dae\ tag=NetBSD-9.0-x86_64 BULK_LOGDIR=/local/robotpkg/var/log/bulk BULKBASE=/opt/openrobots LOCALBASE=/opt/openrobots PKG_DBDIR=/opt/openrobots/var/db/robotpkg EXPECT_TARGETS=fetch\ install\ package MAKEOVERRIDES=PKGREQD.cmdline=osg-dae-3.2.1r4~!doc RECURSIVE_PKGPATH=wip/osg-dae\ tag=NetBSD-9.0-x86_64 BULK_LOGDIR=/local/robotpkg/var/log/bulk BULKBASE=/opt/openrobots LOCALBASE=/opt/openrobots PKG_DBDIR=/opt/openrobots/var/db/robotpkg EXPECT_TARGETS=fetch\ install\ package TAR=/usr/bin/tar GXX=/usr/bin/g++ BULK_LOGDIR=/local/robotpkg/var/log/bulk PWD=/local/robotpkg/var/lib/robotpkg/wip/osg-dae LANG=C GZIP_CMD=/usr/bin/gzip HOME=/ _override_vars_devel_boost_headers=PKGREQD PKGREQD PKGREQD CMAKE=/usr/pkg/bin/cmake PATH=/sbin:/bin:/usr/sbin:/usr/bin CXXCPP=/usr/bin/g++ -E LC_MESSAGES=C _overrides_archivers_pax_PKGREQD=pax pax _overrides_graphics_collada_dom_PKGREQD=collada-dom>=2.4 collada-dom>=2.4 collada-dom>=2.4 _override_vars_pkgtools_pkg_install=PKGREQD PKGREQD PKGREQD _override_vars_graphics_openscenegraph=PKGREQD PKGREQD PKGREQD MAKELEVEL=4 _override_vars_pkgtools_tnftp=PKGREQD PKGREQD LOWER_OS_VERSION=9.0 hline="$bf======================================================================$rm" ZCAT=/usr/bin/zcat MACHINE_PLATFORM=NetBSD-9.0-x86_64 _override_vars_pkgtools_digest=PKGREQD PKGREQD LC_NUMERIC=C DOXYGEN=/usr/pkg/bin/doxygen OLDPWD=/local/robotpkg/var/lib/robotpkg/wip/can-utils CC=/usr/bin/gcc FC=false _overrides_pkgtools_tnftp_PKGREQD=tnftp>=20130505~ssl tnftp>=20130505~ssl PKG_CONFIG=/usr/pkg/bin/pkg-config tag=NetBSD-9.0-x86_64 OS_KERNEL=NetBSD ROBOTPKG_TRUSTED_ENV=robotpkg LC_CTYPE=C _override_vars_devel_boost_libs=PKGREQD PKGREQD PKGREQD PKGREQD PKGREQD PKGREQD _ROBOTPKG_NOW=1127143847 LOWER_ARCH=x86_64 PATCH=/usr/bin/patch OWNER_GID=robots ROBOTPKG_BASE=/local/robotpkg _overrides_devel_boost_libs_PKGREQD=boost-libs>=1.34.1 boost-libs>=1.34.1 boost-libs>=1.34.1 boost-libs>=1.34.1 boost-libs>=1.34.1 boost-libs>=1.34.1 _override_vars_graphics_collada_dom=PKGREQD PKGREQD PKGREQD NODENAME=fluffy64-netbsd9 bf= DIGEST=/opt/openrobots/sbin/robotpkg_digest ECHO_N=echo -n _overrides_wip_osg_dae_PKGREQD=osg-dae-3.2.1r4~!doc OS_VERSION=9.0 EXPECT_TARGETS=fetch install package LC_COLLATE=C rm= _overrides_pkgtools_digest_PKGREQD=digest>=20080510 digest>=20080510 OWNER_UID=rbulk RECURSIVE_PKGPATH=wip/osg-dae _override_vars_wip_osg_dae=PKGREQD MACHINE_ARCH=x86_64 ROBOTPKG_DIR=/local/robotpkg/var/lib/robotpkg _override_vars_archivers_pax=PKGREQD PKGREQD LOWER_OPSYS=netbsd LC_TIME=C _overrides_graphics_openscenegraph_PKGREQD=openscenegraph>=3 openscenegraph>=3 openscenegraph>=3 TNFTP=/opt/openrobots/sbin/tnftp OPSYS=NetBSD LOCALBASE=/opt/openrobots LOWER_OS_KERNEL=netbsd PKGTOOLS_VERSION=20110805.9 BULKBASE=/opt/openrobots PKG_CONFIG_LIBDIR=/usr/lib/pkgconfig MACHINE_KERNEL=NetBSD-9.0-x86_64 _overrides_pkgtools_pkg_config_PKGREQD=pkg-config>=0.22 pkg-config>=0.22 pkg-config>=0.22 PKG_CONFIG_PATH=/opt/openrobots/lib/pkgconfig GCC=/usr/bin/gcc PKG_DBDIR=/opt/openrobots/var/db/robotpkg MAKECONF=/opt/robotpkg/etc/robotpkg-wip.conf CPP=/usr/bin/gcc -E --- Running set -e; \ cd /local/robotpkg/var/tmp/robotpkg/wip/osg-dae/work/osg-dae-3.2.1 && cd /local/robotpkg/var/tmp/robotpkg/wip/osg-dae/work/osg-dae-3.2.1 && /usr/bin/env MAKELEVEL= MAKEOVERRIDES= MAKEFLAGS= MFLAGS= 'CPPFLAGS=' 'CFLAGS=-pipe -O3 -DNDEBUG' 'LDFLAGS=' 'CXXFLAGS=-pipe -O3 -DNDEBUG' PREFIX='/opt/openrobots' HOME=/local/robotpkg/var/tmp/robotpkg/wip/osg-dae/work PATH='/opt/openrobots/bin:/opt/openrobots/sbin:/sbin:/bin:/usr/sbin:/usr/bin' LD_LIBRARY_PATH='' LOCALBASE=/opt/openrobots PKGMANDIR=man /usr/pkg/bin/gmake -j4 -f Makefile all; /usr/pkg/bin/cmake -S/local/robotpkg/var/tmp/robotpkg/wip/osg-dae/work/osg-dae-3.2.1 -B/local/robotpkg/var/tmp/robotpkg/wip/osg-dae/work/osg-dae-3.2.1 --check-build-system CMakeFiles/Makefile.cmake 0 /usr/pkg/bin/cmake -E cmake_progress_start /local/robotpkg/var/tmp/robotpkg/wip/osg-dae/work/osg-dae-3.2.1/CMakeFiles /local/robotpkg/var/tmp/robotpkg/wip/osg-dae/work/osg-dae-3.2.1/CMakeFiles/progress.marks /usr/pkg/bin/gmake -f CMakeFiles/Makefile2 all gmake[1]: Entering directory '/local/robotpkg/var/tmp/robotpkg/wip/osg-dae/work/osg-dae-3.2.1' /usr/pkg/bin/gmake -f src/osgPlugins/dae/CMakeFiles/osgdb_dae.dir/build.make src/osgPlugins/dae/CMakeFiles/osgdb_dae.dir/depend gmake[2]: Entering directory '/local/robotpkg/var/tmp/robotpkg/wip/osg-dae/work/osg-dae-3.2.1' cd /local/robotpkg/var/tmp/robotpkg/wip/osg-dae/work/osg-dae-3.2.1 && /usr/pkg/bin/cmake -E cmake_depends "Unix Makefiles" /local/robotpkg/var/tmp/robotpkg/wip/osg-dae/work/osg-dae-3.2.1 /local/robotpkg/var/tmp/robotpkg/wip/osg-dae/work/osg-dae-3.2.1/src/osgPlugins/dae /local/robotpkg/var/tmp/robotpkg/wip/osg-dae/work/osg-dae-3.2.1 /local/robotpkg/var/tmp/robotpkg/wip/osg-dae/work/osg-dae-3.2.1/src/osgPlugins/dae /local/robotpkg/var/tmp/robotpkg/wip/osg-dae/work/osg-dae-3.2.1/src/osgPlugins/dae/CMakeFiles/osgdb_dae.dir/DependInfo.cmake --color= Scanning dependencies of target osgdb_dae gmake[2]: Leaving directory '/local/robotpkg/var/tmp/robotpkg/wip/osg-dae/work/osg-dae-3.2.1' /usr/pkg/bin/gmake -f src/osgPlugins/dae/CMakeFiles/osgdb_dae.dir/build.make src/osgPlugins/dae/CMakeFiles/osgdb_dae.dir/build gmake[2]: Entering directory '/local/robotpkg/var/tmp/robotpkg/wip/osg-dae/work/osg-dae-3.2.1' [ 6%] Building CXX object src/osgPlugins/dae/CMakeFiles/osgdb_dae.dir/daeReader.o cd /local/robotpkg/var/tmp/robotpkg/wip/osg-dae/work/osg-dae-3.2.1/src/osgPlugins/dae && /usr/bin/g++ -DCOLLADA_DOM_SUPPORT141 -DNO_BOOST -Dosgdb_dae_EXPORTS -I/local/robotpkg/var/tmp/robotpkg/wip/osg-dae/work/osg-dae-3.2.1 -I/local/robotpkg/var/tmp/robotpkg/wip/osg-dae/work/osg-dae-3.2.1/include -I/opt/openrobots/include/collada-dom2.4 -I/opt/openrobots/include/collada-dom2.4/1.4 -isystem /opt/openrobots/include -pipe -O3 -DNDEBUG -pedantic -Wno-long-long -Wall -Wextra -Wcast-align -Wcast-qual -Wformat -Wwrite-strings -Wconversion -Wparentheses -Wno-import -Wreturn-type -Wmissing-braces -Wunknown-pragmas -Wunused -fPIC -I/opt/openrobots/include -o CMakeFiles/osgdb_dae.dir/daeReader.o -c /local/robotpkg/var/tmp/robotpkg/wip/osg-dae/work/osg-dae-3.2.1/src/osgPlugins/dae/daeReader.cpp [ 12%] Building CXX object src/osgPlugins/dae/CMakeFiles/osgdb_dae.dir/daeRGeometry.o cd /local/robotpkg/var/tmp/robotpkg/wip/osg-dae/work/osg-dae-3.2.1/src/osgPlugins/dae && /usr/bin/g++ -DCOLLADA_DOM_SUPPORT141 -DNO_BOOST -Dosgdb_dae_EXPORTS -I/local/robotpkg/var/tmp/robotpkg/wip/osg-dae/work/osg-dae-3.2.1 -I/local/robotpkg/var/tmp/robotpkg/wip/osg-dae/work/osg-dae-3.2.1/include -I/opt/openrobots/include/collada-dom2.4 -I/opt/openrobots/include/collada-dom2.4/1.4 -isystem /opt/openrobots/include -pipe -O3 -DNDEBUG -pedantic -Wno-long-long -Wall -Wextra -Wcast-align -Wcast-qual -Wformat -Wwrite-strings -Wconversion -Wparentheses -Wno-import -Wreturn-type -Wmissing-braces -Wunknown-pragmas -Wunused -fPIC -I/opt/openrobots/include -o CMakeFiles/osgdb_dae.dir/daeRGeometry.o -c /local/robotpkg/var/tmp/robotpkg/wip/osg-dae/work/osg-dae-3.2.1/src/osgPlugins/dae/daeRGeometry.cpp [ 18%] Building CXX object src/osgPlugins/dae/CMakeFiles/osgdb_dae.dir/daeRAnimations.o [ 25%] Building CXX object src/osgPlugins/dae/CMakeFiles/osgdb_dae.dir/daeRMaterials.o cd /local/robotpkg/var/tmp/robotpkg/wip/osg-dae/work/osg-dae-3.2.1/src/osgPlugins/dae && /usr/bin/g++ -DCOLLADA_DOM_SUPPORT141 -DNO_BOOST -Dosgdb_dae_EXPORTS -I/local/robotpkg/var/tmp/robotpkg/wip/osg-dae/work/osg-dae-3.2.1 -I/local/robotpkg/var/tmp/robotpkg/wip/osg-dae/work/osg-dae-3.2.1/include -I/opt/openrobots/include/collada-dom2.4 -I/opt/openrobots/include/collada-dom2.4/1.4 -isystem /opt/openrobots/include -pipe -O3 -DNDEBUG -pedantic -Wno-long-long -Wall -Wextra -Wcast-align -Wcast-qual -Wformat -Wwrite-strings -Wconversion -Wparentheses -Wno-import -Wreturn-type -Wmissing-braces -Wunknown-pragmas -Wunused -fPIC -I/opt/openrobots/include -o CMakeFiles/osgdb_dae.dir/daeRAnimations.o -c /local/robotpkg/var/tmp/robotpkg/wip/osg-dae/work/osg-dae-3.2.1/src/osgPlugins/dae/daeRAnimations.cpp cd /local/robotpkg/var/tmp/robotpkg/wip/osg-dae/work/osg-dae-3.2.1/src/osgPlugins/dae && /usr/bin/g++ -DCOLLADA_DOM_SUPPORT141 -DNO_BOOST -Dosgdb_dae_EXPORTS -I/local/robotpkg/var/tmp/robotpkg/wip/osg-dae/work/osg-dae-3.2.1 -I/local/robotpkg/var/tmp/robotpkg/wip/osg-dae/work/osg-dae-3.2.1/include -I/opt/openrobots/include/collada-dom2.4 -I/opt/openrobots/include/collada-dom2.4/1.4 -isystem /opt/openrobots/include -pipe -O3 -DNDEBUG -pedantic -Wno-long-long -Wall -Wextra -Wcast-align -Wcast-qual -Wformat -Wwrite-strings -Wconversion -Wparentheses -Wno-import -Wreturn-type -Wmissing-braces -Wunknown-pragmas -Wunused -fPIC -I/opt/openrobots/include -o CMakeFiles/osgdb_dae.dir/daeRMaterials.o -c /local/robotpkg/var/tmp/robotpkg/wip/osg-dae/work/osg-dae-3.2.1/src/osgPlugins/dae/daeRMaterials.cpp In file included from /opt/openrobots/include/osg/GLDefines:25:0, from /opt/openrobots/include/osg/GLExtensions:18, from /opt/openrobots/include/osg/Shader:25, from /opt/openrobots/include/osg/StateAttribute:20, from /opt/openrobots/include/osg/StateSet:18, from /opt/openrobots/include/osg/Node:19, from /local/robotpkg/var/tmp/robotpkg/wip/osg-dae/work/osg-dae-3.2.1/src/osgPlugins/dae/daeReader.h:26, from /local/robotpkg/var/tmp/robotpkg/wip/osg-dae/work/osg-dae-3.2.1/src/osgPlugins/dae/daeRAnimations.cpp:1: /opt/openrobots/include/osg/GL:114:10: fatal error: GL/gl.h: No such file or directory #include ^~~~~~~~~ compilation terminated. In file included from /opt/openrobots/include/osg/GLDefines:25:0, from /opt/openrobots/include/osg/GLExtensions:18, from /opt/openrobots/include/osg/Shader:25, from /opt/openrobots/include/osg/StateAttribute:20, from /opt/openrobots/include/osg/StateSet:18, from /opt/openrobots/include/osg/Node:19, from /local/robotpkg/var/tmp/robotpkg/wip/osg-dae/work/osg-dae-3.2.1/src/osgPlugins/dae/daeReader.h:26, from /local/robotpkg/var/tmp/robotpkg/wip/osg-dae/work/osg-dae-3.2.1/src/osgPlugins/dae/daeReader.cpp:14: /opt/openrobots/include/osg/GL:114:10: fatal error: GL/gl.h: No such file or directory #include ^~~~~~~~~ compilation terminated. In file included from /opt/openrobots/include/osg/GLDefines:25:0, from /opt/openrobots/include/osg/GLExtensions:18, from /opt/openrobots/include/osg/Shader:25, from /opt/openrobots/include/osg/StateAttribute:20, from /opt/openrobots/include/osg/StateSet:18, from /opt/openrobots/include/osg/Node:19, from /local/robotpkg/var/tmp/robotpkg/wip/osg-dae/work/osg-dae-3.2.1/src/osgPlugins/dae/daeReader.h:26, from /local/robotpkg/var/tmp/robotpkg/wip/osg-dae/work/osg-dae-3.2.1/src/osgPlugins/dae/daeRMaterials.cpp:14: /opt/openrobots/include/osg/GL:114:10: fatal error: GL/gl.h: No such file or directory #include ^~~~~~~~~ compilation terminated. gmake[2]: *** [src/osgPlugins/dae/CMakeFiles/osgdb_dae.dir/build.make:79: src/osgPlugins/dae/CMakeFiles/osgdb_dae.dir/daeRAnimations.o] Error 1 gmake[2]: *** Waiting for unfinished jobs.... gmake[2]: *** [src/osgPlugins/dae/CMakeFiles/osgdb_dae.dir/build.make:66: src/osgPlugins/dae/CMakeFiles/osgdb_dae.dir/daeReader.o] Error 1 gmake[2]: *** [src/osgPlugins/dae/CMakeFiles/osgdb_dae.dir/build.make:105: src/osgPlugins/dae/CMakeFiles/osgdb_dae.dir/daeRMaterials.o] Error 1 In file included from /opt/openrobots/include/osg/GLDefines:25:0, from /opt/openrobots/include/osg/GLExtensions:18, from /opt/openrobots/include/osg/Shader:25, from /opt/openrobots/include/osg/StateAttribute:20, from /opt/openrobots/include/osg/StateSet:18, from /opt/openrobots/include/osg/Node:19, from /local/robotpkg/var/tmp/robotpkg/wip/osg-dae/work/osg-dae-3.2.1/src/osgPlugins/dae/daeReader.h:26, from /local/robotpkg/var/tmp/robotpkg/wip/osg-dae/work/osg-dae-3.2.1/src/osgPlugins/dae/daeRGeometry.cpp:14: /opt/openrobots/include/osg/GL:114:10: fatal error: GL/gl.h: No such file or directory #include ^~~~~~~~~ compilation terminated. gmake[2]: Leaving directory '/local/robotpkg/var/tmp/robotpkg/wip/osg-dae/work/osg-dae-3.2.1' gmake[2]: *** [src/osgPlugins/dae/CMakeFiles/osgdb_dae.dir/build.make:92: src/osgPlugins/dae/CMakeFiles/osgdb_dae.dir/daeRGeometry.o] Error 1 gmake[1]: Leaving directory '/local/robotpkg/var/tmp/robotpkg/wip/osg-dae/work/osg-dae-3.2.1' gmake[1]: *** [CMakeFiles/Makefile2:497: src/osgPlugins/dae/CMakeFiles/osgdb_dae.dir/all] Error 2 gmake: *** [Makefile:144: all] Error 2