robotpkg/wip/orocos-yarp_transport bulk build results

Log for orocos-yarp_transport-20150316~doc on Debian-8-x86_64: build.log (Back)

--- Environment --- LOWER_ARCH=x86_64 OPSYS=Debian GZIP_CMD=/bin/gzip _override_vars_pkgtools_pkg_install=PKGREQD PKGREQD PKGREQD LC_TIME=C OS_KERNEL_VERSION=3.16.0-8-amd64 BULKBASE=/opt/openrobots ECHO_N=echo -n _overrides_pkgtools_pkg_install_PKGREQD=pkg_install>=20110805.9 pkg_install>=20110805.9 pkg_install>=20110805.9 OS_VERSION=8 ROBOTPKG_BASE=/local/robotpkg OLDPWD=/local/robotpkg/var/lib/robotpkg/wip/ur5-description _override_vars_pkgtools_tnftp=PKGREQD PKGREQD PKG_DBDIR=/opt/openrobots/var/db/robotpkg hline="$bf======================================================================$rm" MACHINE_ARCH=x86_64 _overrides_pkgtools_tnftp_PKGREQD=tnftp>=20091122 tnftp>=20091122 FC=false LC_CTYPE=C EXPECT_TARGETS=fetch install package LC_MONETARY=C MAKEFLAGS= --no-print-directory -- PKGREQD.cmdline=orocos-yarp_transport-20150316 RECURSIVE_PKGPATH=wip/orocos-yarp_transport\ tag=Debian-8-x86_64 BULK_LOGDIR=/local/robotpkg/var/log/bulk BULKBASE=/opt/openrobots LOCALBASE=/opt/openrobots PKG_DBDIR=/opt/openrobots/var/db/robotpkg EXPECT_TARGETS=fetch\ install\ package _override_vars_pkgtools_digest=PKGREQD PKGREQD CPP=/usr/bin/gcc -E LOWER_OPSYS=debian bf= _overrides_pkgtools_digest_PKGREQD=digest>=20080510 digest>=20080510 GCC=/usr/bin/gcc DIGEST=/opt/openrobots/sbin/robotpkg_digest TAR=/bin/tar LOWER_OS_VERSION=8 MACHINE_KERNEL=Linux-3.16.0-8-amd64-x86_64 OWNER_GID=robots PKGTOOLS_VERSION=20110805.9 RECURSIVE_PKGPATH=wip/orocos-yarp_transport GXX=/usr/bin/g++ MAKECONF=/opt/robotpkg/etc/robotpkg-wip.conf _override_vars_archivers_pax=PKGREQD PKGREQD rm= LC_COLLATE=C OS_KERNEL=Linux ROBOTPKG_TRUSTED_ENV=robotpkg PATH=/usr/local/sbin:/usr/local/bin:/usr/sbin:/usr/bin:/sbin:/bin _overrides_archivers_pax_PKGREQD=pax pax CMAKE=/usr/bin/cmake CXXCPP=/usr/bin/g++ -E _override_vars_middleware_orocos_rtt=PKGREQD PKGREQD PKGREQD MAKELEVEL=4 DEB_HOST_MULTIARCH=x86_64-linux-gnu MACHINE_PLATFORM=Debian-8-x86_64 _overrides_middleware_orocos_rtt_PKGREQD=orocos-rtt>=2.5 orocos-rtt>=2.5 orocos-rtt>=2.5 ROBOTPKG_DIR=/local/robotpkg/var/lib/robotpkg TNFTP=/opt/openrobots/sbin/tnftp LANG=C MAKEOVERRIDES=PKGREQD.cmdline=orocos-yarp_transport-20150316 RECURSIVE_PKGPATH=wip/orocos-yarp_transport\ tag=Debian-8-x86_64 BULK_LOGDIR=/local/robotpkg/var/log/bulk BULKBASE=/opt/openrobots LOCALBASE=/opt/openrobots PKG_DBDIR=/opt/openrobots/var/db/robotpkg EXPECT_TARGETS=fetch\ install\ package LC_MESSAGES=C _override_vars_middleware_yarp=PKGREQD PKGREQD PKGREQD tag=Debian-8-x86_64 CXX=/usr/bin/g++ _overrides_middleware_yarp_PKGREQD=yarp>=2.2 yarp>=2.2 yarp>=2.2 LOCALBASE=/opt/openrobots OWNER_UID=rbulk BULK_LOGDIR=/local/robotpkg/var/log/bulk ZCAT=/bin/zcat PAX=/bin/pax LOWER_OS_KERNEL=linux _override_vars_wip_orocos_yarp_transport=PKGREQD PWD=/local/robotpkg/var/lib/robotpkg/wip/orocos-yarp_transport _overrides_wip_orocos_yarp_transport_PKGREQD=orocos-yarp_transport-20150316 _ROBOTPKG_NOW=0413014825 _override_vars_middleware_ace=PKGREQD PKGREQD PKGREQD LC_NUMERIC=C CC=/usr/bin/gcc MFLAGS=--no-print-directory _overrides_middleware_ace_PKGREQD=ace>=5.6 ace>=5.6 ace>=5.6 NODENAME=fluffy64-debian8 GIT=/usr/bin/git --- Running set -e; \ cd /local/robotpkg/var/tmp/robotpkg/wip/orocos-yarp_transport/work/orocos-yarp_transport-20150316 && cd /local/robotpkg/var/tmp/robotpkg/wip/orocos-yarp_transport/work/orocos-yarp_transport-20150316 && /usr/bin/env MAKELEVEL= MAKEOVERRIDES= MAKEFLAGS= MFLAGS= 'CPPFLAGS=' 'CFLAGS=-pipe -O3 -DNDEBUG' 'LDFLAGS=' 'CXXFLAGS=-pipe -O3 -DNDEBUG' PREFIX='/opt/openrobots' HOME=/local/robotpkg/var/tmp/robotpkg/wip/orocos-yarp_transport/work PATH='/opt/openrobots/bin:/opt/openrobots/sbin:/usr/local/sbin:/usr/local/bin:/usr/sbin:/usr/bin:/sbin:/bin' LD_LIBRARY_PATH='' LOCALBASE=/opt/openrobots PKGMANDIR=man make -j4 -f Makefile all; /usr/bin/cmake -H/local/robotpkg/var/tmp/robotpkg/wip/orocos-yarp_transport/work/orocos-yarp_transport-20150316 -B/local/robotpkg/var/tmp/robotpkg/wip/orocos-yarp_transport/work/orocos-yarp_transport-20150316 --check-build-system CMakeFiles/Makefile.cmake 0 /usr/bin/cmake -E cmake_progress_start /local/robotpkg/var/tmp/robotpkg/wip/orocos-yarp_transport/work/orocos-yarp_transport-20150316/CMakeFiles /local/robotpkg/var/tmp/robotpkg/wip/orocos-yarp_transport/work/orocos-yarp_transport-20150316/CMakeFiles/progress.marks make -f CMakeFiles/Makefile2 all make[1]: Entering directory '/local/robotpkg/var/tmp/robotpkg/wip/orocos-yarp_transport/work/orocos-yarp_transport-20150316' make -f CMakeFiles/doc.dir/build.make CMakeFiles/doc.dir/depend make -f CMakeFiles/yarp-service.dir/build.make CMakeFiles/yarp-service.dir/depend make -f CMakeFiles/yarp-transport.dir/build.make CMakeFiles/yarp-transport.dir/depend make[2]: Entering directory '/local/robotpkg/var/tmp/robotpkg/wip/orocos-yarp_transport/work/orocos-yarp_transport-20150316' cd /local/robotpkg/var/tmp/robotpkg/wip/orocos-yarp_transport/work/orocos-yarp_transport-20150316 && /usr/bin/cmake -E cmake_depends "Unix Makefiles" /local/robotpkg/var/tmp/robotpkg/wip/orocos-yarp_transport/work/orocos-yarp_transport-20150316 /local/robotpkg/var/tmp/robotpkg/wip/orocos-yarp_transport/work/orocos-yarp_transport-20150316 /local/robotpkg/var/tmp/robotpkg/wip/orocos-yarp_transport/work/orocos-yarp_transport-20150316 /local/robotpkg/var/tmp/robotpkg/wip/orocos-yarp_transport/work/orocos-yarp_transport-20150316 /local/robotpkg/var/tmp/robotpkg/wip/orocos-yarp_transport/work/orocos-yarp_transport-20150316/CMakeFiles/yarp-transport.dir/DependInfo.cmake --color= make[2]: Entering directory '/local/robotpkg/var/tmp/robotpkg/wip/orocos-yarp_transport/work/orocos-yarp_transport-20150316' cd /local/robotpkg/var/tmp/robotpkg/wip/orocos-yarp_transport/work/orocos-yarp_transport-20150316 && /usr/bin/cmake -E cmake_depends "Unix Makefiles" /local/robotpkg/var/tmp/robotpkg/wip/orocos-yarp_transport/work/orocos-yarp_transport-20150316 /local/robotpkg/var/tmp/robotpkg/wip/orocos-yarp_transport/work/orocos-yarp_transport-20150316 /local/robotpkg/var/tmp/robotpkg/wip/orocos-yarp_transport/work/orocos-yarp_transport-20150316 /local/robotpkg/var/tmp/robotpkg/wip/orocos-yarp_transport/work/orocos-yarp_transport-20150316 /local/robotpkg/var/tmp/robotpkg/wip/orocos-yarp_transport/work/orocos-yarp_transport-20150316/CMakeFiles/yarp-service.dir/DependInfo.cmake --color= make[2]: Entering directory '/local/robotpkg/var/tmp/robotpkg/wip/orocos-yarp_transport/work/orocos-yarp_transport-20150316' cd /local/robotpkg/var/tmp/robotpkg/wip/orocos-yarp_transport/work/orocos-yarp_transport-20150316 && /usr/bin/cmake -E cmake_depends "Unix Makefiles" /local/robotpkg/var/tmp/robotpkg/wip/orocos-yarp_transport/work/orocos-yarp_transport-20150316 /local/robotpkg/var/tmp/robotpkg/wip/orocos-yarp_transport/work/orocos-yarp_transport-20150316 /local/robotpkg/var/tmp/robotpkg/wip/orocos-yarp_transport/work/orocos-yarp_transport-20150316 /local/robotpkg/var/tmp/robotpkg/wip/orocos-yarp_transport/work/orocos-yarp_transport-20150316 /local/robotpkg/var/tmp/robotpkg/wip/orocos-yarp_transport/work/orocos-yarp_transport-20150316/CMakeFiles/doc.dir/DependInfo.cmake --color= Scanning dependencies of target doc make[2]: Leaving directory '/local/robotpkg/var/tmp/robotpkg/wip/orocos-yarp_transport/work/orocos-yarp_transport-20150316' make -f CMakeFiles/doc.dir/build.make CMakeFiles/doc.dir/build make[2]: Entering directory '/local/robotpkg/var/tmp/robotpkg/wip/orocos-yarp_transport/work/orocos-yarp_transport-20150316' /usr/bin/docbook2pdf /local/robotpkg/var/tmp/robotpkg/wip/orocos-yarp_transport/work/orocos-yarp_transport-20150316/doc/yarp-transport-doc.xml Scanning dependencies of target yarp-transport make[2]: Leaving directory '/local/robotpkg/var/tmp/robotpkg/wip/orocos-yarp_transport/work/orocos-yarp_transport-20150316' make -f CMakeFiles/yarp-transport.dir/build.make CMakeFiles/yarp-transport.dir/build Scanning dependencies of target yarp-service make[2]: Leaving directory '/local/robotpkg/var/tmp/robotpkg/wip/orocos-yarp_transport/work/orocos-yarp_transport-20150316' make -f CMakeFiles/yarp-service.dir/build.make CMakeFiles/yarp-service.dir/build make[2]: Entering directory '/local/robotpkg/var/tmp/robotpkg/wip/orocos-yarp_transport/work/orocos-yarp_transport-20150316' /usr/bin/cmake -E cmake_progress_report /local/robotpkg/var/tmp/robotpkg/wip/orocos-yarp_transport/work/orocos-yarp_transport-20150316/CMakeFiles 1 make[2]: Entering directory '/local/robotpkg/var/tmp/robotpkg/wip/orocos-yarp_transport/work/orocos-yarp_transport-20150316' /usr/bin/cmake -E cmake_progress_report /local/robotpkg/var/tmp/robotpkg/wip/orocos-yarp_transport/work/orocos-yarp_transport-20150316/CMakeFiles 2 [ 50%] [100%] Building CXX object CMakeFiles/yarp-service.dir/service/Yarp-service.cpp.o /usr/bin/g++ -DOROCOS_TARGET=gnulinux -DYARP_NO_DEPRECATED_WARNINGS -Dyarp_service_EXPORTS -pipe -O3 -DNDEBUG -fPIC -I/opt/openrobots/include -I/local/robotpkg/var/tmp/robotpkg/wip/orocos-yarp_transport/work/orocos-yarp_transport-20150316/transport -I/opt/openrobots/include/orocos -o CMakeFiles/yarp-service.dir/service/Yarp-service.cpp.o -c /local/robotpkg/var/tmp/robotpkg/wip/orocos-yarp_transport/work/orocos-yarp_transport-20150316/service/Yarp-service.cpp Building CXX object CMakeFiles/yarp-transport.dir/transport/YarpTransport.cpp.o /usr/bin/g++ -DOROCOS_TARGET=gnulinux -DYARP_NO_DEPRECATED_WARNINGS -Dyarp_transport_EXPORTS -pipe -O3 -DNDEBUG -fPIC -I/opt/openrobots/include -I/local/robotpkg/var/tmp/robotpkg/wip/orocos-yarp_transport/work/orocos-yarp_transport-20150316/transport -I/opt/openrobots/include/orocos -o CMakeFiles/yarp-transport.dir/transport/YarpTransport.cpp.o -c /local/robotpkg/var/tmp/robotpkg/wip/orocos-yarp_transport/work/orocos-yarp_transport-20150316/transport/YarpTransport.cpp Using catalogs: /etc/sgml/catalog Using stylesheet: /usr/share/docbook-utils/docbook-utils.dsl#print Working on: /local/robotpkg/var/tmp/robotpkg/wip/orocos-yarp_transport/work/orocos-yarp_transport-20150316/doc/yarp-transport-doc.xml Done. make[2]: Leaving directory '/local/robotpkg/var/tmp/robotpkg/wip/orocos-yarp_transport/work/orocos-yarp_transport-20150316' /usr/bin/cmake -E cmake_progress_report /local/robotpkg/var/tmp/robotpkg/wip/orocos-yarp_transport/work/orocos-yarp_transport-20150316/CMakeFiles [100%] Built target doc In file included from /local/robotpkg/var/tmp/robotpkg/wip/orocos-yarp_transport/work/orocos-yarp_transport-20150316/transport/YarpTransport.cpp:25:0: /local/robotpkg/var/tmp/robotpkg/wip/orocos-yarp_transport/work/orocos-yarp_transport-20150316/transport/YarpChannelElement.hpp: In instantiation of 'class YarpChannelElement': /local/robotpkg/var/tmp/robotpkg/wip/orocos-yarp_transport/work/orocos-yarp_transport-20150316/transport/YarpTemplateProtocol.hpp:33:102: required from 'RTT::base::ChannelElementBase::shared_ptr YarpTemplateProtocol::createStream(RTT::base::PortInterface*, const RTT::ConnPolicy&, bool) const [with T = unsigned int; RTT::base::ChannelElementBase::shared_ptr = boost::intrusive_ptr]' /local/robotpkg/var/tmp/robotpkg/wip/orocos-yarp_transport/work/orocos-yarp_transport-20150316/transport/YarpTransport.cpp:72:1: required from here /local/robotpkg/var/tmp/robotpkg/wip/orocos-yarp_transport/work/orocos-yarp_transport-20150316/transport/YarpChannelElement.hpp:121:7: error: conflicting return type specified for 'bool YarpChannelElement::write(typename RTT::base::ChannelElement::param_t) [with T = unsigned int; typename RTT::base::ChannelElement::param_t = const unsigned int]' bool write(typename RTT::base::ChannelElement::param_t sample) { ^ In file included from /opt/openrobots/include/rtt/types/../internal/SharedConnection.hpp:42:0, from /opt/openrobots/include/rtt/types/TypeInfo.hpp:45, from /opt/openrobots/include/rtt/types/Types.hpp:41, from /opt/openrobots/include/rtt/types/TransportPlugin.hpp:38, from /local/robotpkg/var/tmp/robotpkg/wip/orocos-yarp_transport/work/orocos-yarp_transport-20150316/transport/YarpTransport.cpp:21: /opt/openrobots/include/rtt/types/../internal/../base/ChannelElement.hpp:105:29: error: overriding 'RTT::WriteStatus RTT::base::ChannelElement::write(RTT::base::ChannelElement::param_t) [with T = unsigned int; RTT::base::ChannelElement::param_t = const unsigned int]' virtual WriteStatus write(param_t sample) ^ In file included from /local/robotpkg/var/tmp/robotpkg/wip/orocos-yarp_transport/work/orocos-yarp_transport-20150316/transport/YarpTransport.cpp:26:0: /local/robotpkg/var/tmp/robotpkg/wip/orocos-yarp_transport/work/orocos-yarp_transport-20150316/transport/YarpTemplateProtocol.hpp: In instantiation of 'RTT::base::ChannelElementBase::shared_ptr YarpTemplateProtocol::createStream(RTT::base::PortInterface*, const RTT::ConnPolicy&, bool) const [with T = unsigned int; RTT::base::ChannelElementBase::shared_ptr = boost::intrusive_ptr]': /local/robotpkg/var/tmp/robotpkg/wip/orocos-yarp_transport/work/orocos-yarp_transport-20150316/transport/YarpTransport.cpp:72:1: required from here /local/robotpkg/var/tmp/robotpkg/wip/orocos-yarp_transport/work/orocos-yarp_transport-20150316/transport/YarpTemplateProtocol.hpp:38:24: warning: 'void RTT::base::ChannelElementBase::setOutput(const shared_ptr&)' is deprecated (declared at /opt/openrobots/include/rtt/types/../base/ChannelElementBase.hpp:256) [-Wdeprecated-declarations] yarp->setOutput(buf); ^ In file included from /local/robotpkg/var/tmp/robotpkg/wip/orocos-yarp_transport/work/orocos-yarp_transport-20150316/transport/YarpTransport.cpp:25:0: /local/robotpkg/var/tmp/robotpkg/wip/orocos-yarp_transport/work/orocos-yarp_transport-20150316/transport/YarpChannelElement.hpp: In instantiation of 'class YarpChannelElement > >': /local/robotpkg/var/tmp/robotpkg/wip/orocos-yarp_transport/work/orocos-yarp_transport-20150316/transport/YarpTemplateProtocol.hpp:33:102: required from 'RTT::base::ChannelElementBase::shared_ptr YarpTemplateProtocol::createStream(RTT::base::PortInterface*, const RTT::ConnPolicy&, bool) const [with T = std::vector >; RTT::base::ChannelElementBase::shared_ptr = boost::intrusive_ptr]' /local/robotpkg/var/tmp/robotpkg/wip/orocos-yarp_transport/work/orocos-yarp_transport-20150316/transport/YarpTransport.cpp:72:1: required from here /local/robotpkg/var/tmp/robotpkg/wip/orocos-yarp_transport/work/orocos-yarp_transport-20150316/transport/YarpChannelElement.hpp:121:7: error: conflicting return type specified for 'bool YarpChannelElement::write(typename RTT::base::ChannelElement::param_t) [with T = std::vector >; typename RTT::base::ChannelElement::param_t = const std::vector >&]' bool write(typename RTT::base::ChannelElement::param_t sample) { ^ In file included from /opt/openrobots/include/rtt/types/../internal/SharedConnection.hpp:42:0, from /opt/openrobots/include/rtt/types/TypeInfo.hpp:45, from /opt/openrobots/include/rtt/types/Types.hpp:41, from /opt/openrobots/include/rtt/types/TransportPlugin.hpp:38, from /local/robotpkg/var/tmp/robotpkg/wip/orocos-yarp_transport/work/orocos-yarp_transport-20150316/transport/YarpTransport.cpp:21: /opt/openrobots/include/rtt/types/../internal/../base/ChannelElement.hpp:105:29: error: overriding 'RTT::WriteStatus RTT::base::ChannelElement::write(RTT::base::ChannelElement::param_t) [with T = std::vector >; RTT::base::ChannelElement::param_t = const std::vector >&]' virtual WriteStatus write(param_t sample) ^ In file included from /local/robotpkg/var/tmp/robotpkg/wip/orocos-yarp_transport/work/orocos-yarp_transport-20150316/transport/YarpTransport.cpp:26:0: /local/robotpkg/var/tmp/robotpkg/wip/orocos-yarp_transport/work/orocos-yarp_transport-20150316/transport/YarpTemplateProtocol.hpp: In instantiation of 'RTT::base::ChannelElementBase::shared_ptr YarpTemplateProtocol::createStream(RTT::base::PortInterface*, const RTT::ConnPolicy&, bool) const [with T = std::vector >; RTT::base::ChannelElementBase::shared_ptr = boost::intrusive_ptr]': /local/robotpkg/var/tmp/robotpkg/wip/orocos-yarp_transport/work/orocos-yarp_transport-20150316/transport/YarpTransport.cpp:72:1: required from here /local/robotpkg/var/tmp/robotpkg/wip/orocos-yarp_transport/work/orocos-yarp_transport-20150316/transport/YarpTemplateProtocol.hpp:38:24: warning: 'void RTT::base::ChannelElementBase::setOutput(const shared_ptr&)' is deprecated (declared at /opt/openrobots/include/rtt/types/../base/ChannelElementBase.hpp:256) [-Wdeprecated-declarations] yarp->setOutput(buf); ^ In file included from /local/robotpkg/var/tmp/robotpkg/wip/orocos-yarp_transport/work/orocos-yarp_transport-20150316/transport/YarpTransport.cpp:25:0: /local/robotpkg/var/tmp/robotpkg/wip/orocos-yarp_transport/work/orocos-yarp_transport-20150316/transport/YarpChannelElement.hpp: In instantiation of 'class YarpChannelElement >': /local/robotpkg/var/tmp/robotpkg/wip/orocos-yarp_transport/work/orocos-yarp_transport-20150316/transport/YarpTemplateProtocol.hpp:33:102: required from 'RTT::base::ChannelElementBase::shared_ptr YarpTemplateProtocol::createStream(RTT::base::PortInterface*, const RTT::ConnPolicy&, bool) const [with T = std::basic_string; RTT::base::ChannelElementBase::shared_ptr = boost::intrusive_ptr]' /local/robotpkg/var/tmp/robotpkg/wip/orocos-yarp_transport/work/orocos-yarp_transport-20150316/transport/YarpTransport.cpp:72:1: required from here /local/robotpkg/var/tmp/robotpkg/wip/orocos-yarp_transport/work/orocos-yarp_transport-20150316/transport/YarpChannelElement.hpp:121:7: error: conflicting return type specified for 'bool YarpChannelElement::write(typename RTT::base::ChannelElement::param_t) [with T = std::basic_string; typename RTT::base::ChannelElement::param_t = const std::basic_string&]' bool write(typename RTT::base::ChannelElement::param_t sample) { ^ In file included from /opt/openrobots/include/rtt/types/../internal/SharedConnection.hpp:42:0, from /opt/openrobots/include/rtt/types/TypeInfo.hpp:45, from /opt/openrobots/include/rtt/types/Types.hpp:41, from /opt/openrobots/include/rtt/types/TransportPlugin.hpp:38, from /local/robotpkg/var/tmp/robotpkg/wip/orocos-yarp_transport/work/orocos-yarp_transport-20150316/transport/YarpTransport.cpp:21: /opt/openrobots/include/rtt/types/../internal/../base/ChannelElement.hpp:105:29: error: overriding 'RTT::WriteStatus RTT::base::ChannelElement::write(RTT::base::ChannelElement::param_t) [with T = std::basic_string; RTT::base::ChannelElement::param_t = const std::basic_string&]' virtual WriteStatus write(param_t sample) ^ In file included from /local/robotpkg/var/tmp/robotpkg/wip/orocos-yarp_transport/work/orocos-yarp_transport-20150316/transport/YarpTransport.cpp:26:0: /local/robotpkg/var/tmp/robotpkg/wip/orocos-yarp_transport/work/orocos-yarp_transport-20150316/transport/YarpTemplateProtocol.hpp: In instantiation of 'RTT::base::ChannelElementBase::shared_ptr YarpTemplateProtocol::createStream(RTT::base::PortInterface*, const RTT::ConnPolicy&, bool) const [with T = std::basic_string; RTT::base::ChannelElementBase::shared_ptr = boost::intrusive_ptr]': /local/robotpkg/var/tmp/robotpkg/wip/orocos-yarp_transport/work/orocos-yarp_transport-20150316/transport/YarpTransport.cpp:72:1: required from here /local/robotpkg/var/tmp/robotpkg/wip/orocos-yarp_transport/work/orocos-yarp_transport-20150316/transport/YarpTemplateProtocol.hpp:38:24: warning: 'void RTT::base::ChannelElementBase::setOutput(const shared_ptr&)' is deprecated (declared at /opt/openrobots/include/rtt/types/../base/ChannelElementBase.hpp:256) [-Wdeprecated-declarations] yarp->setOutput(buf); ^ In file included from /local/robotpkg/var/tmp/robotpkg/wip/orocos-yarp_transport/work/orocos-yarp_transport-20150316/transport/YarpTransport.cpp:25:0: /local/robotpkg/var/tmp/robotpkg/wip/orocos-yarp_transport/work/orocos-yarp_transport-20150316/transport/YarpChannelElement.hpp: In instantiation of 'class YarpChannelElement >': /local/robotpkg/var/tmp/robotpkg/wip/orocos-yarp_transport/work/orocos-yarp_transport-20150316/transport/YarpTemplateProtocol.hpp:33:102: required from 'RTT::base::ChannelElementBase::shared_ptr YarpTemplateProtocol::createStream(RTT::base::PortInterface*, const RTT::ConnPolicy&, bool) const [with T = std::vector; RTT::base::ChannelElementBase::shared_ptr = boost::intrusive_ptr]' /local/robotpkg/var/tmp/robotpkg/wip/orocos-yarp_transport/work/orocos-yarp_transport-20150316/transport/YarpTransport.cpp:72:1: required from here /local/robotpkg/var/tmp/robotpkg/wip/orocos-yarp_transport/work/orocos-yarp_transport-20150316/transport/YarpChannelElement.hpp:121:7: error: conflicting return type specified for 'bool YarpChannelElement::write(typename RTT::base::ChannelElement::param_t) [with T = std::vector; typename RTT::base::ChannelElement::param_t = const std::vector&]' bool write(typename RTT::base::ChannelElement::param_t sample) { ^ In file included from /opt/openrobots/include/rtt/types/../internal/SharedConnection.hpp:42:0, from /opt/openrobots/include/rtt/types/TypeInfo.hpp:45, from /opt/openrobots/include/rtt/types/Types.hpp:41, from /opt/openrobots/include/rtt/types/TransportPlugin.hpp:38, from /local/robotpkg/var/tmp/robotpkg/wip/orocos-yarp_transport/work/orocos-yarp_transport-20150316/transport/YarpTransport.cpp:21: /opt/openrobots/include/rtt/types/../internal/../base/ChannelElement.hpp:105:29: error: overriding 'RTT::WriteStatus RTT::base::ChannelElement::write(RTT::base::ChannelElement::param_t) [with T = std::vector; RTT::base::ChannelElement::param_t = const std::vector&]' virtual WriteStatus write(param_t sample) ^ In file included from /local/robotpkg/var/tmp/robotpkg/wip/orocos-yarp_transport/work/orocos-yarp_transport-20150316/transport/YarpTransport.cpp:26:0: /local/robotpkg/var/tmp/robotpkg/wip/orocos-yarp_transport/work/orocos-yarp_transport-20150316/transport/YarpTemplateProtocol.hpp: In instantiation of 'RTT::base::ChannelElementBase::shared_ptr YarpTemplateProtocol::createStream(RTT::base::PortInterface*, const RTT::ConnPolicy&, bool) const [with T = std::vector; RTT::base::ChannelElementBase::shared_ptr = boost::intrusive_ptr]': /local/robotpkg/var/tmp/robotpkg/wip/orocos-yarp_transport/work/orocos-yarp_transport-20150316/transport/YarpTransport.cpp:72:1: required from here /local/robotpkg/var/tmp/robotpkg/wip/orocos-yarp_transport/work/orocos-yarp_transport-20150316/transport/YarpTemplateProtocol.hpp:38:24: warning: 'void RTT::base::ChannelElementBase::setOutput(const shared_ptr&)' is deprecated (declared at /opt/openrobots/include/rtt/types/../base/ChannelElementBase.hpp:256) [-Wdeprecated-declarations] yarp->setOutput(buf); ^ In file included from /local/robotpkg/var/tmp/robotpkg/wip/orocos-yarp_transport/work/orocos-yarp_transport-20150316/transport/YarpTransport.cpp:25:0: /local/robotpkg/var/tmp/robotpkg/wip/orocos-yarp_transport/work/orocos-yarp_transport-20150316/transport/YarpChannelElement.hpp: In instantiation of 'class YarpChannelElement': /local/robotpkg/var/tmp/robotpkg/wip/orocos-yarp_transport/work/orocos-yarp_transport-20150316/transport/YarpTemplateProtocol.hpp:33:102: required from 'RTT::base::ChannelElementBase::shared_ptr YarpTemplateProtocol::createStream(RTT::base::PortInterface*, const RTT::ConnPolicy&, bool) const [with T = int; RTT::base::ChannelElementBase::shared_ptr = boost::intrusive_ptr]' /local/robotpkg/var/tmp/robotpkg/wip/orocos-yarp_transport/work/orocos-yarp_transport-20150316/transport/YarpTransport.cpp:72:1: required from here /local/robotpkg/var/tmp/robotpkg/wip/orocos-yarp_transport/work/orocos-yarp_transport-20150316/transport/YarpChannelElement.hpp:121:7: error: conflicting return type specified for 'bool YarpChannelElement::write(typename RTT::base::ChannelElement::param_t) [with T = int; typename RTT::base::ChannelElement::param_t = const int]' bool write(typename RTT::base::ChannelElement::param_t sample) { ^ In file included from /opt/openrobots/include/rtt/types/../internal/SharedConnection.hpp:42:0, from /opt/openrobots/include/rtt/types/TypeInfo.hpp:45, from /opt/openrobots/include/rtt/types/Types.hpp:41, from /opt/openrobots/include/rtt/types/TransportPlugin.hpp:38, from /local/robotpkg/var/tmp/robotpkg/wip/orocos-yarp_transport/work/orocos-yarp_transport-20150316/transport/YarpTransport.cpp:21: /opt/openrobots/include/rtt/types/../internal/../base/ChannelElement.hpp:105:29: error: overriding 'RTT::WriteStatus RTT::base::ChannelElement::write(RTT::base::ChannelElement::param_t) [with T = int; RTT::base::ChannelElement::param_t = const int]' virtual WriteStatus write(param_t sample) ^ In file included from /local/robotpkg/var/tmp/robotpkg/wip/orocos-yarp_transport/work/orocos-yarp_transport-20150316/transport/YarpTransport.cpp:26:0: /local/robotpkg/var/tmp/robotpkg/wip/orocos-yarp_transport/work/orocos-yarp_transport-20150316/transport/YarpTemplateProtocol.hpp: In instantiation of 'RTT::base::ChannelElementBase::shared_ptr YarpTemplateProtocol::createStream(RTT::base::PortInterface*, const RTT::ConnPolicy&, bool) const [with T = int; RTT::base::ChannelElementBase::shared_ptr = boost::intrusive_ptr]': /local/robotpkg/var/tmp/robotpkg/wip/orocos-yarp_transport/work/orocos-yarp_transport-20150316/transport/YarpTransport.cpp:72:1: required from here /local/robotpkg/var/tmp/robotpkg/wip/orocos-yarp_transport/work/orocos-yarp_transport-20150316/transport/YarpTemplateProtocol.hpp:38:24: warning: 'void RTT::base::ChannelElementBase::setOutput(const shared_ptr&)' is deprecated (declared at /opt/openrobots/include/rtt/types/../base/ChannelElementBase.hpp:256) [-Wdeprecated-declarations] yarp->setOutput(buf); ^ In file included from /local/robotpkg/var/tmp/robotpkg/wip/orocos-yarp_transport/work/orocos-yarp_transport-20150316/transport/YarpTransport.cpp:25:0: /local/robotpkg/var/tmp/robotpkg/wip/orocos-yarp_transport/work/orocos-yarp_transport-20150316/transport/YarpChannelElement.hpp: In instantiation of 'class YarpChannelElement': /local/robotpkg/var/tmp/robotpkg/wip/orocos-yarp_transport/work/orocos-yarp_transport-20150316/transport/YarpTemplateProtocol.hpp:33:102: required from 'RTT::base::ChannelElementBase::shared_ptr YarpTemplateProtocol::createStream(RTT::base::PortInterface*, const RTT::ConnPolicy&, bool) const [with T = float; RTT::base::ChannelElementBase::shared_ptr = boost::intrusive_ptr]' /local/robotpkg/var/tmp/robotpkg/wip/orocos-yarp_transport/work/orocos-yarp_transport-20150316/transport/YarpTransport.cpp:72:1: required from here /local/robotpkg/var/tmp/robotpkg/wip/orocos-yarp_transport/work/orocos-yarp_transport-20150316/transport/YarpChannelElement.hpp:121:7: error: conflicting return type specified for 'bool YarpChannelElement::write(typename RTT::base::ChannelElement::param_t) [with T = float; typename RTT::base::ChannelElement::param_t = const float]' bool write(typename RTT::base::ChannelElement::param_t sample) { ^ In file included from /opt/openrobots/include/rtt/types/../internal/SharedConnection.hpp:42:0, from /opt/openrobots/include/rtt/types/TypeInfo.hpp:45, from /opt/openrobots/include/rtt/types/Types.hpp:41, from /opt/openrobots/include/rtt/types/TransportPlugin.hpp:38, from /local/robotpkg/var/tmp/robotpkg/wip/orocos-yarp_transport/work/orocos-yarp_transport-20150316/transport/YarpTransport.cpp:21: /opt/openrobots/include/rtt/types/../internal/../base/ChannelElement.hpp:105:29: error: overriding 'RTT::WriteStatus RTT::base::ChannelElement::write(RTT::base::ChannelElement::param_t) [with T = float; RTT::base::ChannelElement::param_t = const float]' virtual WriteStatus write(param_t sample) ^ In file included from /local/robotpkg/var/tmp/robotpkg/wip/orocos-yarp_transport/work/orocos-yarp_transport-20150316/transport/YarpTransport.cpp:26:0: /local/robotpkg/var/tmp/robotpkg/wip/orocos-yarp_transport/work/orocos-yarp_transport-20150316/transport/YarpTemplateProtocol.hpp: In instantiation of 'RTT::base::ChannelElementBase::shared_ptr YarpTemplateProtocol::createStream(RTT::base::PortInterface*, const RTT::ConnPolicy&, bool) const [with T = float; RTT::base::ChannelElementBase::shared_ptr = boost::intrusive_ptr]': /local/robotpkg/var/tmp/robotpkg/wip/orocos-yarp_transport/work/orocos-yarp_transport-20150316/transport/YarpTransport.cpp:72:1: required from here /local/robotpkg/var/tmp/robotpkg/wip/orocos-yarp_transport/work/orocos-yarp_transport-20150316/transport/YarpTemplateProtocol.hpp:38:24: warning: 'void RTT::base::ChannelElementBase::setOutput(const shared_ptr&)' is deprecated (declared at /opt/openrobots/include/rtt/types/../base/ChannelElementBase.hpp:256) [-Wdeprecated-declarations] yarp->setOutput(buf); ^ In file included from /local/robotpkg/var/tmp/robotpkg/wip/orocos-yarp_transport/work/orocos-yarp_transport-20150316/transport/YarpTransport.cpp:25:0: /local/robotpkg/var/tmp/robotpkg/wip/orocos-yarp_transport/work/orocos-yarp_transport-20150316/transport/YarpChannelElement.hpp: In instantiation of 'class YarpChannelElement': /local/robotpkg/var/tmp/robotpkg/wip/orocos-yarp_transport/work/orocos-yarp_transport-20150316/transport/YarpTemplateProtocol.hpp:33:102: required from 'RTT::base::ChannelElementBase::shared_ptr YarpTemplateProtocol::createStream(RTT::base::PortInterface*, const RTT::ConnPolicy&, bool) const [with T = double; RTT::base::ChannelElementBase::shared_ptr = boost::intrusive_ptr]' /local/robotpkg/var/tmp/robotpkg/wip/orocos-yarp_transport/work/orocos-yarp_transport-20150316/transport/YarpTransport.cpp:72:1: required from here /local/robotpkg/var/tmp/robotpkg/wip/orocos-yarp_transport/work/orocos-yarp_transport-20150316/transport/YarpChannelElement.hpp:121:7: error: conflicting return type specified for 'bool YarpChannelElement::write(typename RTT::base::ChannelElement::param_t) [with T = double; typename RTT::base::ChannelElement::param_t = const double]' bool write(typename RTT::base::ChannelElement::param_t sample) { ^ In file included from /opt/openrobots/include/rtt/types/../internal/SharedConnection.hpp:42:0, from /opt/openrobots/include/rtt/types/TypeInfo.hpp:45, from /opt/openrobots/include/rtt/types/Types.hpp:41, from /opt/openrobots/include/rtt/types/TransportPlugin.hpp:38, from /local/robotpkg/var/tmp/robotpkg/wip/orocos-yarp_transport/work/orocos-yarp_transport-20150316/transport/YarpTransport.cpp:21: /opt/openrobots/include/rtt/types/../internal/../base/ChannelElement.hpp:105:29: error: overriding 'RTT::WriteStatus RTT::base::ChannelElement::write(RTT::base::ChannelElement::param_t) [with T = double; RTT::base::ChannelElement::param_t = const double]' virtual WriteStatus write(param_t sample) ^ In file included from /local/robotpkg/var/tmp/robotpkg/wip/orocos-yarp_transport/work/orocos-yarp_transport-20150316/transport/YarpTransport.cpp:26:0: /local/robotpkg/var/tmp/robotpkg/wip/orocos-yarp_transport/work/orocos-yarp_transport-20150316/transport/YarpTemplateProtocol.hpp: In instantiation of 'RTT::base::ChannelElementBase::shared_ptr YarpTemplateProtocol::createStream(RTT::base::PortInterface*, const RTT::ConnPolicy&, bool) const [with T = double; RTT::base::ChannelElementBase::shared_ptr = boost::intrusive_ptr]': /local/robotpkg/var/tmp/robotpkg/wip/orocos-yarp_transport/work/orocos-yarp_transport-20150316/transport/YarpTransport.cpp:72:1: required from here /local/robotpkg/var/tmp/robotpkg/wip/orocos-yarp_transport/work/orocos-yarp_transport-20150316/transport/YarpTemplateProtocol.hpp:38:24: warning: 'void RTT::base::ChannelElementBase::setOutput(const shared_ptr&)' is deprecated (declared at /opt/openrobots/include/rtt/types/../base/ChannelElementBase.hpp:256) [-Wdeprecated-declarations] yarp->setOutput(buf); ^ In file included from /local/robotpkg/var/tmp/robotpkg/wip/orocos-yarp_transport/work/orocos-yarp_transport-20150316/transport/YarpTransport.cpp:25:0: /local/robotpkg/var/tmp/robotpkg/wip/orocos-yarp_transport/work/orocos-yarp_transport-20150316/transport/YarpChannelElement.hpp: In instantiation of 'class YarpChannelElement': /local/robotpkg/var/tmp/robotpkg/wip/orocos-yarp_transport/work/orocos-yarp_transport-20150316/transport/YarpTemplateProtocol.hpp:33:102: required from 'RTT::base::ChannelElementBase::shared_ptr YarpTemplateProtocol::createStream(RTT::base::PortInterface*, const RTT::ConnPolicy&, bool) const [with T = char; RTT::base::ChannelElementBase::shared_ptr = boost::intrusive_ptr]' /local/robotpkg/var/tmp/robotpkg/wip/orocos-yarp_transport/work/orocos-yarp_transport-20150316/transport/YarpTransport.cpp:72:1: required from here /local/robotpkg/var/tmp/robotpkg/wip/orocos-yarp_transport/work/orocos-yarp_transport-20150316/transport/YarpChannelElement.hpp:121:7: error: conflicting return type specified for 'bool YarpChannelElement::write(typename RTT::base::ChannelElement::param_t) [with T = char; typename RTT::base::ChannelElement::param_t = const char]' bool write(typename RTT::base::ChannelElement::param_t sample) { ^ In file included from /opt/openrobots/include/rtt/types/../internal/SharedConnection.hpp:42:0, from /opt/openrobots/include/rtt/types/TypeInfo.hpp:45, from /opt/openrobots/include/rtt/types/Types.hpp:41, from /opt/openrobots/include/rtt/types/TransportPlugin.hpp:38, from /local/robotpkg/var/tmp/robotpkg/wip/orocos-yarp_transport/work/orocos-yarp_transport-20150316/transport/YarpTransport.cpp:21: /opt/openrobots/include/rtt/types/../internal/../base/ChannelElement.hpp:105:29: error: overriding 'RTT::WriteStatus RTT::base::ChannelElement::write(RTT::base::ChannelElement::param_t) [with T = char; RTT::base::ChannelElement::param_t = const char]' virtual WriteStatus write(param_t sample) ^ In file included from /local/robotpkg/var/tmp/robotpkg/wip/orocos-yarp_transport/work/orocos-yarp_transport-20150316/transport/YarpTransport.cpp:26:0: /local/robotpkg/var/tmp/robotpkg/wip/orocos-yarp_transport/work/orocos-yarp_transport-20150316/transport/YarpTemplateProtocol.hpp: In instantiation of 'RTT::base::ChannelElementBase::shared_ptr YarpTemplateProtocol::createStream(RTT::base::PortInterface*, const RTT::ConnPolicy&, bool) const [with T = char; RTT::base::ChannelElementBase::shared_ptr = boost::intrusive_ptr]': /local/robotpkg/var/tmp/robotpkg/wip/orocos-yarp_transport/work/orocos-yarp_transport-20150316/transport/YarpTransport.cpp:72:1: required from here /local/robotpkg/var/tmp/robotpkg/wip/orocos-yarp_transport/work/orocos-yarp_transport-20150316/transport/YarpTemplateProtocol.hpp:38:24: warning: 'void RTT::base::ChannelElementBase::setOutput(const shared_ptr&)' is deprecated (declared at /opt/openrobots/include/rtt/types/../base/ChannelElementBase.hpp:256) [-Wdeprecated-declarations] yarp->setOutput(buf); ^ In file included from /local/robotpkg/var/tmp/robotpkg/wip/orocos-yarp_transport/work/orocos-yarp_transport-20150316/transport/YarpTransport.cpp:25:0: /local/robotpkg/var/tmp/robotpkg/wip/orocos-yarp_transport/work/orocos-yarp_transport-20150316/transport/YarpChannelElement.hpp: In instantiation of 'class YarpChannelElement': /local/robotpkg/var/tmp/robotpkg/wip/orocos-yarp_transport/work/orocos-yarp_transport-20150316/transport/YarpTemplateProtocol.hpp:33:102: required from 'RTT::base::ChannelElementBase::shared_ptr YarpTemplateProtocol::createStream(RTT::base::PortInterface*, const RTT::ConnPolicy&, bool) const [with T = bool; RTT::base::ChannelElementBase::shared_ptr = boost::intrusive_ptr]' /local/robotpkg/var/tmp/robotpkg/wip/orocos-yarp_transport/work/orocos-yarp_transport-20150316/transport/YarpTransport.cpp:72:1: required from here /local/robotpkg/var/tmp/robotpkg/wip/orocos-yarp_transport/work/orocos-yarp_transport-20150316/transport/YarpChannelElement.hpp:121:7: error: conflicting return type specified for 'bool YarpChannelElement::write(typename RTT::base::ChannelElement::param_t) [with T = bool; typename RTT::base::ChannelElement::param_t = const bool]' bool write(typename RTT::base::ChannelElement::param_t sample) { ^ In file included from /opt/openrobots/include/rtt/types/../internal/SharedConnection.hpp:42:0, from /opt/openrobots/include/rtt/types/TypeInfo.hpp:45, from /opt/openrobots/include/rtt/types/Types.hpp:41, from /opt/openrobots/include/rtt/types/TransportPlugin.hpp:38, from /local/robotpkg/var/tmp/robotpkg/wip/orocos-yarp_transport/work/orocos-yarp_transport-20150316/transport/YarpTransport.cpp:21: /opt/openrobots/include/rtt/types/../internal/../base/ChannelElement.hpp:105:29: error: overriding 'RTT::WriteStatus RTT::base::ChannelElement::write(RTT::base::ChannelElement::param_t) [with T = bool; RTT::base::ChannelElement::param_t = const bool]' virtual WriteStatus write(param_t sample) ^ In file included from /local/robotpkg/var/tmp/robotpkg/wip/orocos-yarp_transport/work/orocos-yarp_transport-20150316/transport/YarpTransport.cpp:26:0: /local/robotpkg/var/tmp/robotpkg/wip/orocos-yarp_transport/work/orocos-yarp_transport-20150316/transport/YarpTemplateProtocol.hpp: In instantiation of 'RTT::base::ChannelElementBase::shared_ptr YarpTemplateProtocol::createStream(RTT::base::PortInterface*, const RTT::ConnPolicy&, bool) const [with T = bool; RTT::base::ChannelElementBase::shared_ptr = boost::intrusive_ptr]': /local/robotpkg/var/tmp/robotpkg/wip/orocos-yarp_transport/work/orocos-yarp_transport-20150316/transport/YarpTransport.cpp:72:1: required from here /local/robotpkg/var/tmp/robotpkg/wip/orocos-yarp_transport/work/orocos-yarp_transport-20150316/transport/YarpTemplateProtocol.hpp:38:24: warning: 'void RTT::base::ChannelElementBase::setOutput(const shared_ptr&)' is deprecated (declared at /opt/openrobots/include/rtt/types/../base/ChannelElementBase.hpp:256) [-Wdeprecated-declarations] yarp->setOutput(buf); ^ In file included from /local/robotpkg/var/tmp/robotpkg/wip/orocos-yarp_transport/work/orocos-yarp_transport-20150316/transport/YarpTransport.cpp:25:0: /local/robotpkg/var/tmp/robotpkg/wip/orocos-yarp_transport/work/orocos-yarp_transport-20150316/transport/YarpChannelElement.hpp: In instantiation of 'class YarpChannelElement >': /local/robotpkg/var/tmp/robotpkg/wip/orocos-yarp_transport/work/orocos-yarp_transport-20150316/transport/YarpTemplateProtocol.hpp:33:102: required from 'RTT::base::ChannelElementBase::shared_ptr YarpTemplateProtocol::createStream(RTT::base::PortInterface*, const RTT::ConnPolicy&, bool) const [with T = std::vector; RTT::base::ChannelElementBase::shared_ptr = boost::intrusive_ptr]' /local/robotpkg/var/tmp/robotpkg/wip/orocos-yarp_transport/work/orocos-yarp_transport-20150316/transport/YarpTransport.cpp:72:1: required from here /local/robotpkg/var/tmp/robotpkg/wip/orocos-yarp_transport/work/orocos-yarp_transport-20150316/transport/YarpChannelElement.hpp:121:7: error: conflicting return type specified for 'bool YarpChannelElement::write(typename RTT::base::ChannelElement::param_t) [with T = std::vector; typename RTT::base::ChannelElement::param_t = const std::vector&]' bool write(typename RTT::base::ChannelElement::param_t sample) { ^ In file included from /opt/openrobots/include/rtt/types/../internal/SharedConnection.hpp:42:0, from /opt/openrobots/include/rtt/types/TypeInfo.hpp:45, from /opt/openrobots/include/rtt/types/Types.hpp:41, from /opt/openrobots/include/rtt/types/TransportPlugin.hpp:38, from /local/robotpkg/var/tmp/robotpkg/wip/orocos-yarp_transport/work/orocos-yarp_transport-20150316/transport/YarpTransport.cpp:21: /opt/openrobots/include/rtt/types/../internal/../base/ChannelElement.hpp:105:29: error: overriding 'RTT::WriteStatus RTT::base::ChannelElement::write(RTT::base::ChannelElement::param_t) [with T = std::vector; RTT::base::ChannelElement::param_t = const std::vector&]' virtual WriteStatus write(param_t sample) ^ In file included from /local/robotpkg/var/tmp/robotpkg/wip/orocos-yarp_transport/work/orocos-yarp_transport-20150316/transport/YarpTransport.cpp:26:0: /local/robotpkg/var/tmp/robotpkg/wip/orocos-yarp_transport/work/orocos-yarp_transport-20150316/transport/YarpTemplateProtocol.hpp: In instantiation of 'RTT::base::ChannelElementBase::shared_ptr YarpTemplateProtocol::createStream(RTT::base::PortInterface*, const RTT::ConnPolicy&, bool) const [with T = std::vector; RTT::base::ChannelElementBase::shared_ptr = boost::intrusive_ptr]': /local/robotpkg/var/tmp/robotpkg/wip/orocos-yarp_transport/work/orocos-yarp_transport-20150316/transport/YarpTransport.cpp:72:1: required from here /local/robotpkg/var/tmp/robotpkg/wip/orocos-yarp_transport/work/orocos-yarp_transport-20150316/transport/YarpTemplateProtocol.hpp:38:24: warning: 'void RTT::base::ChannelElementBase::setOutput(const shared_ptr&)' is deprecated (declared at /opt/openrobots/include/rtt/types/../base/ChannelElementBase.hpp:256) [-Wdeprecated-declarations] yarp->setOutput(buf); ^ CMakeFiles/yarp-transport.dir/build.make:57: recipe for target 'CMakeFiles/yarp-transport.dir/transport/YarpTransport.cpp.o' failed make[2]: Leaving directory '/local/robotpkg/var/tmp/robotpkg/wip/orocos-yarp_transport/work/orocos-yarp_transport-20150316' CMakeFiles/Makefile2:164: recipe for target 'CMakeFiles/yarp-transport.dir/all' failed make[2]: *** [CMakeFiles/yarp-transport.dir/transport/YarpTransport.cpp.o] Error 1 make[1]: *** [CMakeFiles/yarp-transport.dir/all] Error 2 make[1]: *** Waiting for unfinished jobs.... Linking CXX shared library orocos/gnulinux/yarp/plugins/libyarp-service-gnulinux.so /usr/bin/cmake -E cmake_link_script CMakeFiles/yarp-service.dir/link.txt --verbose=1 /usr/bin/g++ -fPIC -pipe -O3 -DNDEBUG -Wl,-z,defs -shared -Wl,-soname,libyarp-service-gnulinux.so -o orocos/gnulinux/yarp/plugins/libyarp-service-gnulinux.so CMakeFiles/yarp-service.dir/service/Yarp-service.cpp.o /opt/openrobots/lib/liborocos-rtt-gnulinux.so.2.9.0 -lboost_filesystem -lboost_system -lboost_serialization -lxerces-c -lpthread -lrt -ldl -Wl,-rpath,/opt/openrobots/lib::::::::::::::::::::::::::::::::::::::::::::::::::::::::::::::::::::::::::::::::::::::::::::::::::::::::::::::::::::::::::::::::::::::::::::::::::::::::::::::::::::::::::::::::::::::::::::::::::::::::::::::::::::::::::::::::::::::::::::::::::::::::::::::::::: make[2]: Leaving directory '/local/robotpkg/var/tmp/robotpkg/wip/orocos-yarp_transport/work/orocos-yarp_transport-20150316' /usr/bin/cmake -E cmake_progress_report /local/robotpkg/var/tmp/robotpkg/wip/orocos-yarp_transport/work/orocos-yarp_transport-20150316/CMakeFiles 1 [100%] Built target yarp-service make[1]: Leaving directory '/local/robotpkg/var/tmp/robotpkg/wip/orocos-yarp_transport/work/orocos-yarp_transport-20150316' Makefile:120: recipe for target 'all' failed make: *** [all] Error 2