robotpkg/wip/orocos-dot_service bulk build results

Log for orocos-dot_service-20120308 on Ubuntu-16.04-x86_64: build.log (Back)

--- Environment --- LOWER_ARCH=x86_64 OPSYS=Ubuntu GZIP_CMD=/bin/gzip _override_vars_pkgtools_pkg_install=PKGREQD PKGREQD PKGREQD LC_TIME=C OS_KERNEL_VERSION=4.4.0-145-generic PKGREPO2DEB=/local/robotpkg/sbin/pkgrepo2deb BULKBASE=/opt/openrobots ECHO_N=echo -n _overrides_pkgtools_pkg_install_PKGREQD=pkg_install>=20110805.9 pkg_install>=20110805.9 pkg_install>=20110805.9 OS_VERSION=16.04 _override_vars_devel_boost_headers=PKGREQD PKGREQD PKGREQD ROBOTPKG_BASE=/local/robotpkg OLDPWD=/local/robotpkg/var/lib/robotpkg/wip/sot-torque-control _override_vars_pkgtools_tnftp=PKGREQD PKGREQD _overrides_devel_boost_headers_PKGREQD=boost-headers>=1.46.1 boost-headers>=1.46.1 boost-headers>=1.46.1 PKG_DBDIR=/opt/openrobots/var/db/robotpkg hline="$bf======================================================================$rm" MACHINE_ARCH=x86_64 _overrides_pkgtools_tnftp_PKGREQD=tnftp>=20130505~ssl tnftp>=20130505~ssl FC=false LC_CTYPE=C EXPECT_TARGETS=fetch install package LC_MONETARY=C _override_vars_devel_boost_libs=PKGREQD PKGREQD PKGREQD PKGREQD PKGREQD PKGREQD PKGREQD PKGREQD PKGREQD PKGREQD PKGREQD PKGREQD MAKEFLAGS= --no-print-directory -- PKGREQD.cmdline=orocos-dot_service-20120308 RECURSIVE_PKGPATH=wip/orocos-dot_service\ tag=Ubuntu-16.04-x86_64 BULK_LOGDIR=/local/robotpkg/var/log/bulk BULKBASE=/opt/openrobots LOCALBASE=/opt/openrobots PKG_DBDIR=/opt/openrobots/var/db/robotpkg EXPECT_TARGETS=fetch\ install\ package _override_vars_pkgtools_digest=PKGREQD PKGREQD CPP=/usr/bin/gcc -E LOWER_OPSYS=ubuntu _overrides_devel_boost_libs_PKGREQD=boost-libs>=1.46.1 boost-libs>=1.46.1 boost-libs>=1.46.1 boost-libs>=1.46.1 boost-libs>=1.46.1 boost-libs>=1.46.1 boost-libs>=1.46.1 boost-libs>=1.46.1 boost-libs>=1.46.1 boost-libs>=1.46.1 boost-libs>=1.46.1 boost-libs>=1.46.1 bf= _override_vars_pkgtools_pkgrepo2deb=PKGREQD PKGREQD _overrides_pkgtools_digest_PKGREQD=digest>=20080510 digest>=20080510 GCC=/usr/bin/gcc DIGEST=/opt/openrobots/sbin/robotpkg_digest _override_vars_wip_orocos_dot_service=PKGREQD TAR=/bin/tar LOWER_OS_VERSION=16.04 MACHINE_KERNEL=Linux-4.4.0-145-generic-x86_64 _overrides_pkgtools_pkgrepo2deb_PKGREQD=pkgrepo2deb>=1.5 pkgrepo2deb>=1.5 OWNER_GID=robots PKGTOOLS_VERSION=20110805.9 _overrides_wip_orocos_dot_service_PKGREQD=orocos-dot_service-20120308 RECURSIVE_PKGPATH=wip/orocos-dot_service GXX=/usr/bin/g++ MAKECONF=/opt/robotpkg/etc/robotpkg-wip.conf _override_vars_archivers_pax=PKGREQD PKGREQD rm= LC_COLLATE=C OS_KERNEL=Linux ROBOTPKG_TRUSTED_ENV=robotpkg PATH=/usr/local/sbin:/usr/local/bin:/usr/sbin:/usr/bin:/sbin:/bin _overrides_archivers_pax_PKGREQD=pax pax CXXCPP=/usr/bin/g++ -E CMAKE=/usr/bin/cmake _override_vars_middleware_orocos_rtt=PKGREQD PKGREQD PKGREQD MAKELEVEL=4 DEB_HOST_MULTIARCH=x86_64-linux-gnu MACHINE_PLATFORM=Ubuntu-16.04-x86_64 _overrides_middleware_orocos_rtt_PKGREQD=orocos-rtt>=2 orocos-rtt>=2 orocos-rtt>=2 ROBOTPKG_DIR=/local/robotpkg/var/lib/robotpkg TNFTP=/opt/openrobots/sbin/tnftp LANG=C MAKEOVERRIDES=PKGREQD.cmdline=orocos-dot_service-20120308 RECURSIVE_PKGPATH=wip/orocos-dot_service\ tag=Ubuntu-16.04-x86_64 BULK_LOGDIR=/local/robotpkg/var/log/bulk BULKBASE=/opt/openrobots LOCALBASE=/opt/openrobots PKG_DBDIR=/opt/openrobots/var/db/robotpkg EXPECT_TARGETS=fetch\ install\ package LC_MESSAGES=C tag=Ubuntu-16.04-x86_64 CXX=/usr/bin/g++ LOCALBASE=/opt/openrobots OWNER_UID=rbulk BULK_LOGDIR=/local/robotpkg/var/log/bulk ZCAT=/bin/zcat PAX=/bin/pax LOWER_OS_KERNEL=linux GPG=/usr/bin/gpg --homedir=/opt/robotpkg/etc/gnupg PWD=/local/robotpkg/var/lib/robotpkg/wip/orocos-dot_service _ROBOTPKG_NOW=0413010757 LC_NUMERIC=C CC=/usr/bin/gcc MFLAGS=--no-print-directory NODENAME=fluffy64-ubuntu1604 --- Running set -e; \ cd /local/robotpkg/var/tmp/robotpkg/wip/orocos-dot_service/work/rtt_dot_service-rtt_dot_service && cd /local/robotpkg/var/tmp/robotpkg/wip/orocos-dot_service/work/rtt_dot_service-rtt_dot_service && /usr/bin/env MAKELEVEL= MAKEOVERRIDES= MAKEFLAGS= MFLAGS= 'CPPFLAGS=' 'CFLAGS=-pipe -O3 -DNDEBUG' 'LDFLAGS=' 'CXXFLAGS=-pipe -O3 -DNDEBUG' PREFIX='/opt/openrobots' HOME=/local/robotpkg/var/tmp/robotpkg/wip/orocos-dot_service/work PATH='/opt/openrobots/sbin:/usr/local/sbin:/usr/local/bin:/usr/sbin:/usr/bin:/sbin:/bin' LD_LIBRARY_PATH='' LOCALBASE=/opt/openrobots PKGMANDIR=man make -j4 -f Makefile all; /usr/bin/cmake -H/local/robotpkg/var/tmp/robotpkg/wip/orocos-dot_service/work/rtt_dot_service-rtt_dot_service -B/local/robotpkg/var/tmp/robotpkg/wip/orocos-dot_service/work/rtt_dot_service-rtt_dot_service --check-build-system CMakeFiles/Makefile.cmake 0 /usr/bin/cmake -E cmake_progress_start /local/robotpkg/var/tmp/robotpkg/wip/orocos-dot_service/work/rtt_dot_service-rtt_dot_service/CMakeFiles /local/robotpkg/var/tmp/robotpkg/wip/orocos-dot_service/work/rtt_dot_service-rtt_dot_service/CMakeFiles/progress.marks make -f CMakeFiles/Makefile2 all make[1]: Entering directory '/local/robotpkg/var/tmp/robotpkg/wip/orocos-dot_service/work/rtt_dot_service-rtt_dot_service' make -f CMakeFiles/rtt_dot_service.dir/build.make CMakeFiles/rtt_dot_service.dir/depend make[2]: Entering directory '/local/robotpkg/var/tmp/robotpkg/wip/orocos-dot_service/work/rtt_dot_service-rtt_dot_service' cd /local/robotpkg/var/tmp/robotpkg/wip/orocos-dot_service/work/rtt_dot_service-rtt_dot_service && /usr/bin/cmake -E cmake_depends "Unix Makefiles" /local/robotpkg/var/tmp/robotpkg/wip/orocos-dot_service/work/rtt_dot_service-rtt_dot_service /local/robotpkg/var/tmp/robotpkg/wip/orocos-dot_service/work/rtt_dot_service-rtt_dot_service /local/robotpkg/var/tmp/robotpkg/wip/orocos-dot_service/work/rtt_dot_service-rtt_dot_service /local/robotpkg/var/tmp/robotpkg/wip/orocos-dot_service/work/rtt_dot_service-rtt_dot_service /local/robotpkg/var/tmp/robotpkg/wip/orocos-dot_service/work/rtt_dot_service-rtt_dot_service/CMakeFiles/rtt_dot_service.dir/DependInfo.cmake --color= Scanning dependencies of target rtt_dot_service make[2]: Leaving directory '/local/robotpkg/var/tmp/robotpkg/wip/orocos-dot_service/work/rtt_dot_service-rtt_dot_service' make -f CMakeFiles/rtt_dot_service.dir/build.make CMakeFiles/rtt_dot_service.dir/build make[2]: Entering directory '/local/robotpkg/var/tmp/robotpkg/wip/orocos-dot_service/work/rtt_dot_service-rtt_dot_service' [ 50%] Building CXX object CMakeFiles/rtt_dot_service.dir/src/rtt_dot_service.cpp.o /usr/bin/g++ -DOROCOS_TARGET=gnulinux -Drtt_dot_service_EXPORTS -I/opt/openrobots/include -I/opt/openrobots/include/orocos -pipe -O3 -DNDEBUG -fPIC -o CMakeFiles/rtt_dot_service.dir/src/rtt_dot_service.cpp.o -c /local/robotpkg/var/tmp/robotpkg/wip/orocos-dot_service/work/rtt_dot_service-rtt_dot_service/src/rtt_dot_service.cpp /local/robotpkg/var/tmp/robotpkg/wip/orocos-dot_service/work/rtt_dot_service-rtt_dot_service/src/rtt_dot_service.cpp: In member function 'virtual bool Dot::execute()': /local/robotpkg/var/tmp/robotpkg/wip/orocos-dot_service/work/rtt_dot_service-rtt_dot_service/src/rtt_dot_service.cpp:112:114: error: 'class RTT::internal::ConnectionManager' has no member named 'getChannels' std::list chns = tc->getPort(comp_ports[j])->getManager()->getChannels(); ^ CMakeFiles/rtt_dot_service.dir/build.make:65: recipe for target 'CMakeFiles/rtt_dot_service.dir/src/rtt_dot_service.cpp.o' failed make[2]: *** [CMakeFiles/rtt_dot_service.dir/src/rtt_dot_service.cpp.o] Error 1 make[2]: Leaving directory '/local/robotpkg/var/tmp/robotpkg/wip/orocos-dot_service/work/rtt_dot_service-rtt_dot_service' CMakeFiles/Makefile2:70: recipe for target 'CMakeFiles/rtt_dot_service.dir/all' failed make[1]: *** [CMakeFiles/rtt_dot_service.dir/all] Error 2 make[1]: Leaving directory '/local/robotpkg/var/tmp/robotpkg/wip/orocos-dot_service/work/rtt_dot_service-rtt_dot_service' Makefile:130: recipe for target 'all' failed make: *** [all] Error 2