robotpkg/wip/orocos-dot_service bulk build results

Log for orocos-dot_service-20120308 on Fedora-28-x86_64: bulk.log (Back)

=> Checking for clear installation ===> Installing bootstrap dependencies for orocos-dot_service-20120308 => Installing /opt/robotpkg/var/lib/robotpkg/packages/bsd/Fedora-28-x86_64/All/digest-20080510.tgz => Installing /opt/robotpkg/var/lib/robotpkg/packages/bsd/Fedora-28-x86_64/All/tnftp-20130505~ssl.tgz ===> Checking bootstrap dependencies for orocos-dot_service-20120308 => Required robotpkg package digest>=20080510: digest-20080510 found => Required robotpkg package tnftp>=20130505~ssl: tnftp-20130505~ssl found => Required system package gzip: gzip-1.9 found => Required system package pax and tar archivers: pax found => Required system package pkg_install>=20110805.9: pkg_install-20110805.9 found ===> Done bootstrap-depends for orocos-dot_service-20120308 ===> Installing full dependencies for orocos-dot_service-20120308 => Dependency digest-20080510 already installed => Installing /opt/robotpkg/var/lib/robotpkg/packages/bsd/Fedora-28-x86_64/All/orocos-rtt-2.9.0rc1.tgz => Dependency tnftp-20130505~ssl already installed ===> Checking build options for orocos-dot_service-20120308 => Building with no option. ===> Checking alternatives for orocos-dot_service-20120308 => Use the GNU C++ compiler: c++-compiler provided by g++>=3 => Use the GNU C compiler: c-compiler provided by gcc>=3 ===> Checking dependencies for orocos-dot_service-20120308 => Required system package boost-headers>=1.46.1: boost-headers-1.66 found => Required system package boostlib-filesystem>=1.46.1: boost-libs-1.66.0 found => Required system package boostlib-iostreams>=1.46.1: boost-libs-1.66.0 found => Required system package boostlib-math>=1.46.1: boost-libs-1.66.0 found => Required system package boostlib-thread>=1.46.1: boost-libs-1.66.0 found => Required system package cmake>=2.6: cmake-3.14.1 found => Required system package g++>=3: g++-8 found => Required system package gcc>=3: gcc-8 found => Required system package graphviz>=2: graphviz-2.40.1 found => Required system package libstdc++: libstdc++ found => Required robotpkg package orocos-rtt>=2: orocos-rtt-2.9.0rc1 found ===> Done depends for orocos-dot_service-20120308 ===> Extracting for orocos-dot_service-20120308 => SHA1 checksums OK => RMD160 checksums OK ===> Configuring for orocos-dot_service-20120308 ===> Building for orocos-dot_service-20120308 /local/robotpkg/var/tmp/robotpkg/wip/orocos-dot_service/work/rtt_dot_service-rtt_dot_service/src/rtt_dot_service.cpp: In member function 'virtual bool Dot::execute()': /local/robotpkg/var/tmp/robotpkg/wip/orocos-dot_service/work/rtt_dot_service-rtt_dot_service/src/rtt_dot_service.cpp:112:114: error: 'class RTT::internal::ConnectionManager' has no member named 'getChannels'; did you mean 'getConnections'? std::list chns = tc->getPort(comp_ports[j])->getManager()->getChannels(); ^~~~~~~~~~~ getConnections make[2]: *** [CMakeFiles/rtt_dot_service.dir/build.make:66: CMakeFiles/rtt_dot_service.dir/src/rtt_dot_service.cpp.o] Error 1 make[1]: *** [CMakeFiles/Makefile2:108: CMakeFiles/rtt_dot_service.dir/all] Error 2 make: *** [Makefile:133: all] Error 2 An unexpected error occured. The last 10 log lines are shown below. | /local/robotpkg/var/tmp/robotpkg/wip/orocos-dot_service/work/rtt_dot_service-rtt_dot_service/src/rtt_dot_service.cpp: In member function 'virtual bool Dot::execute()': | /local/robotpkg/var/tmp/robotpkg/wip/orocos-dot_service/work/rtt_dot_service-rtt_dot_service/src/rtt_dot_service.cpp:112:114: error: 'class RTT::internal::ConnectionManager' has no member named 'getChannels'; did you mean 'getConnections'? | std::list chns = tc->getPort(comp_ports[j])->getManager()->getChannels(); | ^~~~~~~~~~~ | getConnections | make[2]: *** [CMakeFiles/rtt_dot_service.dir/build.make:66: CMakeFiles/rtt_dot_service.dir/src/rtt_dot_service.cpp.o] Error 1 | make[2]: Leaving directory '/local/robotpkg/var/tmp/robotpkg/wip/orocos-dot_service/work/rtt_dot_service-rtt_dot_service' | make[1]: *** [CMakeFiles/Makefile2:108: CMakeFiles/rtt_dot_service.dir/all] Error 2 | make[1]: Leaving directory '/local/robotpkg/var/tmp/robotpkg/wip/orocos-dot_service/work/rtt_dot_service-rtt_dot_service' | make: *** [Makefile:133: all] Error 2 For details or bug reports, check the complete log file in: /local/robotpkg/var/tmp/robotpkg/wip/orocos-dot_service/work/build.log make[3]: *** [/local/robotpkg/var/lib/robotpkg/mk/build/build.mk:199: do-build] Error 2 make[2]: *** [/local/robotpkg/var/lib/robotpkg/mk/pkg/package.mk:42: pkg-check-installed] Error 2 => Marking orocos-dot_service-20120308 as broken ERROR: make: *** [package] Error 2 ===> Deinstalling for orocos-dot_service Removed digest-20080510 Removed orocos-rtt-2.9.0rc1 Removed tnftp-20130505~ssl