robotpkg/wip/orocos-dot_service bulk build results

Log for orocos-dot_service-20120308 on Fedora-28-x86_64: build.log (Back)

--- Environment --- tag=Fedora-28-x86_64 LC_MONETARY=C LOWER_OPSYS=fedora LANG=C OS_VERSION=28 PKGTOOLS_VERSION=20110805.9 _override_vars_archivers_pax=PKGREQD PKGREQD BULK_LOGDIR=/local/robotpkg/var/log/bulk GXX=/usr/bin/g++ OLDPWD=/local/robotpkg/var/lib/robotpkg/wip/py-crocoddyl TAR=/usr/bin/tar MACHINE_KERNEL=Linux-5.0.6-100.fc28.x86_64-x86_64 _override_vars_devel_boost_libs=PKGREQD PKGREQD PKGREQD PKGREQD PKGREQD PKGREQD PKGREQD PKGREQD PKGREQD PKGREQD PKGREQD PKGREQD _override_vars_pkgtools_digest=PKGREQD PKGREQD OWNER_GID=robots TNFTP=/opt/openrobots/sbin/tnftp MAKECONF=/opt/robotpkg/etc/robotpkg-wip.conf _overrides_archivers_pax_PKGREQD=pax pax _overrides_pkgtools_tnftp_PKGREQD=tnftp>=20130505~ssl tnftp>=20130505~ssl MFLAGS=--no-print-directory _overrides_devel_boost_headers_PKGREQD=boost-headers>=1.46.1 boost-headers>=1.46.1 boost-headers>=1.46.1 EXPECT_TARGETS=fetch install package CC=/usr/bin/gcc ROBOTPKG_DIR=/local/robotpkg/var/lib/robotpkg LC_COLLATE=C _override_vars_devel_boost_headers=PKGREQD PKGREQD PKGREQD ROBOTPKG_BASE=/local/robotpkg MACHINE_PLATFORM=Fedora-28-x86_64 PWD=/local/robotpkg/var/lib/robotpkg/wip/orocos-dot_service _overrides_middleware_orocos_rtt_PKGREQD=orocos-rtt>=2 orocos-rtt>=2 orocos-rtt>=2 LC_CTYPE=C NODENAME=fluffy64-fedora28 OS_KERNEL_VERSION=5.0.6-100.fc28.x86_64 PKG_DBDIR=/opt/openrobots/var/db/robotpkg RECURSIVE_PKGPATH=wip/orocos-dot_service LOWER_OS_KERNEL=linux PAX=/usr/bin/pax OPSYS=Fedora _ROBOTPKG_NOW=0413010940 _overrides_pkgtools_digest_PKGREQD=digest>=20080510 digest>=20080510 bf= _override_vars_wip_orocos_dot_service=PKGREQD LC_NUMERIC=C OWNER_UID=rbulk _override_vars_pkgtools_tnftp=PKGREQD PKGREQD FC=false MACHINE_ARCH=x86_64 ECHO_N=echo -n BULKBASE=/opt/openrobots hline="$bf======================================================================$rm" _override_vars_pkgtools_pkg_install=PKGREQD PKGREQD PKGREQD CXX=/usr/bin/g++ LOCALBASE=/opt/openrobots MAKEOVERRIDES=PKGREQD.cmdline=orocos-dot_service-20120308 RECURSIVE_PKGPATH=wip/orocos-dot_service\ tag=Fedora-28-x86_64 BULK_LOGDIR=/local/robotpkg/var/log/bulk BULKBASE=/opt/openrobots LOCALBASE=/opt/openrobots PKG_DBDIR=/opt/openrobots/var/db/robotpkg EXPECT_TARGETS=fetch\ install\ package LC_MESSAGES=C _overrides_pkgtools_pkg_install_PKGREQD=pkg_install>=20110805.9 pkg_install>=20110805.9 pkg_install>=20110805.9 GZIP_CMD=/usr/bin/gzip MAKELEVEL=4 rm= SHLVL=4 LOWER_ARCH=x86_64 ZCAT=/usr/bin/zcat DIGEST=/opt/openrobots/sbin/robotpkg_digest CMAKE=/usr/bin/cmake _overrides_devel_boost_libs_PKGREQD=boost-libs>=1.46.1 boost-libs>=1.46.1 boost-libs>=1.46.1 boost-libs>=1.46.1 boost-libs>=1.46.1 boost-libs>=1.46.1 boost-libs>=1.46.1 boost-libs>=1.46.1 boost-libs>=1.46.1 boost-libs>=1.46.1 boost-libs>=1.46.1 boost-libs>=1.46.1 CXXCPP=/usr/bin/g++ -E LOWER_OS_VERSION=28 _override_vars_middleware_orocos_rtt=PKGREQD PKGREQD PKGREQD PATH=/usr/local/sbin:/usr/local/bin:/usr/sbin:/usr/bin ROBOTPKG_TRUSTED_ENV=robotpkg GCC=/usr/bin/gcc _overrides_wip_orocos_dot_service_PKGREQD=orocos-dot_service-20120308 MAKEFLAGS= --no-print-directory -- PKGREQD.cmdline=orocos-dot_service-20120308 RECURSIVE_PKGPATH=wip/orocos-dot_service\ tag=Fedora-28-x86_64 BULK_LOGDIR=/local/robotpkg/var/log/bulk BULKBASE=/opt/openrobots LOCALBASE=/opt/openrobots PKG_DBDIR=/opt/openrobots/var/db/robotpkg EXPECT_TARGETS=fetch\ install\ package OS_KERNEL=Linux CPP=/usr/bin/gcc -E LC_TIME=C _=/usr/bin/env --- Running set -e; \ cd /local/robotpkg/var/tmp/robotpkg/wip/orocos-dot_service/work/rtt_dot_service-rtt_dot_service && cd /local/robotpkg/var/tmp/robotpkg/wip/orocos-dot_service/work/rtt_dot_service-rtt_dot_service && /usr/bin/env MAKELEVEL= MAKEOVERRIDES= MAKEFLAGS= MFLAGS= 'CPPFLAGS=' 'CFLAGS=-pipe -O3 -DNDEBUG' 'LDFLAGS=' 'CXXFLAGS=-pipe -O3 -DNDEBUG' PREFIX='/opt/openrobots' HOME=/local/robotpkg/var/tmp/robotpkg/wip/orocos-dot_service/work PATH='/opt/openrobots/sbin:/usr/local/sbin:/usr/local/bin:/usr/sbin:/usr/bin' LD_LIBRARY_PATH='' LOCALBASE=/opt/openrobots PKGMANDIR=man make -j4 -f Makefile all; /usr/bin/cmake -S/local/robotpkg/var/tmp/robotpkg/wip/orocos-dot_service/work/rtt_dot_service-rtt_dot_service -B/local/robotpkg/var/tmp/robotpkg/wip/orocos-dot_service/work/rtt_dot_service-rtt_dot_service --check-build-system CMakeFiles/Makefile.cmake 0 /usr/bin/cmake -E cmake_progress_start /local/robotpkg/var/tmp/robotpkg/wip/orocos-dot_service/work/rtt_dot_service-rtt_dot_service/CMakeFiles /local/robotpkg/var/tmp/robotpkg/wip/orocos-dot_service/work/rtt_dot_service-rtt_dot_service/CMakeFiles/progress.marks make -f CMakeFiles/Makefile2 all make[1]: Entering directory '/local/robotpkg/var/tmp/robotpkg/wip/orocos-dot_service/work/rtt_dot_service-rtt_dot_service' make -f CMakeFiles/rtt_dot_service.dir/build.make CMakeFiles/rtt_dot_service.dir/depend make[2]: Entering directory '/local/robotpkg/var/tmp/robotpkg/wip/orocos-dot_service/work/rtt_dot_service-rtt_dot_service' cd /local/robotpkg/var/tmp/robotpkg/wip/orocos-dot_service/work/rtt_dot_service-rtt_dot_service && /usr/bin/cmake -E cmake_depends "Unix Makefiles" /local/robotpkg/var/tmp/robotpkg/wip/orocos-dot_service/work/rtt_dot_service-rtt_dot_service /local/robotpkg/var/tmp/robotpkg/wip/orocos-dot_service/work/rtt_dot_service-rtt_dot_service /local/robotpkg/var/tmp/robotpkg/wip/orocos-dot_service/work/rtt_dot_service-rtt_dot_service /local/robotpkg/var/tmp/robotpkg/wip/orocos-dot_service/work/rtt_dot_service-rtt_dot_service /local/robotpkg/var/tmp/robotpkg/wip/orocos-dot_service/work/rtt_dot_service-rtt_dot_service/CMakeFiles/rtt_dot_service.dir/DependInfo.cmake --color= Scanning dependencies of target rtt_dot_service make[2]: Leaving directory '/local/robotpkg/var/tmp/robotpkg/wip/orocos-dot_service/work/rtt_dot_service-rtt_dot_service' make -f CMakeFiles/rtt_dot_service.dir/build.make CMakeFiles/rtt_dot_service.dir/build make[2]: Entering directory '/local/robotpkg/var/tmp/robotpkg/wip/orocos-dot_service/work/rtt_dot_service-rtt_dot_service' [ 50%] Building CXX object CMakeFiles/rtt_dot_service.dir/src/rtt_dot_service.cpp.o /usr/bin/g++ -DOROCOS_TARGET=gnulinux -Drtt_dot_service_EXPORTS -I/opt/openrobots/include -I/opt/openrobots/include/orocos -pipe -O3 -DNDEBUG -fPIC -o CMakeFiles/rtt_dot_service.dir/src/rtt_dot_service.cpp.o -c /local/robotpkg/var/tmp/robotpkg/wip/orocos-dot_service/work/rtt_dot_service-rtt_dot_service/src/rtt_dot_service.cpp /local/robotpkg/var/tmp/robotpkg/wip/orocos-dot_service/work/rtt_dot_service-rtt_dot_service/src/rtt_dot_service.cpp: In member function 'virtual bool Dot::execute()': /local/robotpkg/var/tmp/robotpkg/wip/orocos-dot_service/work/rtt_dot_service-rtt_dot_service/src/rtt_dot_service.cpp:112:114: error: 'class RTT::internal::ConnectionManager' has no member named 'getChannels'; did you mean 'getConnections'? std::list chns = tc->getPort(comp_ports[j])->getManager()->getChannels(); ^~~~~~~~~~~ getConnections make[2]: *** [CMakeFiles/rtt_dot_service.dir/build.make:66: CMakeFiles/rtt_dot_service.dir/src/rtt_dot_service.cpp.o] Error 1 make[2]: Leaving directory '/local/robotpkg/var/tmp/robotpkg/wip/orocos-dot_service/work/rtt_dot_service-rtt_dot_service' make[1]: *** [CMakeFiles/Makefile2:108: CMakeFiles/rtt_dot_service.dir/all] Error 2 make[1]: Leaving directory '/local/robotpkg/var/tmp/robotpkg/wip/orocos-dot_service/work/rtt_dot_service-rtt_dot_service' make: *** [Makefile:133: all] Error 2